Fresnel Lens and Format Core Vocabulary
type: Ontology
creator: Chris Bizer <chris@bizer.de>
creator: Emmanuel Pietriga <emmanuel.pietriga@inria.fr>
creator: Ryan Lee <ryanlee@w3.org>
creator: Stefano Mazzocchi <stefanom@mit.edu>
date: 2005-03-11
description: OWL Full vocabulary for defining lenses and formats on RDF models.
format: RDF
version info: $Id: fresnel.rdf,v 1.2 2005/07/25 22:56:00 ryanlee Exp $

ClassList
type: Class
comment: This is a convenience class for the OWL specification of Fresnel (an rdf:List of resource selectors only).
subclass of: List
subclass of: http://lodlaundromat.org/.well-known/genid/731b8538f14b28384f16fff4bf46c647#1
subclass of: http://lodlaundromat.org/.well-known/genid/731b8538f14b28384f16fff4bf46c647#2

Convenience Token
type: Class
comment: Abstract class for expressing shorthands a browser must understand how to expand.
subclass of: Resource

Convenience Property
type: Class
comment: Abstract class of pseudo properties.
subclass of: Convenience Token

Format Class
type: Class
comment: A Fresnel format class for displaying RDF data; the domain property can be only one of :formatDomain, :classFormatDomain, :instanceFormatDomain.
subclass of: Resource
subclass of: http://lodlaundromat.org/.well-known/genid/731b8538f14b28384f16fff4bf46c647#6
subclass of: http://lodlaundromat.org/.well-known/genid/731b8538f14b28384f16fff4bf46c647#10
subclass of: http://lodlaundromat.org/.well-known/genid/731b8538f14b28384f16fff4bf46c647#11
subclass of: http://lodlaundromat.org/.well-known/genid/731b8538f14b28384f16fff4bf46c647#12
subclass of: http://lodlaundromat.org/.well-known/genid/731b8538f14b28384f16fff4bf46c647#13
subclass of: http://lodlaundromat.org/.well-known/genid/731b8538f14b28384f16fff4bf46c647#14
subclass of: http://lodlaundromat.org/.well-known/genid/731b8538f14b28384f16fff4bf46c647#15
subclass of: http://lodlaundromat.org/.well-known/genid/731b8538f14b28384f16fff4bf46c647#16
subclass of: http://lodlaundromat.org/.well-known/genid/731b8538f14b28384f16fff4bf46c647#17
subclass of: http://lodlaundromat.org/.well-known/genid/731b8538f14b28384f16fff4bf46c647#18
subclass of: http://lodlaundromat.org/.well-known/genid/731b8538f14b28384f16fff4bf46c647#19
subclass of: http://lodlaundromat.org/.well-known/genid/731b8538f14b28384f16fff4bf46c647#20
subclass of: http://lodlaundromat.org/.well-known/genid/731b8538f14b28384f16fff4bf46c647#21
subclass of: http://lodlaundromat.org/.well-known/genid/731b8538f14b28384f16fff4bf46c647#22
disjoint with: Lens

http://lodlaundromat.org/.well-known/genid/731b8538f14b28384f16fff4bf46c647#6
type: Restriction
all values from: http://lodlaundromat.org/.well-known/genid/731b8538f14b28384f16fff4bf46c647#7
min cardinality: 0
on property: property format domain

http://lodlaundromat.org/.well-known/genid/731b8538f14b28384f16fff4bf46c647#10
type: Restriction
all values from: Class
min cardinality: 0
on property: class format domain

http://lodlaundromat.org/.well-known/genid/731b8538f14b28384f16fff4bf46c647#11
type: Restriction
all values from: Resource
min cardinality: 0
on property: instance format domain

http://lodlaundromat.org/.well-known/genid/731b8538f14b28384f16fff4bf46c647#12
type: Restriction
all values from: Purpose
min cardinality: 0
on property: purpose

http://lodlaundromat.org/.well-known/genid/731b8538f14b28384f16fff4bf46c647#13
type: Restriction
all values from: Group
min cardinality: 0
on property: group

http://lodlaundromat.org/.well-known/genid/731b8538f14b28384f16fff4bf46c647#14
type: Restriction
all values from: Property value display style
max cardinality: 1
min cardinality: 0
on property: property value

http://lodlaundromat.org/.well-known/genid/731b8538f14b28384f16fff4bf46c647#15
type: Restriction
max cardinality: 1
min cardinality: 0
on property: label

http://lodlaundromat.org/.well-known/genid/731b8538f14b28384f16fff4bf46c647#16
type: Restriction
all values from: string
max cardinality: 1
min cardinality: 0
on property: property style

http://lodlaundromat.org/.well-known/genid/731b8538f14b28384f16fff4bf46c647#17
type: Restriction
all values from: string
max cardinality: 1
min cardinality: 0
on property: value style

http://lodlaundromat.org/.well-known/genid/731b8538f14b28384f16fff4bf46c647#18
type: Restriction
all values from: string
max cardinality: 1
min cardinality: 0
on property: label style

http://lodlaundromat.org/.well-known/genid/731b8538f14b28384f16fff4bf46c647#19
type: Restriction
all values from: Format Description No Substitution
max cardinality: 1
min cardinality: 0
on property: resource format

http://lodlaundromat.org/.well-known/genid/731b8538f14b28384f16fff4bf46c647#20
type: Restriction
all values from: Format Description Substitution
max cardinality: 1
min cardinality: 0
on property: property format

http://lodlaundromat.org/.well-known/genid/731b8538f14b28384f16fff4bf46c647#21
type: Restriction
all values from: Format Description No Substitution
max cardinality: 1
min cardinality: 0
on property: value format

http://lodlaundromat.org/.well-known/genid/731b8538f14b28384f16fff4bf46c647#22
type: Restriction
all values from: Format Description Substitution
max cardinality: 1
min cardinality: 0
on property: label format

Format Description
type: Class
comment: Description of fresnel:Format content separators; super class, not to be used directly.
subclass of: Resource
subclass of: http://lodlaundromat.org/.well-known/genid/731b8538f14b28384f16fff4bf46c647#23
subclass of: http://lodlaundromat.org/.well-known/genid/731b8538f14b28384f16fff4bf46c647#24
subclass of: http://lodlaundromat.org/.well-known/genid/731b8538f14b28384f16fff4bf46c647#25
subclass of: http://lodlaundromat.org/.well-known/genid/731b8538f14b28384f16fff4bf46c647#26

http://lodlaundromat.org/.well-known/genid/731b8538f14b28384f16fff4bf46c647#23
type: Restriction
all values from: string
max cardinality: 1
min cardinality: 0
on property: content before

http://lodlaundromat.org/.well-known/genid/731b8538f14b28384f16fff4bf46c647#24
type: Restriction
all values from: string
max cardinality: 1
min cardinality: 0
on property: content after

http://lodlaundromat.org/.well-known/genid/731b8538f14b28384f16fff4bf46c647#25
type: Restriction
all values from: string
max cardinality: 1
min cardinality: 0
on property: content first

http://lodlaundromat.org/.well-known/genid/731b8538f14b28384f16fff4bf46c647#26
type: Restriction
all values from: string
max cardinality: 1
min cardinality: 0
on property: content last

Format Description No Substitution
type: Class
comment: Description of fresnel:Format content separators only; contentNoValue will not be recognized in conjunction with this class.
subclass of: Format Description

Format Description Substitution
type: Class
comment: Description of fresnel:Format content separators and content replacement if values are missing.
subclass of: Format Description
subclass of: http://lodlaundromat.org/.well-known/genid/731b8538f14b28384f16fff4bf46c647#27

http://lodlaundromat.org/.well-known/genid/731b8538f14b28384f16fff4bf46c647#27
type: Restriction
all values from: string
max cardinality: 1
min cardinality: 0
on property: content no value

Group
type: Class
comment: A Fresnel Group is used for grouping formats and lenses together.
subclass of: Resource
subclass of: http://lodlaundromat.org/.well-known/genid/731b8538f14b28384f16fff4bf46c647#28
subclass of: http://lodlaundromat.org/.well-known/genid/731b8538f14b28384f16fff4bf46c647#29
subclass of: http://lodlaundromat.org/.well-known/genid/731b8538f14b28384f16fff4bf46c647#30
subclass of: http://lodlaundromat.org/.well-known/genid/731b8538f14b28384f16fff4bf46c647#31
subclass of: http://lodlaundromat.org/.well-known/genid/731b8538f14b28384f16fff4bf46c647#32
subclass of: http://lodlaundromat.org/.well-known/genid/731b8538f14b28384f16fff4bf46c647#33
subclass of: http://lodlaundromat.org/.well-known/genid/731b8538f14b28384f16fff4bf46c647#34
subclass of: http://lodlaundromat.org/.well-known/genid/731b8538f14b28384f16fff4bf46c647#35
subclass of: http://lodlaundromat.org/.well-known/genid/731b8538f14b28384f16fff4bf46c647#36
disjoint with: Format Class
disjoint with: Lens

http://lodlaundromat.org/.well-known/genid/731b8538f14b28384f16fff4bf46c647#28
type: Restriction
all values from: ClassList
max cardinality: 1
min cardinality: 0
on property: primaryClasses

http://lodlaundromat.org/.well-known/genid/731b8538f14b28384f16fff4bf46c647#29
type: Restriction
all values from: string
max cardinality: 1
min cardinality: 0
on property: resource style

http://lodlaundromat.org/.well-known/genid/731b8538f14b28384f16fff4bf46c647#30
type: Restriction
all values from: string
max cardinality: 1
min cardinality: 0
on property: property style

http://lodlaundromat.org/.well-known/genid/731b8538f14b28384f16fff4bf46c647#31
type: Restriction
all values from: string
max cardinality: 1
min cardinality: 0
on property: value style

http://lodlaundromat.org/.well-known/genid/731b8538f14b28384f16fff4bf46c647#32
type: Restriction
all values from: string
max cardinality: 1
min cardinality: 0
on property: label style

http://lodlaundromat.org/.well-known/genid/731b8538f14b28384f16fff4bf46c647#33
type: Restriction
all values from: Format Description No Substitution
max cardinality: 1
min cardinality: 0
on property: resource format

http://lodlaundromat.org/.well-known/genid/731b8538f14b28384f16fff4bf46c647#34
type: Restriction
all values from: Format Description Substitution
max cardinality: 1
min cardinality: 0
on property: property format

http://lodlaundromat.org/.well-known/genid/731b8538f14b28384f16fff4bf46c647#35
type: Restriction
all values from: Format Description No Substitution
max cardinality: 1
min cardinality: 0
on property: value format

http://lodlaundromat.org/.well-known/genid/731b8538f14b28384f16fff4bf46c647#36
type: Restriction
all values from: Format Description Substitution
max cardinality: 1
min cardinality: 0
on property: label format

Hide Property List
type: Class
comment: This is a convenience class for the OWL specification of Fresnel.
subclass of: List
subclass of: http://lodlaundromat.org/.well-known/genid/731b8538f14b28384f16fff4bf46c647#37
subclass of: http://lodlaundromat.org/.well-known/genid/731b8538f14b28384f16fff4bf46c647#38
disjoint with: Show Property List

Labelling Format
type: Class
comment: Abstract superclass of all labelling formats.
subclass of: Resource
subclass of: http://lodlaundromat.org/.well-known/genid/731b8538f14b28384f16fff4bf46c647#42

Lens
type: Class
comment: Lens for viewing RDF data.
subclass of: Resource
subclass of: http://lodlaundromat.org/.well-known/genid/731b8538f14b28384f16fff4bf46c647#45
subclass of: http://lodlaundromat.org/.well-known/genid/731b8538f14b28384f16fff4bf46c647#46
subclass of: http://lodlaundromat.org/.well-known/genid/731b8538f14b28384f16fff4bf46c647#47
subclass of: http://lodlaundromat.org/.well-known/genid/731b8538f14b28384f16fff4bf46c647#52
subclass of: http://lodlaundromat.org/.well-known/genid/731b8538f14b28384f16fff4bf46c647#56
subclass of: http://lodlaundromat.org/.well-known/genid/731b8538f14b28384f16fff4bf46c647#57
subclass of: http://lodlaundromat.org/.well-known/genid/731b8538f14b28384f16fff4bf46c647#58
subclass of: http://lodlaundromat.org/.well-known/genid/731b8538f14b28384f16fff4bf46c647#62

http://lodlaundromat.org/.well-known/genid/731b8538f14b28384f16fff4bf46c647#45
type: Restriction
min cardinality: 0
on property: class lens domain

http://lodlaundromat.org/.well-known/genid/731b8538f14b28384f16fff4bf46c647#46
type: Restriction
min cardinality: 0
on property: instance lens domain

http://lodlaundromat.org/.well-known/genid/731b8538f14b28384f16fff4bf46c647#47
type: Restriction
all values from: http://lodlaundromat.org/.well-known/genid/731b8538f14b28384f16fff4bf46c647#48
max cardinality: 1
min cardinality: 0
on property: show properties

http://lodlaundromat.org/.well-known/genid/731b8538f14b28384f16fff4bf46c647#52
type: Restriction
all values from: http://lodlaundromat.org/.well-known/genid/731b8538f14b28384f16fff4bf46c647#53
max cardinality: 1
min cardinality: 0
on property: hide properties

http://lodlaundromat.org/.well-known/genid/731b8538f14b28384f16fff4bf46c647#56
type: Restriction
all values from: Purpose
min cardinality: 0
on property: purpose

http://lodlaundromat.org/.well-known/genid/731b8538f14b28384f16fff4bf46c647#57
type: Restriction
all values from: Group
min cardinality: 0
on property: group

http://lodlaundromat.org/.well-known/genid/731b8538f14b28384f16fff4bf46c647#58
type: Restriction
all values from: http://lodlaundromat.org/.well-known/genid/731b8538f14b28384f16fff4bf46c647#59
max cardinality: 1
min cardinality: 0
on property: use

http://lodlaundromat.org/.well-known/genid/731b8538f14b28384f16fff4bf46c647#62
type: Restriction
max cardinality: 1
min cardinality: 0
on property: resource style

Property Description
type: Class
comment: More detailed description of the property, e.g. for specifing sublenses or merging properties.
subclass of: Resource
subclass of: http://lodlaundromat.org/.well-known/genid/731b8538f14b28384f16fff4bf46c647#63
subclass of: http://lodlaundromat.org/.well-known/genid/731b8538f14b28384f16fff4bf46c647#64
subclass of: http://lodlaundromat.org/.well-known/genid/731b8538f14b28384f16fff4bf46c647#65
subclass of: http://lodlaundromat.org/.well-known/genid/731b8538f14b28384f16fff4bf46c647#66

http://lodlaundromat.org/.well-known/genid/731b8538f14b28384f16fff4bf46c647#63
type: Restriction
all values from: Property
max cardinality: 1
min cardinality: 0
on property: property

http://lodlaundromat.org/.well-known/genid/731b8538f14b28384f16fff4bf46c647#64
type: Restriction
min cardinality: 0
on property: sublens

http://lodlaundromat.org/.well-known/genid/731b8538f14b28384f16fff4bf46c647#65
type: Restriction
all values from: nonNegativeInteger
max cardinality: 1
min cardinality: 0
on property: depth

http://lodlaundromat.org/.well-known/genid/731b8538f14b28384f16fff4bf46c647#66
type: Restriction
all values from: http://lodlaundromat.org/.well-known/genid/731b8538f14b28384f16fff4bf46c647#67
max cardinality: 1
min cardinality: 0
on property: use

Property Set
type: Class
comment: Abstract class of property sets.
subclass of: Convenience Token

Property value display style
type: Class
comment: Abstract superclass of all property value display styles.
subclass of: Resource
subclass of: http://lodlaundromat.org/.well-known/genid/731b8538f14b28384f16fff4bf46c647#70

Purpose
type: Class
comment: Propose in which a specific lens might be appropriate.
subclass of: Resource

Show Property List
type: Class
comment: This is a convenience class for the OWL specification of Fresnel.
subclass of: List
subclass of: http://lodlaundromat.org/.well-known/genid/731b8538f14b28384f16fff4bf46c647#74
subclass of: http://lodlaundromat.org/.well-known/genid/731b8538f14b28384f16fff4bf46c647#79
disjoint with: Hide Property List

All Properties
type: Property Set
comment: Set of all properties of the current instance, which have not be explicitly named before.

class format domain
type: ObjectProperty
comment: The Format should be applied to instances of this class.
domain: Format Class
range: Class

class lens domain
type: ObjectProperty
comment: Specifies that the lens is usable for the specified class and its subclasses.
domain: Lens
range: Class

content after
type: DatatypeProperty
comment: Content that should be displayed before the content of the current box.
domain: Format Description
range: string

content before
type: DatatypeProperty
comment: Content that should be displayed before the content of the current box.
domain: Format Description
range: string

content first
type: DatatypeProperty
comment: Content that should be displayed before the content of the first element in a list of boxes; takes over the first :contentBefore element in case of a conflict.
domain: Format Description
range: string

content last
type: DatatypeProperty
comment: Content that should be displayed after the content of the last element in a list of boxes; takes over the last :contentAfter element in case of a conflict.
domain: Format Description
range: string

content no value
type: DatatypeProperty
comment: Content that should be displayed if the current property is missing.
domain: Format Description Substitution
range: string

Default Lens
type: Purpose
comment: Provides the browser with a starting point which lens to show.

depth
type: DatatypeProperty
comment: Closure mechanism, if lenses are recursively used; the recursive depth limit.
domain: Property Description
range: nonNegativeInteger

External Link
type: Property value display style
comment: Show the property value as a dereferenceable URL.

group
type: ObjectProperty
comment: Specifies the format group to which a format or a lens belongs.
domain: http://lodlaundromat.org/.well-known/genid/731b8538f14b28384f16fff4bf46c647#83
range: Group

hide properties
type: ObjectProperty
comment: List of all properties which should be hidden. Must be used together with 'fresnel:showProperties fresnel:allProperties.'
domain: Lens
range: http://lodlaundromat.org/.well-known/genid/731b8538f14b28384f16fff4bf46c647#86

Image
type: Property value display style
comment: Show the property value as an image, such as PNG or JPEG

instance format domain
type: ObjectProperty
comment: The Format should be applied to this set of instances.
domain: Format Class
range: Resource

instance lens domain
type: ObjectProperty
comment: The lens is usable for the specified set of instances.
domain: Lens
range: Resource

label
type: ObjectProperty
comment: Specifies how a property is labelled (only works in conjunction with propertyFormatDomain).
domain: Format Class

label format
type: ObjectProperty
comment: Assign content formatting to a set of labels (theoretically, this does not make much sense, but it does round out the set of formatting properties; only works in conjunction with propertyFormatDomain).
domain: http://lodlaundromat.org/.well-known/genid/731b8538f14b28384f16fff4bf46c647#90
range: Format Description Substitution

Label Lens
type: Purpose
comment: Lens for providing a label for a resource.

label style
type: DatatypeProperty
comment: Attaching a symbol appropriate for styling labels (only works in conjunction with propertyFormatDomain).
domain: http://lodlaundromat.org/.well-known/genid/731b8538f14b28384f16fff4bf46c647#93
range: string

member
type: Convenience Property
comment: A special token to indicate the relationship between any RDF container or collection (rdf:List) and its member items. Do not use as anything other than an individual.

none
type: Labelling Format
comment: Do not show any label for the property.

primaryClasses
type: ObjectProperty
comment: Specifies the classes that should be considered primaries, or first class results; secondary resources not matching the primaries will only be shown as sublenses. The range is a list of resource selectors.
domain: Group
range: ClassList

property
type: ObjectProperty
comment: The RDF property, which is described.
domain: Property Description
range: Property

property format
type: ObjectProperty
comment: Assign content formatting to a set of properties (only works in conjunction with propertyFormatDomain).
domain: http://lodlaundromat.org/.well-known/genid/731b8538f14b28384f16fff4bf46c647#96
range: Format Description Substitution

property format domain
type: ObjectProperty
comment: The Format should be used for the specified properties.
domain: Format Class
range: http://lodlaundromat.org/.well-known/genid/731b8538f14b28384f16fff4bf46c647#99

property style
type: DatatypeProperty
comment: Attaching a symbol appropriate for styling properties (only works in conjunction with propertyFormatDomain).
domain: http://lodlaundromat.org/.well-known/genid/731b8538f14b28384f16fff4bf46c647#102
range: string

purpose
type: ObjectProperty
comment: Specifies a purpose for which a lens or format might be appropriate.
domain: http://lodlaundromat.org/.well-known/genid/731b8538f14b28384f16fff4bf46c647#105
range: Purpose

Replaced Resource
type: Property value display style
comment: Any kind of retrievable resource like an image, audio or video that should be displayed as property value. The browser should try retrieve the resource and show it instead of the property value URI. The browser has to negotiate an appropriate media type with the server using HTTP content negotiation.

resource format
type: ObjectProperty
comment: Assign content formatting to a set of resources (only works in conjunction with classFormatDomain and instanceFormatDomain).
domain: http://lodlaundromat.org/.well-known/genid/731b8538f14b28384f16fff4bf46c647#109
range: Format Description No Substitution

resource style
type: DatatypeProperty
comment: Attaching a symbol appropriate for styling a resource. resourceStyle is ignored if not used with :classFormatDomain or :instanceFormatDomain.
domain: http://lodlaundromat.org/.well-known/genid/731b8538f14b28384f16fff4bf46c647#112
range: string

Show Label
type: Labelling Format
comment: Show the RDFS Label of the property. This is the default and doesn't have to be declared.

show properties
type: ObjectProperty
comment: List of all properties which should be shown.
domain: Lens
range: http://lodlaundromat.org/.well-known/genid/731b8538f14b28384f16fff4bf46c647#115

sublens
type: ObjectProperty
comment: Sublens which should be used for displaying property values.
domain: Property Description
range: Lens

URI
type: Property value display style
comment: Show the property value as an URI.

use
type: ObjectProperty
comment: Explicit definition of fresnel:Group containing formats that should be used to render the lens or sublens.
domain: http://lodlaundromat.org/.well-known/genid/731b8538f14b28384f16fff4bf46c647#120
range: http://lodlaundromat.org/.well-known/genid/731b8538f14b28384f16fff4bf46c647#123

property value
type: ObjectProperty
comment: Specifies how a property value is displayed (only works in conjunction with propertyFormatDomain).
domain: Format Class
range: Property value display style

value format
type: ObjectProperty
comment: Assign content formatting to a set of values (only works in conjunction with propertyFormatDomain).
domain: http://lodlaundromat.org/.well-known/genid/731b8538f14b28384f16fff4bf46c647#126
range: Format Description No Substitution

value style
type: DatatypeProperty
comment: Attaching a symbol appropriate for styling the values of a property (only works in conjunction with propertyFormatDomain).
domain: http://lodlaundromat.org/.well-known/genid/731b8538f14b28384f16fff4bf46c647#129
range: string