Molecular Function T044
type: Class
comment: A physiologic function occurring at the molecular level.
subclass of: Physiologic Function T039

Physiologic Function T039
type: Class
comment: A normal process, activity, or state of the body.
subclass of: Restriction
  on property: co-occurs with T137
  all values from: Physiologic Function T039
subclass of: Biologic Function T038
subclass of: Restriction
  on property: precedes T138
  all values from: Physiologic Function T039

Hormone T125
type: Class
subclass of: Biologically Active Substance T123
comment: In animals, a chemical usually secreted by an endocrine gland whose products are released into the circulating fluid. Hormones act as chemical messengers and regulate various physiologic processes such as growth, reproduction, metabolism, etc. They usually fall into two broad classes, steroid hormones and peptide hormones.

Biologically Active Substance T123
type: Class
subclass of: Chemical Viewed Functionally T120
subclass of: Restriction
  all values from: Class
    union of: Embryonic Structure T018
    union of: Fully Formed Anatomical Structure T021
    union of: Physiologic Function T039
  on property: disrupts T146
subclass of: Restriction
  all values from: Class
    union of: Anatomical Abnormality T190
    union of: Biologic Function T038
    union of: Verletzung
  on property: complicates T149
comment: A generally endogenous substance produced or required by an organism, of primary interest because of its role in the biologic functioning of the organism that produces it.

Antibiotic T195
type: Class
subclass of: Pharmacologic Substance T121
comment: A pharmacologically active compound produced by growing microorganisms which kill or inhibit growth of other microorganisms.

Pharmacologic Substance T121
type: Class
subclass of: Restriction
  all values from: Pathologic Function T046
  on property: prevents T148
subclass of: Chemical Viewed Functionally T120
comment: A substance used in the treatment or prevention of pathologic disorders. This includes substances that occur naturally in the body and are administered therapeutically.
subclass of: Restriction
  on property: complicates T149
  all values from: Class
    union of: Anatomical Abnormality T190
    union of: Biologic Function T038
    union of: Verletzung
subclass of: Restriction
  on property: diagnoses T163
  all values from: Pathologic Function T046
subclass of: Restriction
  on property: treats T154
  all values from: Class
    union of: Anatomical Abnormality T190
    union of: Verletzung
    union of: Pathologic Function T046
    union of: Merkmal
subclass of: Restriction
  on property: disrupts T146
  all values from: Class
    union of: Embryonic Structure T018
    union of: Fully Formed Anatomical Structure T021
    union of: Physiologic Function T039

co-occurs with T137
type: ObjectProperty
sub property of: temporally related to T136
comment: Occurs at the same time as, together with, or jointly. This includes is co-incident with, is concurrent with, is contemporaneous with, accompanies, coexists with, and is concomitant with.
range: Verletzung

Biologic Function T038
type: Class
subclass of: Natural Phenomenon or Process T070
subclass of: Restriction
  all values from: Class
    union of: Biologically Active Substance T123
    union of: Body Substance T031
  on property: produces T144
comment: A state, activity or process of the body or one of its systems or parts.

precedes T138
type: ObjectProperty
comment: Occurs earlier in time. This includes antedates, comes before, is in advance of, predates, and is prior to.
sub property of: temporally related to T136

Gewebe
type: Class
subclass of: Restriction
  all values from: Gewebe
  on property: adjacent to T173
subclass of: Fully Formed Anatomical Structure T021
subclass of: Restriction
  all values from: Class
    union of: Koerperteil_Organ
    union of: Gewebe
  on property: physical part of T133
comment: An aggregation of similarly specialized cells and the associated intercellular substance. Tissues are relatively non-localized in comparison to body parts, organs or organ components.
subclass of: Shape
subclass of: Restriction
  all values from: Gewebe
  on property: consists of T172

adjacent to T173
type: ObjectProperty
comment: Close to, near or abutting another physical unit with no other structure of the same kind intervening. This includes adjoins, abuts, is contiguous to, is juxtaposed, and is close to.
sub property of: spatially related to T189

Fully Formed Anatomical Structure T021
type: Class
subclass of: Restriction
  on property: contains T134
  all values from: Body Substance T031
subclass of: Anatomical Structure T017
subclass of: Restriction
  all values from: Class
    union of: Body Substance T031
    union of: Biologically Active Substance T123
    union of: Organic Chemical T109
  on property: produces T144
subclass of: Restriction
  on property: location of T135
  all values from: Class
    union of: Anatomical Abnormality T190
    union of: Biologic Function T038
    union of: Verletzung
comment: An anatomical structure in a fully formed organism; in mammals, for example, a structure in the body after the birth of the organism.

Koerperteil_Organ
type: Class
subclass of: Restriction
  on property: traverses T177
  all values from: Koerperteil_Organ
comment: A collection of cells and tissues which are localized to a specific area or combine and carry out one or more specialized functions of an organism. This ranges from gross structures to small components of complex organs. These structures are relatively localized in comparison to tissues.
subclass of: Restriction
  all values from: Class
    union of: Koerperteil_Organ
    union of: Gewebe
  on property: surrounds T176
subclass of: Restriction
  on property: consists of T172
  all values from: Class
    union of: Koerperteil_Organ
    union of: Body Substance T031
subclass of: Restriction
  all values from: Koerperteil_Organ
  on property: tributary of T199
subclass of: Shape
subclass of: Fully Formed Anatomical Structure T021
subclass of: Restriction
  on property: physical part of T133
  all values from: Koerperteil_Organ
subclass of: Restriction
  all values from: Koerperteil_Organ
  on property: branch of T198

physical part of T133
type: ObjectProperty
sub property of: physically related to T132
sub property of: part of
comment: Composes, with one or more other physical units, some larger whole. This includes component of, division of, portion of, fragment of, section of, and layer of.
inverse of: has physical part

consists of T172
type: ObjectProperty
equivalent property: has physical part
sub property of: physically related to T132
comment: Is structurally made up of in whole or in part of some material or matter. This includes composed of, made of, and formed of.

Zellkomponente
type: Class
comment: A part of a cell or the intercellular matrix, generally visible by light microscopy.
subclass of: Restriction
  on property: physical part of T133
  all values from: Class
    union of: Koerperteil_Organ
    union of: Zellkomponente
    union of: Zelle
    union of: Gewebe
subclass of: Restriction
  on property: surrounds T176
  all values from: Zellkomponente
subclass of: Fully Formed Anatomical Structure T021
subclass of: Restriction
  all values from: Physiologic Function T039
  on property: affects T151

Zelle
type: Class
subclass of: Restriction
  all values from: Class
    union of: Koerperteil_Organ
    union of: Zelle
    union of: Gewebe
  on property: physical part of T133
subclass of: Restriction
  all values from: Zelle
  on property: adjacent to T173
subclass of: Shape
comment: The fundamental structural and functional unit of living organisms.
subclass of: Fully Formed Anatomical Structure T021
subclass of: Restriction
  on property: consists of T172
  all values from: Class
    union of: Zelle
    union of: Zellkomponente

surrounds T176
type: ObjectProperty
sub property of: spatially related to T189
comment: Establishes the boundaries for, or defines the limits of another physical structure. This includes limits, bounds, confines, encloses, and circumscribes.

affects T151
type: ObjectProperty
sub property of: functionally related to T139
comment: Produces a direct effect on. Implied here is the altering or influencing of an existing condition, state, situation, or entity. This includes has a role in, alters, influences, predisposes, catalyzes, stimulates, regulates, depresses, impedes, enhances, contributes to, leads to, and modifies.

Neoplastic Process T191
type: Class
subclass of: Krankheit
comment: A new and abnormal growth of tissue in which the growth is uncontrolled and progressive. The growths may be malignant or benign.

Krankheit
type: Class
comment: A condition which alters or interferes with a normal process, state, or activity of an organism. It is usually characterized by the abnormal functioning of one or more of the host's systems, parts, or organs. Included here is a complex of symptoms descriptive of a disorder.
subclass of: Restriction
  on property: produces T144
  all values from: Gewebe
subclass of: Pathologic Function T046

Erworbene_Anomalie
type: Class
subclass of: Restriction
  on property: co-occurs with T137
  all values from: Verletzung
comment: An abnormal structure, or one that is abnormal in size or location, found in or deriving from a previously normal structure. Acquired abnormalities are distinguished from diseases even though they may result in pathological functioning (e.g., "hernias incarcerate").
subclass of: Anatomical Abnormality T190

Verletzung
type: Class
label: Vergiftung @de
comment: A traumatic wound, injury, or poisoning caused by an external agent or force.
subclass of: Restriction
  all values from: Class
    union of: Verletzung
    union of: Erworbene_Anomalie
    union of: Pathologic Function T046
  on property: co-occurs with T137
subclass of: Restriction
  all values from: Class
    union of: Anatomical Abnormality T190
    union of: Pathologic Function T046
  on property: complicates T149
subclass of: Restriction
  all values from: Class
    union of: Embryonic Structure T018
    union of: Fully Formed Anatomical Structure T021
    union of: Physiologic Function T039
  on property: disrupts T146
subclass of: Phenomenon or Process T067

Anatomical Abnormality T190
type: Class
subclass of: Restriction
  all values from: Class
    union of: Anatomical Abnormality T190
    union of: Pathologic Function T046
  on property: co-occurs with T137
subclass of: Anatomical Structure T017
subclass of: Restriction
  on property: location of T135
  all values from: Pathologic Function T046
comment: An abnormal structure, or one that is abnormal in size or location.
subclass of: Restriction
  all values from: Biologic Function T038
  on property: manifestation of T150
subclass of: Restriction
  all values from: Anatomical Abnormality T190
  on property: complicates T149
subclass of: Restriction
  on property: result of T157
  all values from: Class
    union of: Anatomical Abnormality T190
    union of: Health Care Activity T058
    union of: Phenomenon or Process T067

traverses T177
type: ObjectProperty
comment: Crosses or extends across another physical structure or area. This includes crosses over and crosses through.
sub property of: spatially related to T189

Body Substance T031
type: Class
subclass of: Restriction
  on property: connected to T174
  all values from: Koerperteil_Organ
comment: Extracellular material, or mixtures of cells and extracellular material, produced, excreted, or accreted by the body. Included here are substances such as saliva, dental enamel, sweat, and gastric acid.
subclass of: Restriction
  on property: surrounds T176
  all values from: Embryonic Structure T018
subclass of: Restriction
  all values from: Class
    union of: Koerperteil_Organ
    union of: Body Substance T031
  on property: physical part of T133
subclass of: Restriction
  on property: consists of T172
  all values from: Class
    union of: Body Substance T031
    union of: Organic Chemical T109
subclass of: Substance T167

tributary of T199
type: ObjectProperty
sub property of: physically related to T132
comment: Merges with. For example, the confluence of veins.

branch of T198
type: ObjectProperty
inverse of: has branch
comment: Arises from the division of. For example, the arborization of arteries.
sub property of: part of
sub property of: physically related to T132

Chemical T103
type: Class
subclass of: Restriction
  on property: interacts with T142
  all values from: Chemical T103
subclass of: Restriction
  all values from: Natural Phenomenon or Process T070
  on property: affects T151
subclass of: Substance T167
comment: Compounds or substances of definite molecular composition. Chemicals are viewed from two distinct perspectives in the network, functionally and structurally. Almost every chemical concept is assigned at least two types, generally one from the structure hierarchy and at least one from the function hierarchy.

interacts with T142
type: ObjectProperty
sub property of: affects T151
comment: Acts, functions, or operates together with.

Natural Phenomenon or Process T070
type: Class
subclass of: Restriction
  all values from: Natural Phenomenon or Process T070
  on property: process of T140
comment: A phenomenon or process that occurs irrespective of the activities of human beings.
subclass of: Restriction
  all values from: Natural Phenomenon or Process T070
  on property: affects T151
subclass of: Phenomenon or Process T067

Substance T167
type: Class
subclass of: Physical Object T072
comment: A material with definite or fairly definite chemical composition.
subclass of: Restriction
  all values from: Class
    union of: Anatomical Abnormality T190
    union of: Verletzung
    union of: Pathologic Function T046
  on property: causes T147

Entity T071
type: Class
subclass of: UMLSSemanticType
comment: A broad type for grouping physical and conceptual entities.

Biomedical or Dental Material T122
type: Class
subclass of: Chemical Viewed Functionally T120
comment: A substance used in biomedicine or dentistry predominantly for its physical, as opposed to chemical, properties. Included here are biocompatible materials, tissue adhesives, bone cements, resins, toothpastes, etc.

Chemical Viewed Functionally T120
type: Class
subclass of: Chemical T103
comment: A chemical viewed from the perspective of its functional characteristics or pharmacological activities.

Genetic Function T045
type: Class
subclass of: Restriction
  on property: produces T144
  all values from: Zellkomponente
comment: Functions of or related to the maintenance, translation or expression of the genetic material.
subclass of: Molecular Function T044

produces T144
type: ObjectProperty
sub property of: brings about T187
comment: Brings forth, generates or creates. This includes yields, secretes, emits, biosynthesizes, generates, releases, discharges, and creates.

Enzyme T126
type: Class
subclass of: Biologically Active Substance T123
comment: A complex chemical, usually a protein, that is produced by living cells and which catalyzes specific biochemical reactions. There are six main types of enzymes: oxidoreductases, transferases, hydrolases, lyases, isomerases, and ligases.

Organic Chemical T109
type: Class
comment: The general class of carbon-containing compounds, usually based on carbon chains or rings, and also containing hydrogen (hydrocarbons), with or without nitrogen, oxygen, or other elements in which the bonding between elements is generally covalent.
subclass of: Chemical Viewed Structurally T104

Chemical Viewed Structurally T104
type: Class
subclass of: Chemical T103
comment: A chemical or chemicals viewed from the perspective of their structural characteristics. Included here are concepts which can mean either a salt, an ion, or a compound (e.g., "Bromates" and "Bromides").

Event T051
type: Class
comment: A broad type for grouping activities, processes and states.
subclass of: UMLSSemanticType

Physical Object T072
type: Class
comment: An object perceptible to the sense of vision or touch.
subclass of: Entity T071

Embryonic Structure T018
type: Class
subclass of: Anatomical Structure T017
comment: An anatomical structure that exists only before the organism is fully formed; in mammals, for example, a structure that exists only prior to the birth of the organism. This structure may be normal or abnormal.
subclass of: Restriction
  on property: interconnects T175
  all values from: Embryonic Structure T018
subclass of: Restriction
  on property: contains T134
  all values from: Body Substance T031
subclass of: Restriction
  on property: location of T135
  all values from: Biologic Function T038
subclass of: Restriction
  all values from: Class
    union of: Zelle
    union of: Embryonic Structure T018
  on property: physical part of T133
subclass of: Restriction
  on property: surrounds T176
  all values from: Class
    union of: Zelle
    union of: Embryonic Structure T018

disrupts T146
type: ObjectProperty
comment: Alters or influences an already existing condition, state, or situation. Produces a negative effect on.
sub property of: affects T151

complicates T149
type: ObjectProperty
comment: Causes to become more severe or complex or results in adverse effects.
inverse of: complicated by
sub property of: affects T151

Anatomical Structure T017
type: Class
subclass of: Physical Object T072
comment: A normal or pathological part of the anatomy or structural organization of an organism.

interconnects T175
type: ObjectProperty
sub property of: physically related to T132
comment: Serves to link or join together two or more other physical units. This includes joins, links, conjoins, articulates, separates, and bridges.

contains T134
type: ObjectProperty
comment: Holds or is the receptacle for fluids or other substances. This includes is filled with, holds, and is occupied by.
inverse of: contained in
sub property of: physically related to T132
sub property of: has part

location of T135
type: ObjectProperty
comment: The position, site, or region of an entity or the site of a process.
inverse of: has location
sub property of: spatially related to T189

Inorganic Chemical T197
type: Class
subclass of: Chemical Viewed Structurally T104
comment: Chemical elements and their compounds, excluding the hydrocarbons and their derivatives (except carbides, carbonates, cyanides, cyanates and carbon disulfide). Generally inorganic compounds contain ionic bonds. Included here are inorganic acids and salts, alloys, alkalies, and minerals.

Organophosphorus Compound T115
type: Class
subclass of: Organic Chemical T109
comment: An organic compound containing phosphorus as a constituent. Included here are organic phosphinic, phosphonic and phosphoric acid derivatives and their thiophosphorus counterparts. Excluded are phospholipids, sugar phosphates, phosphoproteins, nucleotides, and nucleic acids.

Pathologic Function T046
type: Class
subclass of: Restriction
  all values from: Class
    union of: Verletzung
    union of: Pathologic Function T046
    union of: Physiologic Function T039
  on property: manifestation of T150
subclass of: Restriction
  on property: co-occurs with T137
  all values from: Pathologic Function T046
comment: A disordered process, activity, or state of the organism as a whole, of a body system or systems, or of multiple organs or tissues. Included here are normal responses to a negative stimulus as well as patholologic conditions or states that are less specific than a disease. Pathologic functions frequently have systemic effects.
subclass of: Restriction
  on property: complicates T149
  all values from: Class
    union of: Anatomical Abnormality T190
    union of: Verletzung
    union of: Pathologic Function T046
subclass of: Biologic Function T038
subclass of: Restriction
  all values from: Pathologic Function T046
  on property: precedes T138
subclass of: Restriction
  all values from: Pathologic Function T046
  on property: degree of T180

Vitamin T127
type: Class
comment: A substance, usually an organic chemical complex, present in natural products or made synthetically, which is essential in the diet of man or other higher animals. Included here are vitamin precursors, provitamins, and vitamin supplements.
subclass of: Biologically Active Substance T123

prevents T148
type: ObjectProperty
sub property of: affects T151
comment: Stops, hinders or eliminates an action or condition.

diagnoses T163
type: ObjectProperty
sub property of: conceptually related to T158
inverse of: diagnosed by
comment: Distinguishes or identifies the nature or characteristics of.

treats T154
type: ObjectProperty
comment: Applies a remedy with the object of effecting a cure or managing a condition.
inverse of: treated by
sub property of: affects T151

Merkmal
type: Class
subclass of: Restriction
  all values from: Class
    union of: Anatomical Abnormality T190
    union of: Verletzung
    union of: Pathologic Function T046
  on property: diagnoses T163
label: Symptom @de
comment: An observable manifestation of a disease or condition based on clinical judgment, or a manifestation of a disease or condition which is experienced by the patient and reported as a subjective observation.
subclass of: Befund
label: Krankheitserscheinung @de
subclass of: Restriction
  on property: degree of T180
  all values from: Merkmal

process of T140
type: ObjectProperty
comment: Action, function, or state of.
inverse of: has process
sub property of: functionally related to T139

Phenomenon or Process T067
type: Class
subclass of: Event T051
subclass of: Restriction
  all values from: Class
    union of: Anatomical Abnormality T190
    union of: Phenomenon or Process T067
  on property: result of T157
comment: A process or state which occurs naturally or as a result of an activity.

Laborverfahren
type: Class
subclass of: Restriction
  all values from: Class
    union of: Anatomical Abnormality T190
    union of: Verletzung
    union of: Pathologic Function T046
  on property: diagnoses T163
subclass of: Health Care Activity T058
comment: A procedure, method, or technique used to determine the composition, quantity, or concentration of a specimen, and which is carried out in a clinical laboratory. Included here are procedures which measure the times and rates of reactions.

Health Care Activity T058
type: Class
comment: An activity of or relating to the practice of medicine or involving the care of patients.
subclass of: Restriction
  all values from: Biologic Function T038
  on property: affects T151
subclass of: Occupational Activity T057

result of T157
type: ObjectProperty
inverse of: has result
comment: The condition, product, or state occurring as a consequence, effect, or conclusion of an activity or process. This includes product of, effect of, sequel of, outcome of, culmination of, and completion of.
sub property of: functionally related to T139

Testergebniss
type: Class
subclass of: Restriction
  on property: indicates T156
  all values from: Class
    union of: Anatomical Abnormality T190
    union of: Biologic Function T038
    union of: Verletzung
comment: The outcome of a specific test to measure an attribute or to determine the presence, absence, or degree of a condition.
subclass of: Befund
subclass of: Restriction
  on property: result of T157
  all values from: Class
    union of: Diagnostikverfahren
    union of: Laborverfahren

indicates T156
type: ObjectProperty
inverse of: indicated by
sub property of: functionally related to T139
comment: Gives evidence for the presence at some time of an entity or process.

Befund
type: Class
subclass of: Restriction
  all values from: Class
    union of: Verletzung
    union of: Pathologic Function T046
  on property: associated with T166
comment: That which is discovered by direct observation or measurement of an organism attribute or condition, including the clinical history of the patient. The history of the presence of a disease is a 'Finding' and is distinguished from the disease itself.
subclass of: Restriction
  on property: co-occurs with T137
  all values from: Befund
subclass of: Conceptual Entity T077
subclass of: Restriction
  on property: manifestation of T150
  all values from: Class
    union of: Anatomical Abnormality T190
    union of: Biologic Function T038
    union of: Verletzung

Diagnostikverfahren
type: Class
comment: A procedure, method, or technique used to determine the nature or identity of a disease or disorder. This excludes procedures which are primarily carried out on specimens in a laboratory.
subclass of: Restriction
  on property: diagnoses T163
  all values from: Class
    union of: Anatomical Abnormality T190
    union of: Verletzung
    union of: Pathologic Function T046
subclass of: Health Care Activity T058
subclass of: Restriction
  on property: precedes T138
  all values from: Behandlungsmethode

Hazardous or Poisonous Substance T131
type: Class
subclass of: Restriction
  on property: disrupts T146
  all values from: Class
    union of: Embryonic Structure T018
    union of: Fully Formed Anatomical Structure T021
    union of: Physiologic Function T039
subclass of: Restriction
  on property: complicates T149
  all values from: Class
    union of: Anatomical Abnormality T190
    union of: Biologic Function T038
    union of: Verletzung
comment: A substance of concern because of its potentially hazardous or toxic effects. This would include most drugs of abuse, as well as agents that require special handling because of their toxicity.
subclass of: Chemical Viewed Functionally T120

connected to T174
type: ObjectProperty
comment: Directly attached to another physical unit as tendons are connected to muscles. This includes attached to and anchored to.
sub property of: physically related to T132

Psychische_Stoerung
type: Class
subclass of: Krankheit
comment: A clinically significant dysfunction whose major manifestation is behavioral or psychological. These dysfunctions may have identified or presumed biological etiologies or manifestations.

manifestation of T150
type: ObjectProperty
comment: That part of a phenomenon which is directly observable or concretely or visibly expressed, or which gives evidence to the underlying process. This includes expression of, display of, and exhibition of.
inverse of: has manifestation
sub property of: functionally related to T139

degree of T180
type: ObjectProperty
sub property of: conceptually related to T158
comment: The relative intensity of a process or the relative intensity or amount of a quality or attribute.
inverse of: has degree

associated with T166
type: ObjectProperty
comment: has a significant or salient relationship to.

Conceptual Entity T077
type: Class
subclass of: Entity T071
comment: A broad type for grouping abstract entities or concepts.

Cell Function T043
type: Class
subclass of: Physiologic Function T039
comment: A physiologic function inherent to cells or cell components.

Element Ion or Isotope T196
type: Class
comment: One of the 109 presently known fundamental substances that comprise all matter at and above the atomic level. This includes elemental metals, rare gases, and most abundant naturally occurring radioactive elements, as well as the ionic counterparts of elements (NA+, Cl-), and the less abundant isotopic forms. This does not include organic ions such as iodoacetate to which the type 'Organic Chemical' is assigned.
subclass of: Chemical Viewed Structurally T104

Immunologic Factor T129
type: Class
comment: A biologically active substance whose activities affect or play a role in the functioning of the immune system.
subclass of: Biologically Active Substance T123

Carbohydrate T118
type: Class
subclass of: Organic Chemical T109
comment: A generic term that includes monosaccharides, oligosaccharides, and polysaccharides as well as substances derived from monosaccharides by reduction of the carbonyl group (alditols), by oxidation of one or more terminal group to carboxylic acids, or by replacement of one or more hydroxy groups by a hydrogen atom, an amino group, a thiol group or similar heteroatomic groups. It also includes derivatives of these compounds. Included here are sugar phosphates. Excluded are glycolipids and glycoproteins.

Angeborene_Anomalie
type: Class
label: Kongenitale_Anomalie @de
subclass of: Anatomical Abnormality T190
comment: An abnormal structure, or one that is abnormal in size or location, present at birth or evolving over time as a result of a defect in embryogenesis.

Organism Function T040
type: Class
subclass of: Restriction
  all values from: Organism Function T040
  on property: degree of T180
subclass of: Physiologic Function T039
comment: A physiologic function of the organism as a whole, of multiple organ systems, or of multiple organs or tissues.

Steroid T110
type: Class
subclass of: Lipid T119
comment: One of a group of polycyclic, 17-carbon-atom, fused-ring compounds occurring both in natural and synthetic forms. Included here are naturally occurring and synthetic steroids, bufanolides, cardanolides, homosteroids, norsteroids, and secosteroids.

Lipid T119
type: Class
subclass of: Organic Chemical T109
comment: An inclusive group of fat or fat-derived substances that are soluble in nonpolar solvents related to fatty acid esters, fatty alcohols, sterols, waxes, etc. Included in this group are the saponifiable lipids such as glycerides (fats and oils), essential (volatile) oils, and phospholipids.

Occupational Activity T057
type: Class
comment: An activity carried out as part of an occupation or job.
subclass of: Activity T052

Activity T052
type: Class
subclass of: Event T051
comment: An operation or series of operations that an organism or machine carries out or participates in.

Organ or Tissue Function T042
type: Class
subclass of: Restriction
  on property: occurs in T152
  all values from: Organism Function T040
subclass of: Physiologic Function T039
subclass of: Restriction
  all values from: Organ or Tissue Function T042
  on property: degree of T180
comment: A physiologic function of a particular organ, organ system, or tissue.

occurs in T152
type: ObjectProperty
sub property of: functionally related to T139
comment: Takes place in or happens under given conditions, circumstances, or time periods, or in a given location or population. This includes appears in, transpires, comes about, is present in, and exists in.

Receptor T192
type: Class
comment: A specific structure or site on the cell surface or within its cytoplasm that recognizes and binds with other specific molecules. These include the proteins on the surface of an immunocompetent cell that binds with antigens, or proteins found on the surface molecules that bind with hormones or neurotransmitters and react with other molecules that respond in a specific way.
subclass of: Biologically Active Substance T123

Eicosanoid T111
type: Class
comment: An oxygenated metabolite from polyunsaturated 20 carbon fatty acids including lipoxygenase and cyclooxygenase products and their synthetic analogs. This includes the prostaglandins and thromboxanes.
subclass of: Lipid T119

Nucleic Acid Nucleoside or Nucleotide T114
type: Class
subclass of: Organic Chemical T109
comment: A complex compound of high molecular weight occurring in living cells. These are basically of two types, ribonucleic (RNA) and deoxyribonucleic (DNA) acids. Nucleic acids are made of nucleotides (nitrogen-containing base, a 5-carbon sugar, and one or more phosphate group) linked together by a phosphodiester bond between the 5' and 3' carbon atoms. Nucleosides are compounds composed of a purine or pyrimidine base (usually adenine, cytosine, guanine, thymine, uracil) linked to either a ribose or a deoxyribose sugar.

Amino Acid Peptide or Protein T116
type: Class
subclass of: Restriction
  all values from: Amino Acid Peptide or Protein T116
  on property: consists of T172
subclass of: Organic Chemical T109
comment: Amino acids and chains of amino acids connected by peptide linkages.

Behandlungsmethode
type: Class
subclass of: Restriction
  all values from: Pathologic Function T046
  on property: prevents T148
subclass of: Restriction
  all values from: Class
    union of: Anatomical Abnormality T190
    union of: Verletzung
    union of: Pathologic Function T046
    union of: Merkmal
  on property: treats T154
label: Vorbeugungsverfahren @de
subclass of: Health Care Activity T058
comment: A procedure, method, or technique designed to prevent a disease or a disorder, or to improve physical function, or used in the process of treating a disease or injury.

Gen_oder_Genom
type: Class
subclass of: Restriction
  all values from: Class
    union of: Koerperteil_Organ
    union of: Zellkomponente
    union of: Zelle
    union of: Gewebe
  on property: physical part of T133
subclass of: Fully Formed Anatomical Structure T021
subclass of: Restriction
  all values from: Gen_oder_Genom
  on property: consists of T172
comment: A specific sequence, or in the case of the genome the complete sequence, of nucleotides along a molecule of DNA or RNA (in the case of some viruses) which represent the functional units of heredity.
subclass of: Restriction
  all values from: Physiologic Function T039
  on property: affects T151

Neuroreactive Substance or Biogenic Amine T124
type: Class
comment: An endogenous substance whose activities affect or play an important role in the functioning of the nervous system. Included here are catecholamines, neuroregulators, neurophysins, etc.
subclass of: Biologically Active Substance T123

causes T147
type: ObjectProperty
sub property of: brings about T187
comment: Brings about a condition or an effect. Implied here is that an agent, such as for example, a pharmacologic substance or an organism, has brought about the effect. This includes induces, effects, evokes, and etiology.

Indicator Reagent or Diagnostic Aid T130
type: Class
subclass of: Chemical Viewed Functionally T120
comment: A substance primarily of interest for its use in laboratory or diagnostic tests and procedures to detect, measure, examine, or analyze other chemicals, processes, or conditions.

Funktionssoerung_der_Zelle
type: Class
subclass of: Pathologic Function T046
comment: A pathologic function inherent to cells, parts of cells, or molecules.

Mental Process T041
type: Class
comment: A physiologic function involving the mind or cognitive processing.
subclass of: Organism Function T040

physically related to T132
type: ObjectProperty
sub property of: associated with T166
comment: Related by virtue of some physical attribute or characteristic.

functionally related to T139
type: ObjectProperty
sub property of: associated with T166
comment: Related by the carrying out of some function or activity.

temporally related to T136
type: ObjectProperty
sub property of: associated with T166
comment: Related in time by preceding, co-occuring with, or following.

conceptually related to T158
type: ObjectProperty
comment: Related by some abstract concept, thought, or idea.
sub property of: associated with T166

spatially related to T189
type: ObjectProperty
sub property of: associated with T166
comment: Related by place or region.

brings about T187
type: ObjectProperty
sub property of: functionally related to T139
comment: Acts on or influences an entity.

ingredient of T202
type: ObjectProperty
inverse of: has ingredient
sub property of: physically related to T132
comment: Is a component of, as in a constituent of a preparation.

conceptual part of T160
type: ObjectProperty
comment: Conceptually a portion, division, or component of some larger whole.
sub property of: part of
sub property of: conceptually related to T158
inverse of: has conceptual part