Person
type: Class
subclass of: http://lodlaundromat.org/.well-known/genid/60dc876950cdc5ab664dff74a14f6856#1
subclass of: http://lodlaundromat.org/.well-known/genid/60dc876950cdc5ab664dff74a14f6856#2
subclass of: http://lodlaundromat.org/.well-known/genid/60dc876950cdc5ab664dff74a14f6856#3
subclass of: http://lodlaundromat.org/.well-known/genid/60dc876950cdc5ab664dff74a14f6856#4
subclass of: http://lodlaundromat.org/.well-known/genid/60dc876950cdc5ab664dff74a14f6856#5
subclass of: http://lodlaundromat.org/.well-known/genid/60dc876950cdc5ab664dff74a14f6856#6
subclass of: http://lodlaundromat.org/.well-known/genid/60dc876950cdc5ab664dff74a14f6856#7
subclass of: http://lodlaundromat.org/.well-known/genid/60dc876950cdc5ab664dff74a14f6856#8
subclass of: http://lodlaundromat.org/.well-known/genid/60dc876950cdc5ab664dff74a14f6856#9
subclass of: Party
comment: A named individual. Represents an individual responsible for the creation, or contribution to an ontology

http://lodlaundromat.org/.well-known/genid/60dc876950cdc5ab664dff74a14f6856#1
type: Restriction
on property: firstName
cardinality: 1

firstName
type: DatatypeProperty
comment: The first name of a person
domain: Person
range: string

phoneNumber
type: DatatypeProperty
comment: The phone number of a person
domain: Person
range: string

faxNumber
type: DatatypeProperty
range: string
domain: Person
comment: The fax number of a person

isContactPerson
type: ObjectProperty
domain: Person
range: Organisation

Organisation
type: Class
comment: An organisation of some kind. Represents social institutions such as universities, companies, societies etc.
subclass of: http://lodlaundromat.org/.well-known/genid/60dc876950cdc5ab664dff74a14f6856#74
subclass of: http://lodlaundromat.org/.well-known/genid/60dc876950cdc5ab664dff74a14f6856#75
subclass of: http://lodlaundromat.org/.well-known/genid/60dc876950cdc5ab664dff74a14f6856#76
subclass of: http://lodlaundromat.org/.well-known/genid/60dc876950cdc5ab664dff74a14f6856#77
subclass of: http://lodlaundromat.org/.well-known/genid/60dc876950cdc5ab664dff74a14f6856#78
subclass of: Party

http://lodlaundromat.org/.well-known/genid/60dc876950cdc5ab664dff74a14f6856#6
type: Restriction
on property: eMail
min cardinality: 1

eMail
type: DatatypeProperty
comment: The email address of a person
domain: Person
range: string

http://lodlaundromat.org/.well-known/genid/60dc876950cdc5ab664dff74a14f6856#7
type: Restriction
cardinality: 1
on property: lastName

lastName
type: DatatypeProperty
range: string
comment: The surname of a person
domain: Person

Party
type: Class
subclass of: http://lodlaundromat.org/.well-known/genid/60dc876950cdc5ab664dff74a14f6856#46
subclass of: http://lodlaundromat.org/.well-known/genid/60dc876950cdc5ab664dff74a14f6856#47
subclass of: http://lodlaundromat.org/.well-known/genid/60dc876950cdc5ab664dff74a14f6856#48
subclass of: http://lodlaundromat.org/.well-known/genid/60dc876950cdc5ab664dff74a14f6856#49
subclass of: http://lodlaundromat.org/.well-known/genid/60dc876950cdc5ab664dff74a14f6856#50
subclass of: http://lodlaundromat.org/.well-known/genid/60dc876950cdc5ab664dff74a14f6856#51
subclass of: http://lodlaundromat.org/.well-known/genid/60dc876950cdc5ab664dff74a14f6856#52
subclass of: http://lodlaundromat.org/.well-known/genid/60dc876950cdc5ab664dff74a14f6856#53
subclass of: http://lodlaundromat.org/.well-known/genid/60dc876950cdc5ab664dff74a14f6856#54
comment: A party is a person or an organisation
subclass of: http://lodlaundromat.org/.well-known/genid/60dc876950cdc5ab664dff74a14f6856#55
subclass of: http://lodlaundromat.org/.well-known/genid/60dc876950cdc5ab664dff74a14f6856#56

OntologySyntax
type: Class
subclass of: http://lodlaundromat.org/.well-known/genid/60dc876950cdc5ab664dff74a14f6856#10
subclass of: http://lodlaundromat.org/.well-known/genid/60dc876950cdc5ab664dff74a14f6856#11
subclass of: http://lodlaundromat.org/.well-known/genid/60dc876950cdc5ab664dff74a14f6856#12
subclass of: http://lodlaundromat.org/.well-known/genid/60dc876950cdc5ab664dff74a14f6856#13
subclass of: http://lodlaundromat.org/.well-known/genid/60dc876950cdc5ab664dff74a14f6856#14
subclass of: http://lodlaundromat.org/.well-known/genid/60dc876950cdc5ab664dff74a14f6856#15
subclass of: http://lodlaundromat.org/.well-known/genid/60dc876950cdc5ab664dff74a14f6856#16
subclass of: http://lodlaundromat.org/.well-known/genid/60dc876950cdc5ab664dff74a14f6856#17
subclass of: Thing
comment: Information about the syntax used in an Ontology
subclass of: http://lodlaundromat.org/.well-known/genid/60dc876950cdc5ab664dff74a14f6856#18

http://lodlaundromat.org/.well-known/genid/60dc876950cdc5ab664dff74a14f6856#10
type: Restriction
on property: documentation
max cardinality: 1

documentation
type: DatatypeProperty
comment: URL for further documentation
domain: http://lodlaundromat.org/.well-known/genid/60dc876950cdc5ab664dff74a14f6856#205
range: string

developedBy
type: ObjectProperty
range: Party
domain: http://lodlaundromat.org/.well-known/genid/60dc876950cdc5ab664dff74a14f6856#183

http://lodlaundromat.org/.well-known/genid/60dc876950cdc5ab664dff74a14f6856#12
type: Restriction
on property: name
cardinality: 1

name
type: DatatypeProperty
comment: The name by which this element is formally known.
domain: http://lodlaundromat.org/.well-known/genid/60dc876950cdc5ab664dff74a14f6856#215
range: string

acronym
type: DatatypeProperty
comment: A short name by which a kR paradigm is known
domain: http://lodlaundromat.org/.well-known/genid/60dc876950cdc5ab664dff74a14f6856#191
range: string

http://lodlaundromat.org/.well-known/genid/60dc876950cdc5ab664dff74a14f6856#14
type: Restriction
on property: description
max cardinality: 1

description
type: DatatypeProperty
range: string
domain: http://lodlaundromat.org/.well-known/genid/60dc876950cdc5ab664dff74a14f6856#228
comment: Free text description of the formality level

http://lodlaundromat.org/.well-known/genid/60dc876950cdc5ab664dff74a14f6856#15
type: Restriction
on property: acronym
max cardinality: 1

KnowledgeRepresentationParadigm
type: Class
subclass of: Thing
subclass of: http://lodlaundromat.org/.well-known/genid/60dc876950cdc5ab664dff74a14f6856#19
subclass of: http://lodlaundromat.org/.well-known/genid/60dc876950cdc5ab664dff74a14f6856#20
subclass of: http://lodlaundromat.org/.well-known/genid/60dc876950cdc5ab664dff74a14f6856#21
subclass of: http://lodlaundromat.org/.well-known/genid/60dc876950cdc5ab664dff74a14f6856#22
subclass of: http://lodlaundromat.org/.well-known/genid/60dc876950cdc5ab664dff74a14f6856#23
subclass of: http://lodlaundromat.org/.well-known/genid/60dc876950cdc5ab664dff74a14f6856#24
subclass of: http://lodlaundromat.org/.well-known/genid/60dc876950cdc5ab664dff74a14f6856#25
comment: Information about a knowledge representation paradigm a particular language adheres to
subclass of: http://lodlaundromat.org/.well-known/genid/60dc876950cdc5ab664dff74a14f6856#26
subclass of: http://lodlaundromat.org/.well-known/genid/60dc876950cdc5ab664dff74a14f6856#27

http://lodlaundromat.org/.well-known/genid/60dc876950cdc5ab664dff74a14f6856#22
type: Restriction
cardinality: 1
on property: name

http://lodlaundromat.org/.well-known/genid/60dc876950cdc5ab664dff74a14f6856#23
type: Restriction
on property: description
max cardinality: 1

http://lodlaundromat.org/.well-known/genid/60dc876950cdc5ab664dff74a14f6856#25
type: Restriction
on property: acronym
max cardinality: 1

specifiedBy
type: ObjectProperty
range: Party
domain: http://lodlaundromat.org/.well-known/genid/60dc876950cdc5ab664dff74a14f6856#188

http://lodlaundromat.org/.well-known/genid/60dc876950cdc5ab664dff74a14f6856#27
type: Restriction
max cardinality: 1
on property: documentation

OntologyEngineeringTool
type: Class
subclass of: http://lodlaundromat.org/.well-known/genid/60dc876950cdc5ab664dff74a14f6856#28
subclass of: http://lodlaundromat.org/.well-known/genid/60dc876950cdc5ab664dff74a14f6856#29
comment: A tool used to create the ontology
subclass of: http://lodlaundromat.org/.well-known/genid/60dc876950cdc5ab664dff74a14f6856#30
subclass of: http://lodlaundromat.org/.well-known/genid/60dc876950cdc5ab664dff74a14f6856#31
subclass of: http://lodlaundromat.org/.well-known/genid/60dc876950cdc5ab664dff74a14f6856#32
subclass of: http://lodlaundromat.org/.well-known/genid/60dc876950cdc5ab664dff74a14f6856#33
subclass of: Thing
subclass of: http://lodlaundromat.org/.well-known/genid/60dc876950cdc5ab664dff74a14f6856#34
subclass of: http://lodlaundromat.org/.well-known/genid/60dc876950cdc5ab664dff74a14f6856#35
subclass of: http://lodlaundromat.org/.well-known/genid/60dc876950cdc5ab664dff74a14f6856#36

http://lodlaundromat.org/.well-known/genid/60dc876950cdc5ab664dff74a14f6856#31
type: Restriction
on property: acronym
max cardinality: 1

http://lodlaundromat.org/.well-known/genid/60dc876950cdc5ab664dff74a14f6856#32
type: Restriction
cardinality: 1
on property: name

http://lodlaundromat.org/.well-known/genid/60dc876950cdc5ab664dff74a14f6856#34
type: Restriction
on property: description
max cardinality: 1

http://lodlaundromat.org/.well-known/genid/60dc876950cdc5ab664dff74a14f6856#35
type: Restriction
on property: documentation
max cardinality: 1

OntologyType
type: Class
subclass of: http://lodlaundromat.org/.well-known/genid/60dc876950cdc5ab664dff74a14f6856#37
subclass of: http://lodlaundromat.org/.well-known/genid/60dc876950cdc5ab664dff74a14f6856#38
subclass of: http://lodlaundromat.org/.well-known/genid/60dc876950cdc5ab664dff74a14f6856#39
subclass of: Thing
subclass of: http://lodlaundromat.org/.well-known/genid/60dc876950cdc5ab664dff74a14f6856#40
subclass of: http://lodlaundromat.org/.well-known/genid/60dc876950cdc5ab664dff74a14f6856#41
subclass of: http://lodlaundromat.org/.well-known/genid/60dc876950cdc5ab664dff74a14f6856#42
subclass of: http://lodlaundromat.org/.well-known/genid/60dc876950cdc5ab664dff74a14f6856#43
subclass of: http://lodlaundromat.org/.well-known/genid/60dc876950cdc5ab664dff74a14f6856#44
comment: This class subsumes types of ontologies according to well-known classifications in the Ontology Engineering literature.
subclass of: http://lodlaundromat.org/.well-known/genid/60dc876950cdc5ab664dff74a14f6856#45

definedBy
type: ObjectProperty
range: Party
domain: OntologyType

http://lodlaundromat.org/.well-known/genid/60dc876950cdc5ab664dff74a14f6856#38
type: Restriction
on property: name
cardinality: 1

http://lodlaundromat.org/.well-known/genid/60dc876950cdc5ab664dff74a14f6856#40
type: Restriction
on property: documentation
max cardinality: 1

http://lodlaundromat.org/.well-known/genid/60dc876950cdc5ab664dff74a14f6856#43
type: Restriction
max cardinality: 1
on property: description

http://lodlaundromat.org/.well-known/genid/60dc876950cdc5ab664dff74a14f6856#45
type: Restriction
on property: acronym
max cardinality: 1

hasAffiliatedParty
type: ObjectProperty
range: Party
domain: Party

specifiesKnowledgeRepresentationParadigm
type: ObjectProperty
range: KnowledgeRepresentationParadigm
domain: Party

definesOntologyType
type: ObjectProperty
domain: Party
range: OntologyType

Ontology
type: Class
comment: Aspects of specific realizations are covered modular (and extendable) by the class Ontology.
subclass of: http://lodlaundromat.org/.well-known/genid/60dc876950cdc5ab664dff74a14f6856#99
subclass of: http://lodlaundromat.org/.well-known/genid/60dc876950cdc5ab664dff74a14f6856#100
subclass of: http://lodlaundromat.org/.well-known/genid/60dc876950cdc5ab664dff74a14f6856#101
subclass of: http://lodlaundromat.org/.well-known/genid/60dc876950cdc5ab664dff74a14f6856#102
subclass of: http://lodlaundromat.org/.well-known/genid/60dc876950cdc5ab664dff74a14f6856#103
subclass of: http://lodlaundromat.org/.well-known/genid/60dc876950cdc5ab664dff74a14f6856#104
subclass of: http://lodlaundromat.org/.well-known/genid/60dc876950cdc5ab664dff74a14f6856#105
subclass of: http://lodlaundromat.org/.well-known/genid/60dc876950cdc5ab664dff74a14f6856#106
subclass of: http://lodlaundromat.org/.well-known/genid/60dc876950cdc5ab664dff74a14f6856#107
subclass of: http://lodlaundromat.org/.well-known/genid/60dc876950cdc5ab664dff74a14f6856#108
subclass of: http://lodlaundromat.org/.well-known/genid/60dc876950cdc5ab664dff74a14f6856#109
subclass of: http://lodlaundromat.org/.well-known/genid/60dc876950cdc5ab664dff74a14f6856#110
subclass of: http://lodlaundromat.org/.well-known/genid/60dc876950cdc5ab664dff74a14f6856#111
subclass of: http://lodlaundromat.org/.well-known/genid/60dc876950cdc5ab664dff74a14f6856#112
subclass of: http://lodlaundromat.org/.well-known/genid/60dc876950cdc5ab664dff74a14f6856#113
subclass of: http://lodlaundromat.org/.well-known/genid/60dc876950cdc5ab664dff74a14f6856#114
subclass of: http://lodlaundromat.org/.well-known/genid/60dc876950cdc5ab664dff74a14f6856#115
subclass of: http://lodlaundromat.org/.well-known/genid/60dc876950cdc5ab664dff74a14f6856#116
subclass of: http://lodlaundromat.org/.well-known/genid/60dc876950cdc5ab664dff74a14f6856#117
subclass of: http://lodlaundromat.org/.well-known/genid/60dc876950cdc5ab664dff74a14f6856#118
subclass of: http://lodlaundromat.org/.well-known/genid/60dc876950cdc5ab664dff74a14f6856#119
subclass of: http://lodlaundromat.org/.well-known/genid/60dc876950cdc5ab664dff74a14f6856#120
subclass of: http://lodlaundromat.org/.well-known/genid/60dc876950cdc5ab664dff74a14f6856#121
subclass of: http://lodlaundromat.org/.well-known/genid/60dc876950cdc5ab664dff74a14f6856#122
subclass of: http://lodlaundromat.org/.well-known/genid/60dc876950cdc5ab664dff74a14f6856#123
subclass of: http://lodlaundromat.org/.well-known/genid/60dc876950cdc5ab664dff74a14f6856#124
subclass of: http://lodlaundromat.org/.well-known/genid/60dc876950cdc5ab664dff74a14f6856#125
subclass of: http://lodlaundromat.org/.well-known/genid/60dc876950cdc5ab664dff74a14f6856#126
subclass of: http://lodlaundromat.org/.well-known/genid/60dc876950cdc5ab664dff74a14f6856#127
subclass of: Thing
subclass of: http://lodlaundromat.org/.well-known/genid/60dc876950cdc5ab664dff74a14f6856#128
subclass of: http://lodlaundromat.org/.well-known/genid/60dc876950cdc5ab664dff74a14f6856#129
subclass of: http://lodlaundromat.org/.well-known/genid/60dc876950cdc5ab664dff74a14f6856#130
subclass of: http://lodlaundromat.org/.well-known/genid/60dc876950cdc5ab664dff74a14f6856#131
subclass of: http://lodlaundromat.org/.well-known/genid/60dc876950cdc5ab664dff74a14f6856#132
subclass of: http://lodlaundromat.org/.well-known/genid/60dc876950cdc5ab664dff74a14f6856#133
subclass of: http://lodlaundromat.org/.well-known/genid/60dc876950cdc5ab664dff74a14f6856#134
subclass of: http://lodlaundromat.org/.well-known/genid/60dc876950cdc5ab664dff74a14f6856#135
subclass of: http://lodlaundromat.org/.well-known/genid/60dc876950cdc5ab664dff74a14f6856#136
subclass of: http://lodlaundromat.org/.well-known/genid/60dc876950cdc5ab664dff74a14f6856#137
subclass of: http://lodlaundromat.org/.well-known/genid/60dc876950cdc5ab664dff74a14f6856#138
subclass of: http://lodlaundromat.org/.well-known/genid/60dc876950cdc5ab664dff74a14f6856#139
subclass of: http://lodlaundromat.org/.well-known/genid/60dc876950cdc5ab664dff74a14f6856#140
subclass of: http://lodlaundromat.org/.well-known/genid/60dc876950cdc5ab664dff74a14f6856#141
subclass of: http://lodlaundromat.org/.well-known/genid/60dc876950cdc5ab664dff74a14f6856#142
subclass of: http://lodlaundromat.org/.well-known/genid/60dc876950cdc5ab664dff74a14f6856#143
subclass of: http://lodlaundromat.org/.well-known/genid/60dc876950cdc5ab664dff74a14f6856#144
subclass of: http://lodlaundromat.org/.well-known/genid/60dc876950cdc5ab664dff74a14f6856#145
subclass of: http://lodlaundromat.org/.well-known/genid/60dc876950cdc5ab664dff74a14f6856#146
subclass of: http://lodlaundromat.org/.well-known/genid/60dc876950cdc5ab664dff74a14f6856#147
subclass of: http://lodlaundromat.org/.well-known/genid/60dc876950cdc5ab664dff74a14f6856#148
subclass of: http://lodlaundromat.org/.well-known/genid/60dc876950cdc5ab664dff74a14f6856#149
subclass of: http://lodlaundromat.org/.well-known/genid/60dc876950cdc5ab664dff74a14f6856#150
subclass of: http://lodlaundromat.org/.well-known/genid/60dc876950cdc5ab664dff74a14f6856#151
subclass of: http://lodlaundromat.org/.well-known/genid/60dc876950cdc5ab664dff74a14f6856#152
subclass of: http://lodlaundromat.org/.well-known/genid/60dc876950cdc5ab664dff74a14f6856#153
subclass of: http://lodlaundromat.org/.well-known/genid/60dc876950cdc5ab664dff74a14f6856#154
subclass of: http://lodlaundromat.org/.well-known/genid/60dc876950cdc5ab664dff74a14f6856#155
subclass of: http://lodlaundromat.org/.well-known/genid/60dc876950cdc5ab664dff74a14f6856#156
subclass of: http://lodlaundromat.org/.well-known/genid/60dc876950cdc5ab664dff74a14f6856#157
subclass of: http://lodlaundromat.org/.well-known/genid/60dc876950cdc5ab664dff74a14f6856#158
subclass of: http://lodlaundromat.org/.well-known/genid/60dc876950cdc5ab664dff74a14f6856#159
subclass of: http://lodlaundromat.org/.well-known/genid/60dc876950cdc5ab664dff74a14f6856#160
subclass of: http://lodlaundromat.org/.well-known/genid/60dc876950cdc5ab664dff74a14f6856#161
subclass of: http://lodlaundromat.org/.well-known/genid/60dc876950cdc5ab664dff74a14f6856#162
subclass of: http://lodlaundromat.org/.well-known/genid/60dc876950cdc5ab664dff74a14f6856#163
subclass of: http://lodlaundromat.org/.well-known/genid/60dc876950cdc5ab664dff74a14f6856#164
subclass of: http://lodlaundromat.org/.well-known/genid/60dc876950cdc5ab664dff74a14f6856#165

createsOntology
type: ObjectProperty
domain: Party
range: Ontology

OntologyLanguage
type: Class
subclass of: http://lodlaundromat.org/.well-known/genid/60dc876950cdc5ab664dff74a14f6856#88
comment: Information about the language in which the ontology is implemented
subclass of: http://lodlaundromat.org/.well-known/genid/60dc876950cdc5ab664dff74a14f6856#89
subclass of: http://lodlaundromat.org/.well-known/genid/60dc876950cdc5ab664dff74a14f6856#90
subclass of: http://lodlaundromat.org/.well-known/genid/60dc876950cdc5ab664dff74a14f6856#91
subclass of: http://lodlaundromat.org/.well-known/genid/60dc876950cdc5ab664dff74a14f6856#92
subclass of: http://lodlaundromat.org/.well-known/genid/60dc876950cdc5ab664dff74a14f6856#93
subclass of: http://lodlaundromat.org/.well-known/genid/60dc876950cdc5ab664dff74a14f6856#94
subclass of: Thing
subclass of: http://lodlaundromat.org/.well-known/genid/60dc876950cdc5ab664dff74a14f6856#95
subclass of: http://lodlaundromat.org/.well-known/genid/60dc876950cdc5ab664dff74a14f6856#96
subclass of: http://lodlaundromat.org/.well-known/genid/60dc876950cdc5ab664dff74a14f6856#97
subclass of: http://lodlaundromat.org/.well-known/genid/60dc876950cdc5ab664dff74a14f6856#98

developesOntologyLanguage
type: ObjectProperty
domain: Party
range: OntologyLanguage

isLocatedAt
type: ObjectProperty
range: Location
domain: Party

Location
type: Class
subclass of: http://lodlaundromat.org/.well-known/genid/60dc876950cdc5ab664dff74a14f6856#166
subclass of: http://lodlaundromat.org/.well-known/genid/60dc876950cdc5ab664dff74a14f6856#167
subclass of: http://lodlaundromat.org/.well-known/genid/60dc876950cdc5ab664dff74a14f6856#168
subclass of: http://lodlaundromat.org/.well-known/genid/60dc876950cdc5ab664dff74a14f6856#169
subclass of: http://lodlaundromat.org/.well-known/genid/60dc876950cdc5ab664dff74a14f6856#170
comment: The geographical location of a party. To keep things simple we use only DatatypeProperties instead of introducing classes for country, street, etc.
subclass of: http://lodlaundromat.org/.well-known/genid/60dc876950cdc5ab664dff74a14f6856#171
subclass of: http://lodlaundromat.org/.well-known/genid/60dc876950cdc5ab664dff74a14f6856#172
subclass of: http://lodlaundromat.org/.well-known/genid/60dc876950cdc5ab664dff74a14f6856#173

developesOntologyEngineeringTool
type: ObjectProperty
domain: Party
range: OntologyEngineeringTool

OntologyEngineeringMethodology
type: Class
subclass of: http://lodlaundromat.org/.well-known/genid/60dc876950cdc5ab664dff74a14f6856#79
subclass of: http://lodlaundromat.org/.well-known/genid/60dc876950cdc5ab664dff74a14f6856#80
subclass of: http://lodlaundromat.org/.well-known/genid/60dc876950cdc5ab664dff74a14f6856#81
subclass of: http://lodlaundromat.org/.well-known/genid/60dc876950cdc5ab664dff74a14f6856#82
subclass of: http://lodlaundromat.org/.well-known/genid/60dc876950cdc5ab664dff74a14f6856#83
subclass of: http://lodlaundromat.org/.well-known/genid/60dc876950cdc5ab664dff74a14f6856#84
subclass of: http://lodlaundromat.org/.well-known/genid/60dc876950cdc5ab664dff74a14f6856#85
comment: Information about the ontology engineering methodology
subclass of: http://lodlaundromat.org/.well-known/genid/60dc876950cdc5ab664dff74a14f6856#86
subclass of: http://lodlaundromat.org/.well-known/genid/60dc876950cdc5ab664dff74a14f6856#87
subclass of: Thing

developesOntologyEngineeringMethodology
type: ObjectProperty
domain: Party
range: OntologyEngineeringMethodology

contributesToOntology
type: ObjectProperty
range: Ontology
domain: Party

developesOntologySyntax
type: ObjectProperty
range: OntologySyntax
domain: Party

specifiesLicense
type: ObjectProperty
range: LicenseModel
domain: Party

LicenseModel
type: Class
subclass of: http://lodlaundromat.org/.well-known/genid/60dc876950cdc5ab664dff74a14f6856#174
subclass of: http://lodlaundromat.org/.well-known/genid/60dc876950cdc5ab664dff74a14f6856#175
subclass of: http://lodlaundromat.org/.well-known/genid/60dc876950cdc5ab664dff74a14f6856#176
subclass of: http://lodlaundromat.org/.well-known/genid/60dc876950cdc5ab664dff74a14f6856#177
subclass of: http://lodlaundromat.org/.well-known/genid/60dc876950cdc5ab664dff74a14f6856#178
comment: A license model describing the usage conditions for an ontology
subclass of: Thing
subclass of: http://lodlaundromat.org/.well-known/genid/60dc876950cdc5ab664dff74a14f6856#179
subclass of: http://lodlaundromat.org/.well-known/genid/60dc876950cdc5ab664dff74a14f6856#180
subclass of: http://lodlaundromat.org/.well-known/genid/60dc876950cdc5ab664dff74a14f6856#181
subclass of: http://lodlaundromat.org/.well-known/genid/60dc876950cdc5ab664dff74a14f6856#182

OntologyDomain
type: Class
subclass of: http://lodlaundromat.org/.well-known/genid/60dc876950cdc5ab664dff74a14f6856#57
subclass of: Thing
subclass of: http://lodlaundromat.org/.well-known/genid/60dc876950cdc5ab664dff74a14f6856#58
subclass of: http://lodlaundromat.org/.well-known/genid/60dc876950cdc5ab664dff74a14f6856#59
subclass of: http://lodlaundromat.org/.well-known/genid/60dc876950cdc5ab664dff74a14f6856#60
subclass of: http://lodlaundromat.org/.well-known/genid/60dc876950cdc5ab664dff74a14f6856#61

URI
type: DatatypeProperty
comment: The URI of the ontology which is described by this metadata
range: string
domain: http://lodlaundromat.org/.well-known/genid/60dc876950cdc5ab664dff74a14f6856#202

http://lodlaundromat.org/.well-known/genid/60dc876950cdc5ab664dff74a14f6856#59
type: Restriction
on property: URI
cardinality: 1

http://lodlaundromat.org/.well-known/genid/60dc876950cdc5ab664dff74a14f6856#61
type: Restriction
cardinality: 1
on property: name

FormalityLevel
type: Class
subclass of: http://lodlaundromat.org/.well-known/genid/60dc876950cdc5ab664dff74a14f6856#62
subclass of: http://lodlaundromat.org/.well-known/genid/60dc876950cdc5ab664dff74a14f6856#63
subclass of: http://lodlaundromat.org/.well-known/genid/60dc876950cdc5ab664dff74a14f6856#64
subclass of: Thing
subclass of: http://lodlaundromat.org/.well-known/genid/60dc876950cdc5ab664dff74a14f6856#65
comment: The level of formality of an ontology

http://lodlaundromat.org/.well-known/genid/60dc876950cdc5ab664dff74a14f6856#64
type: Restriction
cardinality: 1
on property: name

http://lodlaundromat.org/.well-known/genid/60dc876950cdc5ab664dff74a14f6856#65
type: Restriction
on property: description
max cardinality: 1

OntologyTask
type: Class
subclass of: http://lodlaundromat.org/.well-known/genid/60dc876950cdc5ab664dff74a14f6856#66
subclass of: http://lodlaundromat.org/.well-known/genid/60dc876950cdc5ab664dff74a14f6856#67
comment: Information about the task the ontology was intended to be used for
subclass of: http://lodlaundromat.org/.well-known/genid/60dc876950cdc5ab664dff74a14f6856#68
subclass of: Thing
subclass of: http://lodlaundromat.org/.well-known/genid/60dc876950cdc5ab664dff74a14f6856#69
subclass of: http://lodlaundromat.org/.well-known/genid/60dc876950cdc5ab664dff74a14f6856#70
subclass of: http://lodlaundromat.org/.well-known/genid/60dc876950cdc5ab664dff74a14f6856#71
subclass of: http://lodlaundromat.org/.well-known/genid/60dc876950cdc5ab664dff74a14f6856#72
subclass of: http://lodlaundromat.org/.well-known/genid/60dc876950cdc5ab664dff74a14f6856#73

http://lodlaundromat.org/.well-known/genid/60dc876950cdc5ab664dff74a14f6856#68
type: Restriction
on property: description
max cardinality: 1

http://lodlaundromat.org/.well-known/genid/60dc876950cdc5ab664dff74a14f6856#70
type: Restriction
on property: name
cardinality: 1

http://lodlaundromat.org/.well-known/genid/60dc876950cdc5ab664dff74a14f6856#71
type: Restriction
on property: acronym
max cardinality: 1

http://lodlaundromat.org/.well-known/genid/60dc876950cdc5ab664dff74a14f6856#72
type: Restriction
on property: documentation
max cardinality: 1

hasContactPerson
type: ObjectProperty
range: Person
domain: Organisation

http://lodlaundromat.org/.well-known/genid/60dc876950cdc5ab664dff74a14f6856#76
type: Restriction
cardinality: 1
on property: acronym

http://lodlaundromat.org/.well-known/genid/60dc876950cdc5ab664dff74a14f6856#78
type: Restriction
cardinality: 1
on property: name

http://lodlaundromat.org/.well-known/genid/60dc876950cdc5ab664dff74a14f6856#80
type: Restriction
max cardinality: 1
on property: description

http://lodlaundromat.org/.well-known/genid/60dc876950cdc5ab664dff74a14f6856#85
type: Restriction
on property: documentation
max cardinality: 1

http://lodlaundromat.org/.well-known/genid/60dc876950cdc5ab664dff74a14f6856#86
type: Restriction
max cardinality: 1
on property: acronym

http://lodlaundromat.org/.well-known/genid/60dc876950cdc5ab664dff74a14f6856#87
type: Restriction
cardinality: 1
on property: name

supportsRepresentationParadigm
type: ObjectProperty
domain: OntologyLanguage
range: KnowledgeRepresentationParadigm

hasSyntax
type: ObjectProperty
domain: OntologyLanguage
range: OntologySyntax

http://lodlaundromat.org/.well-known/genid/60dc876950cdc5ab664dff74a14f6856#92
type: Restriction
on property: documentation
max cardinality: 1

http://lodlaundromat.org/.well-known/genid/60dc876950cdc5ab664dff74a14f6856#94
type: Restriction
max cardinality: 1
on property: description

http://lodlaundromat.org/.well-known/genid/60dc876950cdc5ab664dff74a14f6856#96
type: Restriction
max cardinality: 1
on property: acronym

http://lodlaundromat.org/.well-known/genid/60dc876950cdc5ab664dff74a14f6856#97
type: Restriction
cardinality: 1
on property: name

hasFormalityLevel
type: ObjectProperty
range: FormalityLevel
domain: Ontology

hasOntologyLanguage
type: ObjectProperty
domain: Ontology
range: OntologyLanguage

resourceLocator
type: DatatypeProperty
domain: Ontology
range: string
comment: The location where the ontology can be found. It should be accessible via a URL

hasDomain
type: ObjectProperty
range: OntologyDomain
domain: Ontology

http://lodlaundromat.org/.well-known/genid/60dc876950cdc5ab664dff74a14f6856#105
type: Restriction
max cardinality: 1
on property: containsABox

containsABox
type: DatatypeProperty
range: boolean
domain: Ontology
comment: Indicates if the ontology contains role assertions between individuals and membership assertions (e.g. concept instantiation, role instantiation). It includes axioms of the form a : C, R(a, b), and a ? b, where a, b are individuals.

http://lodlaundromat.org/.well-known/genid/60dc876950cdc5ab664dff74a14f6856#108
type: Restriction
on property: isConsistentAccordingToReasoner
max cardinality: 1

isConsistentAccordingToReasoner
type: DatatypeProperty
comment: Indicates whether a reasoner has classified the ontology correctly. The definition of consistency is independent of a reasoner. The assumption is that the reasoner used for consistency checking operates correctly, i.e. according to the well-defined semantics of the ontology language
range: boolean
domain: Ontology

http://lodlaundromat.org/.well-known/genid/60dc876950cdc5ab664dff74a14f6856#109
type: Restriction
max cardinality: 1
on property: expressiveness

expressiveness
type: DatatypeProperty
domain: Ontology
comment: Indicates the expressiveness of the language used by the ontology (that could be expressed in terms of the underlying DL, e.g. ALCN(D), SHIF(D), etc.)
range: string

http://lodlaundromat.org/.well-known/genid/60dc876950cdc5ab664dff74a14f6856#110
type: Restriction
cardinality: 1
on property: isOfType

isOfType
type: ObjectProperty
domain: Ontology
range: OntologyType

http://lodlaundromat.org/.well-known/genid/60dc876950cdc5ab664dff74a14f6856#111
type: Restriction
max cardinality: 1
on property: status

status
type: DatatypeProperty
range: string
comment: It specifies the tracking information for the contents of the ontology. Pre-defined values
domain: Ontology

hasOntologySyntax
type: ObjectProperty
range: OntologySyntax
domain: Ontology

numIndividuals
type: DatatypeProperty
comment: Number of individuals in the ontology
domain: Ontology
range: integer

naturalLanguage
type: DatatypeProperty
range: string
comment: The language of the content of the ontology, i.e. English, German, etc.
domain: Ontology

usedKnowledgeRepresentationParadigm
type: ObjectProperty
domain: Ontology
range: KnowledgeRepresentationParadigm

useImports
type: ObjectProperty
range: Ontology
domain: Ontology

creationDate
type: DatatypeProperty
domain: Ontology
range: string
comment: Date when the ontology was initially created

version
type: DatatypeProperty
domain: Ontology
range: string
comment: Specifies the version information of the ontology. Version information could be useful for tracking, comparing and merging ontologies. The number could be incremented by 1, or a smaller or larger value, depending on the personal preference of the author.

http://lodlaundromat.org/.well-known/genid/60dc876950cdc5ab664dff74a14f6856#119
type: Restriction
max cardinality: 1
on property: containsRBox

containsRBox
type: DatatypeProperty
range: boolean
domain: Ontology
comment: Indicates if the ontology contains assertions about roles (properties) and role hierarchies (e.g. subsumption, equivalence, transitivity). Among others, it includes role definitions, transitivity axioms of the form Tr(R) and role inclusion axioms: (i) of the form R v S, where R; S are roles (simple role inclusion SRI), (ii) of the form R o S v R and S o R v R where R is a role and S is a simple role (i.e. complex role inclusion).

http://lodlaundromat.org/.well-known/genid/60dc876950cdc5ab664dff74a14f6856#120
type: Restriction
on property: hasPriorVersion
max cardinality: 1

hasPriorVersion
type: ObjectProperty
domain: Ontology
range: Ontology

http://lodlaundromat.org/.well-known/genid/60dc876950cdc5ab664dff74a14f6856#122
type: Restriction
min cardinality: 1
on property: hasCreator

hasCreator
type: ObjectProperty
range: Party
domain: Ontology

http://lodlaundromat.org/.well-known/genid/60dc876950cdc5ab664dff74a14f6856#124
type: Restriction
on property: description
cardinality: 1

http://lodlaundromat.org/.well-known/genid/60dc876950cdc5ab664dff74a14f6856#125
type: Restriction
cardinality: 1
on property: numClasses

numClasses
type: DatatypeProperty
comment: Number of classes in the ontology
range: integer
domain: Ontology

http://lodlaundromat.org/.well-known/genid/60dc876950cdc5ab664dff74a14f6856#126
type: Restriction
cardinality: 1
on property: numProperties

numProperties
type: DatatypeProperty
comment: Number of properties in the ontology
range: integer
domain: Ontology

http://lodlaundromat.org/.well-known/genid/60dc876950cdc5ab664dff74a14f6856#127
type: Restriction
on property: modificationDate
max cardinality: 1

modificationDate
type: DatatypeProperty
comment: Date of the last modification made to the ontology
range: string
domain: Ontology

hasContributor
type: ObjectProperty
range: Party
domain: Ontology

isIncompatibleWith
type: ObjectProperty
domain: Ontology
range: Ontology

hasLicense
type: ObjectProperty
range: LicenseModel
domain: Ontology

http://lodlaundromat.org/.well-known/genid/60dc876950cdc5ab664dff74a14f6856#132
type: Restriction
on property: documentation
max cardinality: 1

http://lodlaundromat.org/.well-known/genid/60dc876950cdc5ab664dff74a14f6856#133
type: Restriction
on property: URI
cardinality: 1

http://lodlaundromat.org/.well-known/genid/60dc876950cdc5ab664dff74a14f6856#134
type: Restriction
on property: name
min cardinality: 1

http://lodlaundromat.org/.well-known/genid/60dc876950cdc5ab664dff74a14f6856#136
type: Restriction
cardinality: 1
on property: numAxioms

numAxioms
type: DatatypeProperty
comment: Number of axioms in the ontology
domain: Ontology
range: integer

http://lodlaundromat.org/.well-known/genid/60dc876950cdc5ab664dff74a14f6856#137
type: Restriction
cardinality: 1
on property: acronym

http://lodlaundromat.org/.well-known/genid/60dc876950cdc5ab664dff74a14f6856#138
type: Restriction
on property: creationDate
cardinality: 1

http://lodlaundromat.org/.well-known/genid/60dc876950cdc5ab664dff74a14f6856#140
type: Restriction
cardinality: 1
on property: numIndividuals

http://lodlaundromat.org/.well-known/genid/60dc876950cdc5ab664dff74a14f6856#141
type: Restriction
on property: version
cardinality: 1

usedOntologyEngineeringTool
type: ObjectProperty
range: OntologyEngineeringTool
domain: Ontology

notes
type: DatatypeProperty
range: string
domain: Ontology
comment: Additional information can be expressed here. Kind of like the stuff you don't want to put inside documentation

keyClasses
type: DatatypeProperty
domain: Ontology
comment: Indicates what the central/best represented classes of the ontology are.
range: string

endorsedBy
type: ObjectProperty
comment: Indicates the parties (i.e. organisations, people) that have expressed support or approval to the this ontology.
range: Party
domain: Ontology

http://lodlaundromat.org/.well-known/genid/60dc876950cdc5ab664dff74a14f6856#148
type: Restriction
max cardinality: 1
on property: notes

isBackwardCompatibleWith
type: ObjectProperty
domain: Ontology
range: Ontology

http://lodlaundromat.org/.well-known/genid/60dc876950cdc5ab664dff74a14f6856#154
type: Restriction
on property: hasFormalityLevel
max cardinality: 1

http://lodlaundromat.org/.well-known/genid/60dc876950cdc5ab664dff74a14f6856#155
type: Restriction
max cardinality: 1
on property: hasLicense

http://lodlaundromat.org/.well-known/genid/60dc876950cdc5ab664dff74a14f6856#156
type: Restriction
max cardinality: 1
on property: containsTBox

containsTBox
type: DatatypeProperty
domain: Ontology
comment: Indicates if the ontology contains assertions about concepts (e.g. subsumption, equivalence). It includes concept definitions (i.e. in the form of A=C which define a concept name A by a concept description C) and general concept inclusion axioms (GCIs) (i.e. of the form C v D, where both C and D are arbitrary concept descriptions).
range: boolean

designedForOntologyTask
type: ObjectProperty
domain: Ontology
range: OntologyTask

http://lodlaundromat.org/.well-known/genid/60dc876950cdc5ab664dff74a14f6856#162
type: Restriction
on property: hasOntologySyntax
cardinality: 1

keywords
type: DatatypeProperty
comment: List of keywords related to an ontology. Typically this set includes words that describe the content of the ontology
range: string
domain: Ontology

http://lodlaundromat.org/.well-known/genid/60dc876950cdc5ab664dff74a14f6856#164
type: Restriction
cardinality: 1
on property: resourceLocator

usedOntologyEngineeringMethodology
type: ObjectProperty
domain: Ontology
range: OntologyEngineeringMethodology

city
type: DatatypeProperty
domain: Location
range: string
comment: Name of the city (and zip code).

http://lodlaundromat.org/.well-known/genid/60dc876950cdc5ab664dff74a14f6856#167
type: Restriction
on property: street
max cardinality: 1

street
type: DatatypeProperty
domain: Location
comment: Name of the street and number (address).
range: string

http://lodlaundromat.org/.well-known/genid/60dc876950cdc5ab664dff74a14f6856#168
type: Restriction
on property: country
max cardinality: 1

country
type: DatatypeProperty
domain: Location
range: string
comment: The name of the country

state
type: DatatypeProperty
range: string
domain: Location
comment: The state of a country.

http://lodlaundromat.org/.well-known/genid/60dc876950cdc5ab664dff74a14f6856#171
type: Restriction
max cardinality: 1
on property: state

http://lodlaundromat.org/.well-known/genid/60dc876950cdc5ab664dff74a14f6856#172
type: Restriction
max cardinality: 1
on property: city

http://lodlaundromat.org/.well-known/genid/60dc876950cdc5ab664dff74a14f6856#174
type: Restriction
max cardinality: 1
on property: description

http://lodlaundromat.org/.well-known/genid/60dc876950cdc5ab664dff74a14f6856#175
type: Restriction
max cardinality: 1
on property: documentation

http://lodlaundromat.org/.well-known/genid/60dc876950cdc5ab664dff74a14f6856#176
type: Restriction
on property: name
cardinality: 1

http://lodlaundromat.org/.well-known/genid/60dc876950cdc5ab664dff74a14f6856#178
type: Restriction
on property: acronym
max cardinality: 1

Apple Public Source License (APSL)
type: LicenseModel

Thesaurus
type: FormalityLevel

SearchTask
type: OntologyTask
comment: the task characterizes how ontologies are used to refine common keywordbased search algorithms using domain knowledge in form of subsumption relations. Ontology-driven search is usually performed automatically by means of reasoning services handling particular aspects of an ontology representation language.

AnnotationTask
type: OntologyTask
comment: the ontology is used as a controlled vocabulary to annotate Semantic Web resources. This task includes the usage of a semantically rich ontology for representing arbitrarily complex annotation statements on these resources. The task can be performed manually or (semi-)automatically.

Description Logics
type: KnowledgeRepresentationParadigm

Open Software License (OSL)
type: LicenseModel

QueryRewritingTask
type: OntologyTask
comment: complementary to the query formulation dimension, this task applies ontologies to semantically optimize query expressions by means of the domain knowledge (constraints, subsumption relations etc.) The task can be interpreted as a particular art of filtering information. The task is performed automatically; however, it assumes the availability of patterns describing the transformations at query level.

Frames
type: KnowledgeRepresentationParadigm

FilteringTask
type: OntologyTask
comment: the task describes at a very general level how ontologies are applied to refine the solution space of a certain problem, such as information retrieval or personalization. The task is targeted at being performed semi-automatically or automatically.

General Public License (GPL)
type: LicenseModel

Task Ontology
type: OntologyType
comment: describes generic types of tasks or activities e.g. selling, selecting.

Upper Level Ontology
type: OntologyType
comment: describes general, domain-independent concepts e.g. space, time

OWL-Lite
type: OntologyLanguage

Vocabulary
type: FormalityLevel

Taxonomy
type: FormalityLevel

Application Ontology
type: OntologyType
comment: describes some domain in an application-dependent manner

IntegrationTask
type: OntologyTask
comment: the task characterizes how ontologies provide an integrating environment, an inter-lingua, for information repositories or software tools. In this scenario the ontology is applied (semi-)automatically to merge between heterogeneous data pools in the same or in adjacent domains.

DAML-OIL
type: OntologyLanguage

QueryFormulationTask
type: OntologyTask
comment: the ontology is used in information retrieval settings as a controlled vocabulary for representing user queries. Usually the task is performed automatically in that the concepts of the ontology is are listed in a query formulation front-end in order to allow users to specifies their queries.

IBM Public License (IBM PL)
type: LicenseModel

Core Ontology
type: OntologyType
comment: describes the most important concepts in a specific domain

MediationTask
type: OntologyTask
comment: the ontology is built to reduce the ambiguities between communicating human or machine agents. It can act as a normative model which formally and clearly defines the meaning of the terms employed in agent interactions. In the context of programmed agents, the task is envisioned to be performed automatically.

ConfigurationTask
type: OntologyTask
comment: the ontology is designed to provide a controlled and unambiguous means to represent valid configuration profiles in application systems. As the aim of the ontology is to support the operationalization of particular system-related processes; this task is performed automatically in that the ontology is processed in an automatic manner by means of reasoners or APIs.

Schema
type: FormalityLevel

RDF(S)
type: OntologyLanguage

Common Public License (CPL)
type: LicenseModel

Lesser General Public License (LGPL)
type: LicenseModel

OWL
type: OntologyLanguage

OWL-DL
type: OntologyLanguage

PersonalizationTask
type: OntologyTask
comment: the ontology is used mainly for providing personalized access to information resources. Individual user preferences w.r.t. particular application settings are formally specified by means of an ontology, which, in conjunction with appropriate reasoning services, can be directly integrated to a personalization component for filtering purposes. The usage of ontologies in personalization tasks might be carried out in various forms, from a direct involvement of the user who manually specifies ontological concepts which optimally describe his preferences, to the ontological modelling of user profiles.

IndexingTask
type: OntologyTask
comment: in this scenario, the goal of the ontology is to provide a clearly defined classification and browsing structure for the information items in a repository. Again, the task can be performed manually by domain experts or as part of an application in an automatic or semi-automatic way.

Domain Ontology
type: OntologyType
comment: describes some domain of the world

OWL-Full
type: OntologyLanguage

MatchingTask
type: OntologyTask
comment: the goal of matching is to establish links between semantically similar data items in information repositories. In contrast to the previous task, matching does not include the production of a shared final schema/ontology as a result of aggregating the matched source elements to common elements. W.r.t. the automatization level the range varies from manual to fully-automatical execution.

INTEL Open Source License (INTEL OSL)
type: LicenseModel

Modified BSD License (mBSD)
type: LicenseModel

OWL-XML
type: OntologySyntax

Academic Free License (AFL)
type: LicenseModel

RDF/XML
type: OntologySyntax

Terminology
type: FormalityLevel