O'Reilly Namespace for metadata terms in the O'Reilly Product Type Vocabulary
type: VocabularyEncodingScheme
modified: 2008-04-21
publisher: O'Reilly Media Inc.
type: Ontology
comment: To comment on this schema, please contact metadata@oreilly.com.

Software Application
type: Class
comment: A computer program.
subclass of: ElectroniclyDeliveredProduct
member of: O'Reilly Namespace for metadata terms in the O'Reilly Product Type Vocabulary
description: Examples include Word, Excel, grep, bash, and iPhone: TMM 2e App.
oracle suffix: APP

iPhone Application
type: Class
comment: Application intended to be run on the Apple iPhone 2.x or 3.x platforms. Frequently used for distributing an Ebook as an iPhone Application.
subclass of: ElectroniclyDeliveredProduct
subclass of: Software Application
member of: O'Reilly Namespace for metadata terms in the O'Reilly Product Type Vocabulary
description: Examples include iPhone: TMM 2e App, iPhone: TMM 3.0, iPod: TMM, and iPod: TMM (Censored Edition).
oracle suffix: APP
identified by: urn:isbn:
available through: itunes

Data Services
type: Class
subclass of: NonInventoriedProduct
member of: O'Reilly Namespace for metadata terms in the O'Reilly Product Type Vocabulary
oracle suffix: DATAS

Educational Supplement
type: Class
member of: O'Reilly Namespace for metadata terms in the O'Reilly Product Type Vocabulary
has format: http://purl.oreilly.com/formats/pdf
subclass of: ElectroniclyDeliveredProduct
subclass of: PaginatedProduct
oracle suffix: PDF
comment: Supplementary PDFs intended for use in an educational setting.
description: Examples include Student Workbooks, Practice Exams, and Instructor Guides.
identified by: urn:isbn:

Rough Cut
type: Class
comment: Pre-publication editon of a book accessed through Safari Books Online.
identified by: urn:isbn:
member of: O'Reilly Namespace for metadata terms in the O'Reilly Product Type Vocabulary
subclass of: Safari Books Online
subclass of: ElectroniclyDeliveredProduct
subclass of: EditoralProduct
subclass of: PaginatedProduct
subclass of: EarlyReleaseProduct
oracle suffix: RCUT
shown on: catalog
available through: oreilly com
available through: safari

Safari Books Online
type: Class
identified by: urn:isbn:
subclass of: ElectroniclyDeliveredProduct
subclass of: EditoralProduct
member of: O'Reilly Namespace for metadata terms in the O'Reilly Product Type Vocabulary
comment: A book available through Safari Books Online.
oracle suffix: SAF
shown on: catalog
available through: oreilly com
available through: safari

Ebook
type: Class
comment: An Ebook that contains the whole work, available in multiple formats, sold through oreilly.com.
has format: mobi
has format: http://purl.oreilly.com/formats/pdf
has format: android app
has format: epub
has format: mathematica
has format: DAISY
has format: CDContent
member of: O'Reilly Namespace for metadata terms in the O'Reilly Product Type Vocabulary
identified by: urn:isbn:
subclass of: EditoralProduct
subclass of: ElectroniclyDeliveredProduct
subclass of: PaginatedProduct
oracle suffix: EBOOK
shown on: catalog
available through: oreilly com

PDF
type: Class
identified by: urn:isbn:
subclass of: ElectroniclyDeliveredProduct
subclass of: EditoralProduct
subclass of: PaginatedProduct
description: Examples include Amazon eDocs.
has format: http://purl.oreilly.com/formats/pdf
member of: O'Reilly Namespace for metadata terms in the O'Reilly Product Type Vocabulary
comment: PDF file that contains the whole work. Sold or distributed through PDF-only sales channels.
oracle suffix: PDF
available through: ebooks com
available through: ebookpie
available through: follett
available through: scribd
available through: amazon edocs
available through: kobo
available through: paperc
available through: dawson
available through: examville

Research Report Site License
type: Class
has format: http://purl.oreilly.com/formats/pdf
member of: O'Reilly Namespace for metadata terms in the O'Reilly Product Type Vocabulary
subclass of: ElectroniclyDeliveredProduct
subclass of: PaginatedProduct
oracle suffix: PDF
comment: Radar Research Report Site Licenses, sold through oreilly.com
identified by: urn:isbn:
shown on: catalog
available through: oreilly com

Secondary Safari Books Online
type: Class
identified by: urn:isbn:
subclass of: ElectroniclyDeliveredProduct
subclass of: EditoralProduct
member of: O'Reilly Namespace for metadata terms in the O'Reilly Product Type Vocabulary
comment: Some products must have two or more Safari product records do to limitations in BVD Safari 5.x. Records other then the primary should have this product type.
description: Examples include Videos for One-on-One training books.
oracle suffix: SAF
available through: safari

Safari Videos Online
type: Class
identified by: urn:isbn:
subclass of: ElectroniclyDeliveredProduct
subclass of: EditoralProduct
member of: O'Reilly Namespace for metadata terms in the O'Reilly Product Type Vocabulary
comment: A video available through Safari Books Online
oracle suffix: SAFV
available through: safari

Mobi
type: Class
has format: mobi
comment: Mobipocket file that contains the whole work. Distributed through channels other than oreilly.com.
identified by: urn:isbn:
member of: O'Reilly Namespace for metadata terms in the O'Reilly Product Type Vocabulary
description: Examples include products sold via Amazon Kindle Store, among others.
subclass of: EditoralProduct
subclass of: ElectroniclyDeliveredProduct
subclass of: PaginatedProduct
oracle suffix: MOBI
available through: kindle

EPUB
type: Class
has format: epub
comment: IDPF EPUB file that contains the whole work. Distributed through channels other than oreilly.com.
identified by: urn:isbn:
member of: O'Reilly Namespace for metadata terms in the O'Reilly Product Type Vocabulary
subclass of: EditoralProduct
subclass of: ElectroniclyDeliveredProduct
oracle suffix: EPUB
available through: barnes and noble
available through: ebooks com
available through: ebookpie
available through: bookglutton
available through: legacy stanza
available through: legacy aldiko
available through: entourage edge
available through: diesel
available through: books on board
available through: wordplayer
available through: woodslane
available through: immatériel
available through: ibookstore
available through: google
available through: ecarrel
available through: kobo

Chapter
type: Class
has format: http://purl.oreilly.com/formats/pdf
description: This is a roll up product type. Not every chapter of a book will have a unique product, rather a single IP family will have a single CHAPT product related to it.
member of: O'Reilly Namespace for metadata terms in the O'Reilly Product Type Vocabulary
subclass of: ElectroniclyDeliveredProduct
subclass of: EditoralProduct
subclass of: PaginatedProduct
comment: Single content fragment from a product at the chapter (or chapter-like) level.
oracle suffix: CHAPT

Online Advertising
type: Class
comment: Ad sales from online sites.
member of: O'Reilly Namespace for metadata terms in the O'Reilly Product Type Vocabulary
subclass of: NonInventoriedProduct
oracle suffix: ONLAD

Video
type: Class
has format: quicktime
identified by: urn:epc:id:gtin:
comment: Video Content
subclass of: ElectroniclyDeliveredProduct
subclass of: EditoralProduct
subclass of: DurativeProduct
member of: O'Reilly Namespace for metadata terms in the O'Reilly Product Type Vocabulary
description: Examples include videos of conference proceedings, screencasts and interviews.
oracle suffix: VIDEO
shown on: catalog
available through: oreilly com

Booth
type: Class
subclass of: NonInventoriedProduct
member of: O'Reilly Namespace for metadata terms in the O'Reilly Product Type Vocabulary
oracle suffix: BOOTH

DVD
type: Class
description: Examples include DVDs of conference proceedings. Labeling as "DVD-Video" based on Amazon practices.
comment: DVD with video content as opposed to a DVD-ROM.
identified by: urn:epc:id:gtin:
member of: O'Reilly Namespace for metadata terms in the O'Reilly Product Type Vocabulary
subclass of: EditoralProduct
subclass of: InventoriedProduct
subclass of: DurativeProduct
oracle suffix: DVD
shown on: catalog
available through: oreilly com

Learning Solutions
type: Class
member of: O'Reilly Namespace for metadata terms in the O'Reilly Product Type Vocabulary
subclass of: NonInventoriedProduct
oracle suffix: LSOL

License
type: Class
comment: Licensing is the ability to reuse a single product.
description: Examples include a single company reusing a single book, making copies as necessary for employees.
subclass of: NonInventoriedProduct
member of: O'Reilly Namespace for metadata terms in the O'Reilly Product Type Vocabulary
oracle suffix: LIC
identified by: urn:epc:id:gtin:

Intellectual Property
type: Class
description: Examples include Java in a Nutshell, 5th Edition. May have a book, PDF, EBOOK, MOBI, and Safari representation, among others. Representations (Product Types) of an Intellectual Property should also be in the O'Reilly Product Type Vocabulary
comment: Content for which there are many products.
subclass of: Product
member of: O'Reilly Namespace for metadata terms in the O'Reilly Product Type Vocabulary
oracle suffix: IP
identified by: urn:epc:id:gtin:

Webinar
type: Class
member of: O'Reilly Namespace for metadata terms in the O'Reilly Product Type Vocabulary
description: Examples include presentations, lectures, workshops or seminars that are transmitted over the Web. A webinar can be collaborative and include polling and question & answer sessions to allow full participation between the audience and the presenter
has format: webexInvite
subclass of: ElectroniclyDeliveredProduct
subclass of: DurativeProduct
comment: Web Conference
identified by: urn:epc:id:gtin:
oracle suffix: WEVT

Rights
type: Class
member of: O'Reilly Namespace for metadata terms in the O'Reilly Product Type Vocabulary
comment: Rights allow the purchaser to reuse pieces of content in new products.
subclass of: NonInventoriedProduct
oracle suffix: RIGHT
identified by: urn:epc:id:gtin:

Up-to-Date
type: Class
member of: O'Reilly Namespace for metadata terms in the O'Reilly Product Type Vocabulary
comment: An Up-to-Date packet that updates a previously published product.
description: Examples include printed matter that is designed to be placed in a binder. This does NOT include PDF updates of the exact same content or errata (physical objects only).
subclass of: InventoriedProduct
oracle suffix: BOOK
shown on: catalog
available through: oreilly com

Newsletter
type: Class
member of: O'Reilly Namespace for metadata terms in the O'Reilly Product Type Vocabulary
subclass of: InventoriedProduct
oracle suffix: BOOK
identified by: urn:isbn:

Consulting
type: Class
member of: O'Reilly Namespace for metadata terms in the O'Reilly Product Type Vocabulary
subclass of: NonInventoriedProduct
comment: Consulting sold on an hourly or project basis.
description: Examples include work done by the O'Reilly Web 2.0 consulting group.
oracle suffix: CNSLT

Print NonDistributable
type: Class
member of: O'Reilly Namespace for metadata terms in the O'Reilly Product Type Vocabulary
subclass of: EditoralProduct
subclass of: PaginatedProduct
identified by: urn:isbn:
comment: Metadata for a book that is not distributable.
oracle suffix: BOOK
available through: oreilly com
available through: amazon
available through: amazonuk
available through: bds
available through: bowker
available through: genzmag
available through: hbfenn
available through: ingram
available through: open library
available through: roodveldt
available through: staging
excludes data target: oracle
excludes data target: cs

Print
type: Class
member of: O'Reilly Namespace for metadata terms in the O'Reilly Product Type Vocabulary
subclass of: EditoralProduct
subclass of: InventoriedProduct
subclass of: PaginatedProduct
identified by: urn:isbn:
comment: A phsyical book that is bound and sold.
oracle suffix: BOOK
shown on: catalog
available through: oreilly com
available through: amazon
available through: amazonuk
available through: bds
available through: bowker
available through: genzmag
available through: hbfenn
available through: ingram
available through: open library
available through: roodveldt
available through: staging

CD
type: Class
subclass of: InventoriedProduct
member of: O'Reilly Namespace for metadata terms in the O'Reilly Product Type Vocabulary
comment: A number of works grouped on CD-ROMs.
oracle suffix: BOOK
shown on: catalog
available through: oreilly com

Set
type: Class
member of: O'Reilly Namespace for metadata terms in the O'Reilly Product Type Vocabulary
subclass of: InventoriedProduct
subclass of: PaginatedProduct
description: Microsoft Press Set
identified by: urn:isbn:
oracle suffix: BOOK
shown on: catalog
available through: oreilly com
available through: amazon
available through: amazonuk
available through: bds
available through: bowker
available through: genzmag
available through: hbfenn
available through: ingram
available through: open library
available through: roodveldt

Kit
type: Class
member of: O'Reilly Namespace for metadata terms in the O'Reilly Product Type Vocabulary
subclass of: InventoriedProduct
subclass of: PaginatedProduct
description: Microsoft Press Kit
identified by: urn:isbn:
oracle suffix: BOOK
shown on: catalog
available through: oreilly com
available through: amazon
available through: amazonuk
available through: bds
available through: bowker
available through: genzmag
available through: hbfenn
available through: ingram
available through: open library
available through: roodveldt

Merchandise
type: Class
member of: O'Reilly Namespace for metadata terms in the O'Reilly Product Type Vocabulary
subclass of: InventoriedProduct
description: Examples include hats, t-shirts, and mugs.
identified by: urn:epc:id:gtin:
oracle suffix: MERCH
shown on: catalog
available through: oreilly com

Magazine
type: Class
subclass of: InventoriedProduct
member of: O'Reilly Namespace for metadata terms in the O'Reilly Product Type Vocabulary
oracle suffix: MAGZ
comment: Describes a subscription to this magazine.

Print Advertising
type: Class
subclass of: NonInventoriedProduct
member of: O'Reilly Namespace for metadata terms in the O'Reilly Product Type Vocabulary
comment: Ad sales from printed material.
oracle suffix: PRTAD

Promotional Material
type: Class
subclass of: InventoriedProduct
member of: O'Reilly Namespace for metadata terms in the O'Reilly Product Type Vocabulary
comment: Materials that need inventory but are distributed for free.
oracle suffix: PROMO
identified by: urn:epc:id:gtin:

Video
type: Class
has format: video player
identified by: urn:epc:id:gtin:
comment: Downloadable
subclass of: ElectroniclyDeliveredProduct
subclass of: EditoralProduct
subclass of: DurativeProduct
member of: O'Reilly Namespace for metadata terms in the O'Reilly Product Type Vocabulary
description: Video with chapters that can be downloaded only.
oracle suffix: VIDEO
shown on: catalog
available through: oreilly com

Video
type: Class
has format: video player
identified by: urn:epc:id:gtin:
comment: Streaming
subclass of: ElectroniclyDeliveredProduct
subclass of: EditoralProduct
subclass of: DurativeProduct
member of: O'Reilly Namespace for metadata terms in the O'Reilly Product Type Vocabulary
description: Video with chapters that can be embedded only. The primary example as of this writing is the Lost ActionScript Weekend.
oracle suffix: VIDEO
shown on: catalog
available through: oreilly com

Video
type: Class
has format: video player
identified by: urn:epc:id:gtin:
comment: Streaming, Downloadable
subclass of: ElectroniclyDeliveredProduct
subclass of: EditoralProduct
subclass of: DurativeProduct
member of: O'Reilly Namespace for metadata terms in the O'Reilly Product Type Vocabulary
description: Video with chapters that can be downloaded or embedded. The primary example as of this writing is the Missing Manual Videos.
oracle suffix: VIDEO
shown on: catalog
available through: oreilly com

Event
type: Class
comment: In person event.
member of: O'Reilly Namespace for metadata terms in the O'Reilly Product Type Vocabulary
description: Examples include "Devloper Days", workshops and in person training.
identified by: urn:epc:id:gtin:
oracle suffix: REG

Android Application
type: Class
comment: Application intended to be run under Google's Android OS on Open Handset Alliance phones.
subclass of: ElectroniclyDeliveredProduct
member of: O'Reilly Namespace for metadata terms in the O'Reilly Product Type Vocabulary
description: Examples include Android Application Development App.
oracle suffix: APP
identified by: urn:isbn:
available through: android

School of Technology Online Course
type: Class
comment: Online Course Offered by O'Reilly School of Technology.
member of: O'Reilly Namespace for metadata terms in the O'Reilly Product Type Vocabulary
oracle suffix: ONEDU

Early Release Ebook
type: Class
comment: An early release of an Ebook that contains the whole work, available in multiple formats, sold through oreilly.com.
has format: mobi
has format: http://purl.oreilly.com/formats/pdf
has format: android app
has format: epub
has format: mathematica
has format: DAISY
has format: CDContent
member of: O'Reilly Namespace for metadata terms in the O'Reilly Product Type Vocabulary
identified by: urn:isbn:
subclass of: EditoralProduct
subclass of: ElectroniclyDeliveredProduct
subclass of: PaginatedProduct
subclass of: EarlyReleaseProduct
oracle suffix: EBOOK
shown on: catalog
available through: oreilly com

Web Application
type: Class
comment: Web Application sold through oreilly.com.
member of: O'Reilly Namespace for metadata terms in the O'Reilly Product Type Vocabulary
identified by: urn:isbn:
subclass of: EditoralProduct
subclass of: ElectroniclyDeliveredProduct
subclass of: PaginatedProduct
oracle suffix: WBAPP
shown on: catalog
available through: oreilly com

PROD
type: Class
comment: Shippable, non book, non royalty bearing products.
member of: O'Reilly Namespace for metadata terms in the O'Reilly Product Type Vocabulary
identified by: urn:isbn:
subclass of: EditoralProduct
subclass of: ElectroniclyDeliveredProduct
subclass of: PaginatedProduct
oracle suffix: PROD
shown on: catalog
available through: oreilly com