verification result
comment: The result of the verification.
range: boolean
domain: Verification
type: FunctionalProperty

female terminal
domain: Connection
range: Terminal
comment: The domain connection attaches the range female terminal.
type: ObjectProperty

Amount
equivalent class: Restriction
  max cardinality: 1
  on property: locator
equivalent class: Restriction
  cardinality: 1
  on property: catalogue part
equivalent class: Restriction
  all values from: Amount
  on property: next version
subclass of: Property Value
comment: Specifies the amount of identical catalogue parts.
type: Class

next parameter
comment: The domain parameter points to the range parameter as next parameter.
range: Parameter
domain: Parameter
type: TransitiveProperty

baseline status
comment: The status (open or closed) of the baseline.
domain: Baseline
range: boolean
type: FunctionalProperty

verification performer
comment: The range person or organisation that performs the domain verification.
range: Person or Organisation
domain: Verification
type: ObjectProperty

document alias file path
comment: The locally stored copy of the document.
range: string
domain: Document
type: FunctionalProperty

affects
comment: The domain task transforms the range function fulfiller or state.
inverse of: is affected by
type: ObjectProperty
domain: Task
range: Class
  union of: Function Fulfiller
  union of: State

layer index
comment: The layer index number of the C-BIM object.
domain: C-BIM Object
range: int
type: FunctionalProperty

performance
inverse of: performance of
range: Performance
type: ObjectProperty
comment: The range performance that characterizes the domain function fulfiller.
domain: Class
  union of: Function Fulfiller
  union of: State

shape
comment: The range explicit 3D representation that specifies the 3D shape of the domain function fulfiller or terminal or catalog part or state.
range: Explicit 3D Representation
type: ObjectProperty
domain: Class
  union of: Function Fulfiller
  union of: State
  union of: Terminal
  union of: Catalogue Part

next version
comment: The domain CbimObject points to the range CbimObject as its next version.
domain: C-BIM Object
range: C-BIM Object
type: TransitiveProperty

fulfills
comment: The domain function fulfiller fulfills the range function.
range: Function
domain: Function Fulfiller
inverse of: is fulfilled by
type: ObjectProperty

modification date
comment: The last modification date of the C-BIM object.
domain: C-BIM Object
range: date
type: FunctionalProperty

Function
comment: Specifies functional behavior through a bundle of functional requirements.
subclass of: C-BIM Object
equivalent class: Restriction
  on property: next version
  all values from: Function
type: Class

verification requirement
comment: The range requirement that identifies the domain verification.
range: Requirement
domain: Verification
type: ObjectProperty

document type
comment: The type of the document.
domain: Document
range: string
type: FunctionalProperty

Locator
equivalent class: Restriction
  max cardinality: 1
  on property: secondary orientation
comment: Specifier for position, orientation and bounding box in 3D Euclidean space.
equivalent class: Restriction
  max cardinality: 1
  on property: translation
equivalent class: Restriction
  max cardinality: 1
  on property: minimum bounding box
equivalent class: Restriction
  max cardinality: 1
  on property: maximum bounding box
equivalent class: Restriction
  all values from: Locator
  on property: next version
equivalent class: Restriction
  max cardinality: 1
  on property: primary orientation
subclass of: C-BIM Object
type: Class

baseline
inverse of: baseline object
domain: C-BIM Object
range: Baseline
comment: The range baseline that owns the domain object.
type: ObjectProperty

description
comment: The description of the C-BIM object.
domain: C-BIM Object
range: string
type: FunctionalProperty

Function Fulfiller
equivalent class: Restriction
  max cardinality: 1
  on property: locator
equivalent class: Restriction
  max cardinality: 1
  on property: parent
subclass of: C-BIM Object
equivalent class: Class
  union of: Physical Object
  union of: Space
comment: Abstract supertype of the object tree node classes.
type: Class
equivalent class: Restriction
  on property: current state
  max cardinality: 1

situates
comment: The domain space situates the range physical object.
type: ObjectProperty

end date
comment: The abstract typed property end date.
range: date
type: FunctionalProperty

parent
comment: The range parent function fulfiller of the domain child function fulfiller.
type: TransitiveProperty

is affected by
comment: The domain function fulfiller or state is transformed by the range task.
type: ObjectProperty

requirement
comment: The range requirement that characterizes the domain function.
inverse of: requirement of
range: Requirement
domain: Function
type: ObjectProperty

requirement of
comment: The range function that is characterized by the domain requirement.
type: ObjectProperty

Performance
equivalent class: Restriction
  max cardinality: 1
  on property: performance of
subclass of: C-BIM Object
equivalent class: Restriction
  on property: next version
  all values from: Performance
comment: Explicit performance of a function fulfiller.
type: Class

spatial child
comment: Range child space of domain parent space.
inverse of: spatial parent
sub property of: child
domain: Space
range: Space
type: TransitiveProperty

performance of
comment: The range function fulfiller or state that is characterized by the domain performance.
type: ObjectProperty

secondary orientation
comment: The range vector that specifies the secondary orientation of the domain locator.
domain: Locator
range: Vector
type: ObjectProperty

Document
comment: General Document link object.
subclass of: C-BIM Object
equivalent class: Restriction
  on property: next version
  all values from: Document
type: Class

terminal
comment: The range terminal that is attached to the domain function fulfiller.
inverse of: terminal of
range: Terminal
domain: Function Fulfiller
type: ObjectProperty

default value
comment: The default value of the parameter.
domain: Parameter
range: string
type: FunctionalProperty

name
comment: The name of the C-BIM object.
domain: C-BIM Object
range: string
type: FunctionalProperty

Parameter
equivalent class: Restriction
  max cardinality: 1
  on property: next parameter
equivalent class: Restriction
  all values from: Parameter
  on property: next version
subclass of: C-BIM Object
equivalent class: Restriction
  on property: property value
  max cardinality: 1
comment: Parameter of an explicit 3D reference object.
type: Class

user ID
comment: The user defined ID of the C-BIM object.
domain: C-BIM Object
range: string
type: FunctionalProperty

Vector
subclass of: C-BIM Object
equivalent class: Restriction
  on property: next version
  all values from: Vector
comment: 3D Vector specifier.
type: Class

task type
comment: The range task type is the type of the domain task.
domain: Task
range: Task Type
type: ObjectProperty

first parameter
domain: Explicit 3D Representation
range: Parameter
comment: The domain explicit 3D representation points to the range parameter as first parameter.
type: ObjectProperty

Person or Organisation
subclass of: C-BIM Object
equivalent class: Restriction
  on property: next version
  all values from: Person or Organisation
comment: Reference to the responsible person or organisation.
type: Class

child
domain: Function Fulfiller
inverse of: parent
range: Function Fulfiller
comment: The range child function fulfiller of the domain parent function fulfiller.
type: TransitiveProperty

Building
subclass of: Physical Object
equivalent class: Restriction
  on property: physical parent
  cardinality: 0
type: Class

VISI Message
subclass of: Document
equivalent class: Restriction
  on property: next version
  all values from: VISI Message
type: Class

Library Reference
equivalent class: Restriction
  all values from: Library Reference
  on property: next version
subclass of: Document
comment: Document link to external library object.
type: Class

spatial parent
comment: The range parent space of the domain child space.
sub property of: parent
type: TransitiveProperty

property value
comment: The range property value owned by the domain amount or catalogue part or parameter.
domain: Class
  union of: Amount
  union of: Catalogue Part
  union of: Parameter
range: Property Value
type: ObjectProperty

verification method
comment: The test method of the verification.
range: string
domain: Verification
type: FunctionalProperty

Baseline
comment: Aggregates all objects of the same baseline
subclass of: C-BIM Object
equivalent class: Restriction
  on property: next version
  all values from: Baseline
type: Class

Task
equivalent class: Restriction
  all values from: Task
  on property: next version
subclass of: C-BIM Object
equivalent class: Restriction
  on property: task type
  max cardinality: 1
comment: Planning specifier.
type: Class

release status
comment: The release status of the C-BIM object.
range: string
domain: C-BIM Object
type: FunctionalProperty

expired
comment: The expiration status of the C-BIM object.
domain: C-BIM Object
range: boolean
type: FunctionalProperty

catalogue part
sub property of: property type
range: Catalogue Part
domain: Amount
comment: The domain amount quantity that is typed by the range catalogue part.
type: ObjectProperty

Task Type
one of: Unchanged
one of: Constructing
one of: Destructing
subclass of: Thing
comment: Task Type specifier.
type: Class

contains
sub property of: property value
range: Amount
type: ObjectProperty
comment: The range amount quantity owned by the domain physical object or catalogue part.
domain: Class
  union of: Physical Object
  union of: State
  union of: Catalogue Part

male terminal
range: Terminal
domain: Connection
comment: The domain connection attaches the range male terminal.
type: ObjectProperty

minimum bounding box
domain: Locator
range: Vector
comment: The domain locator specifies the range vector as minimum corner location.
type: ObjectProperty

previous state
comment: The range state is the previous state of the domain state.
range: State
domain: State
type: TransitiveProperty

is situated in
domain: Physical Object
range: Space
inverse of: situates
comment: The domain physical object is situated in the range space.
type: ObjectProperty

amount property type
comment: Range property type that is used to specify the quantity of the domain catalogue part.
range: Property Type
domain: Catalogue Part
type: ObjectProperty

verification date
comment: The date of the verification.
range: dateTime
domain: Verification
type: FunctionalProperty

state of
type: ObjectProperty
comment: The range function fulfiller is the container of the domain state.
domain: State
range: Function Fulfiller

physical child
comment: Range child physical object of domain parent physical object.
inverse of: physical parent
domain: Physical Object
range: Physical Object
sub property of: child
type: TransitiveProperty

is fulfilled by
comment: The domain function is fulfilled by the range function fulfiller.
type: ObjectProperty

c-bim.owl
version info: Created with TopBraid Composer
type: Ontology

terminal of
comment: The range function fulfiller that is attached by the domain terminal.
type: ObjectProperty

Physical Object
equivalent class: Restriction
  max cardinality: 1
  on property: physical parent
subclass of: Function Fulfiller
disjoint with: Space
equivalent class: Restriction
  on property: next version
  all values from: Physical Object
equivalent class: Restriction
  on property: is situated in
  max cardinality: 1
comment: Tangible function fulfiller.
type: Class

start date
comment: The abstract typed property start date.
range: date
type: FunctionalProperty

current state
type: ObjectProperty
comment: The range state is the current state of the domain function fulfiller.
domain: Function Fulfiller
range: State

primary orientation
comment: The range vector that specifies the primary orientation of the domain locator.
domain: Locator
range: Vector
type: ObjectProperty

creation date
comment: The creation date of the C-BIM object.
domain: C-BIM Object
range: date
type: FunctionalProperty

modifier
range: Person or Organisation
domain: C-BIM Object
comment: The range person or organisation is modifier of the domain object.
type: ObjectProperty

Space
equivalent class: Restriction
  max cardinality: 1
  on property: spatial parent
subclass of: Function Fulfiller
disjoint with: Physical Object
equivalent class: Restriction
  on property: next version
  all values from: Space
comment: Intangible function fulfiller.
type: Class

creator
range: Person or Organisation
domain: C-BIM Object
comment: The range person or organisation is creator of the domain object.
type: ObjectProperty

Requirement
equivalent class: Restriction
  max cardinality: 1
  on property: requirement of
subclass of: C-BIM Object
equivalent class: Restriction
  on property: next version
  all values from: Requirement
comment: Functional requirement specifier.
type: Class

locator
range: Locator
domain: Class
  union of: Amount
  union of: Function Fulfiller
  union of: Terminal
comment: The domain amount, function fulfiller or terminal specify a range locator as subreference frame.
type: ObjectProperty

y coordinate
comment: The y coordinate of the vector.
domain: Vector
range: float
type: FunctionalProperty

Property Value
equivalent class: Restriction
  cardinality: 1
  on property: property type
equivalent class: Restriction
  all values from: Property Value
  on property: next version
subclass of: C-BIM Object
comment: Property value specifier.
type: Class

verificationFunctionFulfiller
comment: The range function fulfiller that identifies the domain verification.
domain: Verification
range: Function Fulfiller
type: ObjectProperty

translation
comment: The range vector that specifies the translation of the domain locator.
domain: Locator
range: Vector
type: ObjectProperty

Terminal
equivalent class: Restriction
  max cardinality: 1
  on property: locator
equivalent class: Restriction
  cardinality: 1
  on property: terminal of
subclass of: C-BIM Object
equivalent class: Restriction
  on property: next version
  all values from: Terminal
comment: Terminal specifier of a function fulfiller.
type: Class

property type
comment: The range type of the domain property value.
domain: Property Value
range: Property Type
type: ObjectProperty

actual end date
comment: The actual end date of the task.
domain: Task
sub property of: end date
type: FunctionalProperty

C-BIM Object
subclass of: Thing
equivalent class: Restriction
  on property: creator
  max cardinality: 1
equivalent class: Restriction
  on property: modifier
  max cardinality: 1
type: Class
equivalent class: Restriction
  on property: next version
  max cardinality: 1
equivalent class: Restriction
  on property: baseline
  max cardinality: 1
comment: Abstract supertype of all C-BIM classes.

changelog
comment: The changelog of the C-BIM object.
domain: C-BIM Object
range: string
type: FunctionalProperty

Catalogue Part
comment: Library object for storing a parametric component.
equivalent class: Restriction
  max cardinality: 1
  on property: supertype
equivalent class: Restriction
  cardinality: 1
  on property: amount property type
equivalent class: Restriction
  all values from: Catalogue Part
  on property: next version
subclass of: Property Type
type: Class

supertype
comment: The range catalogue part is the supertype of the domain catalogue part.
range: Catalogue Part
domain: Catalogue Part
type: TransitiveProperty

State
equivalent class: Restriction
  max cardinality: 1
  on property: previous state
comment: Bundles function fulfiller information in an explicit state context.
subclass of: C-BIM Object
equivalent class: Restriction
  on property: next version
  all values from: State
type: Class
equivalent class: Restriction
  on property: state of
  cardinality: 1

value
range: anySimpleType
comment: The actual value of the property value.
type: FunctionalProperty
domain: Property Value

Property Type
equivalent class: Restriction
  all values from: Property Type
  on property: next version
subclass of: C-BIM Object
comment: Specifier of quantity type, value type and unit type of a property.
type: Class

unit
comment: The unit of the property type.
domain: Property Type
range: string
type: FunctionalProperty

x coordinate
comment: The x coordinate of the vector.
range: float
domain: Vector
type: FunctionalProperty

Connection
comment: Establishes a connection between two terminal objects.
equivalent class: Restriction
  cardinality: 1
  on property: female terminal
equivalent class: Restriction
  cardinality: 1
  on property: male terminal
subclass of: C-BIM Object
equivalent class: Restriction
  on property: next version
  all values from: Connection
type: Class

physical parent
comment: The range parent physical object of the domain child physical object.
sub property of: parent
type: TransitiveProperty

release date
comment: The release date of the C-BIM object.
range: date
domain: C-BIM Object
type: FunctionalProperty

maximum bounding box
domain: Locator
range: Vector
comment: The domain locator specifies the range vector as maximum corner location.
type: ObjectProperty

document URI
comment: The URI of the document or identifiable object inside the document.
domain: Document
range: string
type: FunctionalProperty

Verification
equivalent class: Restriction
  max cardinality: 1
  on property: verification performer
equivalent class: Restriction
  on property: verification requirement
  cardinality: 1
equivalent class: Restriction
  on property: verificationFunctionFulfiller
  cardinality: 1
equivalent class: Restriction
  all values from: Verification
  on property: next version
subclass of: C-BIM Object
comment: Functionfulfiller/requirement combination verification specifier.
type: Class

Explicit 3D Representation
equivalent class: Restriction
  max cardinality: 1
  on property: first parameter
comment: Shape document link object.
equivalent class: Restriction
  all values from: Explicit 3D Representation
  on property: next version
subclass of: Document
type: Class

baseline object
comment: The domain baseline that owns the range object.
type: ObjectProperty

z coordinate
comment: The z coordinate of the vector.
domain: Vector
range: float
type: FunctionalProperty

document
domain: C-BIM Object
range: Document
comment: The domain object references the range document.
type: ObjectProperty

planned end date
comment: The planned end date of the task.
domain: Task
sub property of: end date
type: FunctionalProperty

value domain
comment: The value domain of the property type.
range: int
domain: Property Type
type: FunctionalProperty