localization-descriptor-parameter
type: Class
comment: These parameters encode parts of localization descriptors.
subclass of: structured-data-parameter

bounding-box
type: Class
comment: Corresponds to the "Box"-element of "RegionLocatorType" (see part 3, page 92 - 93)
subclass of: rectangle
subclass of: region-locator-descriptor-parameter
disjoint with: region-boundary

figure-trajectory-descriptor
type: Class
comment: Corrresponds to the local complex "FigureTrajectory" element of the "SpatioTemporalLocatorType" (part 3, page 99 - 100)
subclass of: localization-descriptor
subclass of: http://lodlaundromat.org/.well-known/genid/4f44dddb5c3a4fb0beb56c61e6e457b2#2
subclass of: digital-data

temporal-interpolation-descriptor
type: Class
comment: Corresponds to the "TemporalInterpolationType", specified in part 3, page 23-29.
subclass of: http://lodlaundromat.org/.well-known/genid/4f44dddb5c3a4fb0beb56c61e6e457b2#38
subclass of: localization-descriptor
subclass of: digital-data

media-time-descriptor
type: Class
comment: Corresponds to the "MediaTimeType" (see part 5, page 86 - 87)
subclass of: http://lodlaundromat.org/.well-known/genid/4f44dddb5c3a4fb0beb56c61e6e457b2#19
subclass of: localization-descriptor
subclass of: digital-data

figure-trajectory-type
type: Class
comment: Corrresponds to the "type" attribute of the "FigureTrajectoryType" (part 3, page 99 - 100). the value is a sring of {ellipse rechtanlge polygon }
subclass of: figure-trajectory-descriptor-parameter
subclass of: figure-trajectory-type-enumeration

interpolation-functions-descriptor
type: Class
comment: Corrresponds to the local complex "InetrpolationFunctions" element of the "TemporalInterpolationType" (part 3, page 24-25)
subclass of: localization-descriptor
subclass of: http://lodlaundromat.org/.well-known/genid/4f44dddb5c3a4fb0beb56c61e6e457b2#11
subclass of: digital-data

key-media-time-point
type: Class
comment: Corrresponds to the "MediaTimePoint" element of the "TemporalInterpolationType" (part 3, page 24-25)
subclass of: basic-time-point
subclass of: key-time-point-descriptor-parameter

key-time-point-descriptor
type: Class
comment: Corrresponds to the "KeyTimePoint" element of the "TemporalInterpolationType" (part 3, page 24-25)
subclass of: localization-descriptor
subclass of: digital-data
subclass of: http://lodlaundromat.org/.well-known/genid/4f44dddb5c3a4fb0beb56c61e6e457b2#12

key-value
type: Class
comment: Corrresponds to the "KeyValue" element of the "TemporalInterpolationType" (part 3, page 24-25)
subclass of: key-value-descriptor-parameter
subclass of: float-scalar

key-value-descriptor
type: Class
comment: Corrresponds to the local complex "KeyValue" element of the "TemporalInterpolationType" (part 3, page 24-25)
subclass of: localization-descriptor
subclass of: digital-data
subclass of: http://lodlaundromat.org/.well-known/genid/4f44dddb5c3a4fb0beb56c61e6e457b2#13

key-value-parameter
type: Class
comment: Corrresponds to the "param" attribute of the "TemporalInterpolationType" (part 3, page 24-25)
subclass of: float-scalar
subclass of: key-value-descriptor-parameter

key-value-type
type: Class
comment: Corrresponds to the "type" attribute of the "TemporalInterpolationType" (part 3, page 24-25). The value is a string of {startPoint firstPoint notDetermined secondOrder}.
subclass of: key-value-descriptor-parameter
subclass of: key-value-type-enumeration

media-duration
type: Class
comment: Corresponds to the "MediaDuration"-element of the "MediaTimeType" (see part 5, page 86)
subclass of: media-time-descriptor-parameter
subclass of: basic-duration
disjoint with: media-time-point

media-time-point
type: Class
comment: Corresponds to the "MediaTimePoint"-element of the "MediaTimeType" (see part 5, page 86)
subclass of: media-time-descriptor-parameter
subclass of: basic-time-point
disjoint with: media-duration

parameter-traejctory-motion-model
type: Class
comment: Corrresponds to the "motionModel" attribute of the "ParameterTrajectoryType" (part 3, page 101 - 102). The value is a string of {still affine parabolic perspective translation rotationAndScaling }.
subclass of: parameter-trajectory-motion-model-enumeration
subclass of: parameter-trajectory-descriptor-parameter

parameter-trajectory-descriptor
type: Class
comment: Corrresponds to the local complex "ParameterTrajectory" element of the "SpatioTemporalLocatorType" (part 3, page 101 - 102)
subclass of: localization-descriptor
subclass of: digital-data
subclass of: http://lodlaundromat.org/.well-known/genid/4f44dddb5c3a4fb0beb56c61e6e457b2#20

region-locator-descriptor
type: Class
comment: Corresponds to the "RegionLocatorType" (see part 3, page 92 - 96)
subclass of: http://lodlaundromat.org/.well-known/genid/4f44dddb5c3a4fb0beb56c61e6e457b2#32
subclass of: localization-descriptor
subclass of: digital-data

parameter-trajectory-ellipse-flag
type: Class
comment: Corrresponds to the "ellipseFlag" attribute of the "ParameterTrajectoryType" (part 3, page 101 - 102)
subclass of: boolean
subclass of: parameter-trajectory-descriptor-parameter

region-boundary
type: Class
comment: Corresponds to "Polygon"-element of "RegionLocatorType" (see part 3, page 92 - 93)
subclass of: polygon
subclass of: region-locator-descriptor-parameter
disjoint with: bounding-box

whole-interval-descriptor
type: Class
comment: Corrresponds to the "MediaDuration" element of the "TemporalInterpolationType" (part 3, page 24-25)
subclass of: localization-descriptor
subclass of: digital-data
subclass of: http://lodlaundromat.org/.well-known/genid/4f44dddb5c3a4fb0beb56c61e6e457b2#43

whole-interval-media-duration
type: Class
comment: Corrresponds to the "MediaDuration" element of the "TemporalInterpolationType" (part 3, page 24-25)
subclass of: basic-duration
subclass of: whole-interval-descriptor-parameter