result_test
type: Class
comment: The outcome of a specific test to measure an attribute or to determine the presence, absence, or degree of a condition.
label: Testergebniss @de
subclass of: http://lodlaundromat.org/.well-known/genid/34402347ec86c6028255dce461dc57ae#1
label: result_laboratory
subclass of: finding
label: laborergebniss @de
label: testergebniss @de
subclass of: http://lodlaundromat.org/.well-known/genid/34402347ec86c6028255dce461dc57ae#6

abnormality_anatomical
type: Class
subclass of: http://lodlaundromat.org/.well-known/genid/34402347ec86c6028255dce461dc57ae#30
subclass of: http://lodlaundromat.org/.well-known/genid/34402347ec86c6028255dce461dc57ae#34
comment: An abnormal structure, or one that is abnormal in size or location.
subclass of: http://lodlaundromat.org/.well-known/genid/34402347ec86c6028255dce461dc57ae#35
subclass of: http://lodlaundromat.org/.well-known/genid/34402347ec86c6028255dce461dc57ae#40
subclass of: structure_anatomical
subclass of: http://lodlaundromat.org/.well-known/genid/34402347ec86c6028255dce461dc57ae#41
label: anomalie_anatomisch @de

function_biologic
type: Class
subclass of: http://lodlaundromat.org/.well-known/genid/34402347ec86c6028255dce461dc57ae#113
comment: A state, activity or process of the body or one of its systems or parts.
subclass of: phenomenon_natural

injury
type: Class
subclass of: process
subclass of: http://lodlaundromat.org/.well-known/genid/34402347ec86c6028255dce461dc57ae#203
subclass of: http://lodlaundromat.org/.well-known/genid/34402347ec86c6028255dce461dc57ae#208
comment: A traumatic wound, injury, or poisoning caused by an external agent or force.
label: verletzung @de
label: poisoning
label: vergiftung @de
subclass of: http://lodlaundromat.org/.well-known/genid/34402347ec86c6028255dce461dc57ae#213
label: Verletzung @de
label: Vergiftung @de

indicates
type: ObjectProperty
sub property of: functionally related to
inverse of: indicated by
comment: Gives evidence for the presence at some time of an entity or process.

finding
type: Class
subclass of: http://lodlaundromat.org/.well-known/genid/34402347ec86c6028255dce461dc57ae#169
comment: That which is discovered by direct observation or measurement of an organism attribute or condition, including the clinical history of the patient. The history of the presence of a disease is a 'Finding' and is distinguished from the disease itself.
label: befund @de
subclass of: http://lodlaundromat.org/.well-known/genid/34402347ec86c6028255dce461dc57ae#173
subclass of: entity_conceptual
label: Befund @de
subclass of: http://lodlaundromat.org/.well-known/genid/34402347ec86c6028255dce461dc57ae#178

procedure_diagnostic
type: Class
label: diagnose @de
label: Diagnostikverfahren @de
subclass of: http://lodlaundromat.org/.well-known/genid/34402347ec86c6028255dce461dc57ae#43
label: diagnostikverfahren @de
comment: A procedure, method, or technique used to determine the nature or identity of a disease or disorder. This excludes procedures which are primarily carried out on specimens in a laboratory.
subclass of: http://lodlaundromat.org/.well-known/genid/34402347ec86c6028255dce461dc57ae#48
subclass of: activity_healthcare

procedure_laboratory
type: Class
label: laborverfahren @de
label: Laborverfahren @de
comment: A procedure, method, or technique used to determine the composition, quantity, or concentration of a specimen, and which is carried out in a clinical laboratory. Included here are procedures which measure the times and rates of reactions.
subclass of: http://lodlaundromat.org/.well-known/genid/34402347ec86c6028255dce461dc57ae#74
subclass of: activity_healthcare

result of
type: ObjectProperty
comment: The condition, product, or state occurring as a consequence, effect, or conclusion of an activity or process. This includes product of, effect of, sequel of, outcome of, culmination of, and completion of.
sub property of: functionally related to
inverse of: has result

process
type: Class
subclass of: http://lodlaundromat.org/.well-known/genid/34402347ec86c6028255dce461dc57ae#10
label: ablauf @de
label: prozess @de
subclass of: event
comment: A process or state which occurs naturally or as a result of an activity.
label: phenomenon
label: vorgang @de

event
type: Class
comment: A broad type for grouping activities, processes and states.
subclass of: UMLSSemanticType
label: ereignis @de

function_physiologic
type: Class
subclass of: http://lodlaundromat.org/.well-known/genid/34402347ec86c6028255dce461dc57ae#14
comment: A normal process, activity, or state of the body.
subclass of: http://lodlaundromat.org/.well-known/genid/34402347ec86c6028255dce461dc57ae#15
subclass of: function_biologic
label: funktion_physiologisch @de

co-occurs with
type: ObjectProperty
range: injury
comment: Occurs at the same time as, together with, or jointly. This includes is co-incident with, is concurrent with, is contemporaneous with, accompanies, coexists with, and is concomitant with.
sub property of: temporally related to

precedes
type: ObjectProperty
comment: Occurs earlier in time. This includes antedates, comes before, is in advance of, predates, and is prior to.
sub property of: temporally related to

virus
type: Class
subclass of: organism

organism
type: Class
label: organismus @de
subclass of: object_physical

entity
type: Class
subclass of: UMLSSemanticType
comment: A broad type for grouping physical and conceptual entities.
label: entitaet @de

Hormone
type: Class
comment: In animals, a chemical usually secreted by an endocrine gland whose products are released into the circulating fluid. Hormones act as chemical messengers and regulate various physiologic processes such as growth, reproduction, metabolism, etc. They usually fall into two broad classes, steroid hormones and peptide hormones.
subclass of: substance_biologically_active

substance_biologically_active
type: Class
subclass of: Chemical Viewed Functionally
subclass of: http://lodlaundromat.org/.well-known/genid/34402347ec86c6028255dce461dc57ae#154
comment: A generally endogenous substance produced or required by an organism, of primary interest because of its role in the biologic functioning of the organism that produces it.
subclass of: http://lodlaundromat.org/.well-known/genid/34402347ec86c6028255dce461dc57ae#159

activity_occupational
type: Class
label: aktivitaet_berufsbezogen @de
comment: An activity carried out as part of an occupation or job.
subclass of: activity

activity
type: Class
comment: An operation or series of operations that an organism or machine carries out or participates in.
subclass of: event
label: aktivitaet @de
label: aktion @de

process_inflammatory
type: Class
subclass of: disease

disease
type: Class
label: Krankheit @de
comment: A condition which alters or interferes with a normal process, state, or activity of an organism. It is usually characterized by the abnormal functioning of one or more of the host's systems, parts, or organs. Included here is a complex of symptoms descriptive of a disorder.
subclass of: http://lodlaundromat.org/.well-known/genid/34402347ec86c6028255dce461dc57ae#223
label: syndrome
label: krankheit @de
subclass of: function_pathologic

activity_healthcare
type: Class
subclass of: activity_occupational
subclass of: http://lodlaundromat.org/.well-known/genid/34402347ec86c6028255dce461dc57ae#16
comment: An activity of or relating to the practice of medicine or involving the care of patients.
label: versorgung_medizinisch @de

affects
type: ObjectProperty
comment: Produces a direct effect on. Implied here is the altering or influencing of an existing condition, state, situation, or entity. This includes has a role in, alters, influences, predisposes, catalyzes, stimulates, regulates, depresses, impedes, enhances, contributes to, leads to, and modifies.
inverse of: affected by
sub property of: functionally related to

compound_organophosphorus
type: Class
label: verbindung_phosphororganisch @de
subclass of: substance_organic
comment: An organic compound containing phosphorus as a constituent. Included here are organic phosphinic, phosphonic and phosphoric acid derivatives and their thiophosphorus counterparts. Excluded are phospholipids, sugar phosphates, phosphoproteins, nucleotides, and nucleic acids.

substance_organic
type: Class
comment: The general class of carbon-containing compounds, usually based on carbon chains or rings, and also containing hydrogen (hydrocarbons), with or without nitrogen, oxygen, or other elements in which the bonding between elements is generally covalent.
subclass of: Chemical Viewed Structurally
label: substanz_organisch @de

entity_conceptual
type: Class
subclass of: entity
label: entitaet_konzeptuell @de
comment: A broad type for grouping abstract entities or concepts.

function_pathologic
type: Class
label: funktion_pathologisch @de
subclass of: http://lodlaundromat.org/.well-known/genid/34402347ec86c6028255dce461dc57ae#17
subclass of: function_biologic
subclass of: http://lodlaundromat.org/.well-known/genid/34402347ec86c6028255dce461dc57ae#18
comment: A disordered process, activity, or state of the organism as a whole, of a body system or systems, or of multiple organs or tissues. Included here are normal responses to a negative stimulus as well as patholologic conditions or states that are less specific than a disease. Pathologic functions frequently have systemic effects.
subclass of: http://lodlaundromat.org/.well-known/genid/34402347ec86c6028255dce461dc57ae#19
subclass of: http://lodlaundromat.org/.well-known/genid/34402347ec86c6028255dce461dc57ae#24
subclass of: http://lodlaundromat.org/.well-known/genid/34402347ec86c6028255dce461dc57ae#29

complicates
type: ObjectProperty
sub property of: affects
inverse of: complicated by
comment: Causes to become more severe or complex or results in adverse effects.

manifestation of
type: ObjectProperty
inverse of: has manifestation
comment: That part of a phenomenon which is directly observable or concretely or visibly expressed, or which gives evidence to the underlying process. This includes expression of, display of, and exhibition of.
sub property of: functionally related to

degree of
type: ObjectProperty
comment: The relative intensity of a process or the relative intensity or amount of a quality or attribute.
sub property of: conceptually related to
inverse of: has degree

process_mental
type: Class
comment: A physiologic function involving the mind or cognitive processing.
label: prozess_phychisch @de
subclass of: function_organism

function_organism
type: Class
subclass of: function_physiologic
subclass of: http://lodlaundromat.org/.well-known/genid/34402347ec86c6028255dce461dc57ae#42
comment: A physiologic function of the organism as a whole, of multiple organ systems, or of multiple organs or tissues.

Enzyme
type: Class
subclass of: substance_biologically_active
comment: A complex chemical, usually a protein, that is produced by living cells and which catalyzes specific biochemical reactions. There are six main types of enzymes: oxidoreductases, transferases, hydrolases, lyases, isomerases, and ligases.

abnormality_congenital
type: Class
comment: An abnormal structure, or one that is abnormal in size or location, present at birth or evolving over time as a result of a defect in embryogenesis.
subclass of: abnormality_anatomical
label: anomalie_kongenital @de
label: anomalie_congenital @de
label: anomalie_angeboren @de

location of
type: ObjectProperty
comment: The position, site, or region of an entity or the site of a process.
inverse of: has location
sub property of: spatially related to

structure_anatomical
type: Class
label: struktur_anatomisch @de
subclass of: object_physical
comment: A normal or pathological part of the anatomy or structural organization of an organism.

concept_qualitative
type: Class
label: konzept_qualitativ @de
subclass of: entity_conceptual

diagnoses
type: ObjectProperty
inverse of: diagnosed by
sub property of: conceptually related to
comment: Distinguishes or identifies the nature or characteristics of.

procedure_therapeutic
type: Class
subclass of: http://lodlaundromat.org/.well-known/genid/34402347ec86c6028255dce461dc57ae#135
label: behandlungsmethode @de
label: vorbeugungsverfahren @de
subclass of: activity_healthcare
comment: A procedure, method, or technique designed to prevent a disease or a disorder, or to improve physical function, or used in the process of treating a disease or injury.
subclass of: http://lodlaundromat.org/.well-known/genid/34402347ec86c6028255dce461dc57ae#141
label: Vorbeugungsverfahren @de
label: Behandlungsmethode @de
label: behandlung @de
label: procedure_preventive

antibiotic
type: Class
subclass of: substance_pharmacologic
label: antibiotik @de
comment: A pharmacologically active compound produced by growing microorganisms which kill or inhibit growth of other microorganisms.

substance_pharmacologic
type: Class
subclass of: http://lodlaundromat.org/.well-known/genid/34402347ec86c6028255dce461dc57ae#117
subclass of: http://lodlaundromat.org/.well-known/genid/34402347ec86c6028255dce461dc57ae#118
subclass of: Chemical Viewed Functionally
comment: A substance used in the treatment or prevention of pathologic disorders. This includes substances that occur naturally in the body and are administered therapeutically.
subclass of: http://lodlaundromat.org/.well-known/genid/34402347ec86c6028255dce461dc57ae#123
subclass of: http://lodlaundromat.org/.well-known/genid/34402347ec86c6028255dce461dc57ae#124
subclass of: http://lodlaundromat.org/.well-known/genid/34402347ec86c6028255dce461dc57ae#130

substance_body
type: Class
comment: Extracellular material, or mixtures of cells and extracellular material, produced, excreted, or accreted by the body. Included here are substances such as saliva, dental enamel, sweat, and gastric acid.
subclass of: http://lodlaundromat.org/.well-known/genid/34402347ec86c6028255dce461dc57ae#49
subclass of: substance
subclass of: http://lodlaundromat.org/.well-known/genid/34402347ec86c6028255dce461dc57ae#50
subclass of: http://lodlaundromat.org/.well-known/genid/34402347ec86c6028255dce461dc57ae#54
subclass of: http://lodlaundromat.org/.well-known/genid/34402347ec86c6028255dce461dc57ae#58

structure_embryonic
type: Class
subclass of: http://lodlaundromat.org/.well-known/genid/34402347ec86c6028255dce461dc57ae#89
comment: An anatomical structure that exists only before the organism is fully formed; in mammals, for example, a structure that exists only prior to the birth of the organism. This structure may be normal or abnormal.
subclass of: http://lodlaundromat.org/.well-known/genid/34402347ec86c6028255dce461dc57ae#90
subclass of: http://lodlaundromat.org/.well-known/genid/34402347ec86c6028255dce461dc57ae#91
subclass of: http://lodlaundromat.org/.well-known/genid/34402347ec86c6028255dce461dc57ae#95
subclass of: http://lodlaundromat.org/.well-known/genid/34402347ec86c6028255dce461dc57ae#99
label: struktur_embryonal @de
subclass of: structure_anatomical

surrounds
type: ObjectProperty
sub property of: spatially related to
comment: Establishes the boundaries for, or defines the limits of another physical structure. This includes limits, bounds, confines, encloses, and circumscribes.

substance
type: Class
subclass of: http://lodlaundromat.org/.well-known/genid/34402347ec86c6028255dce461dc57ae#164
comment: A material with definite or fairly definite chemical composition.
label: substanz @de
subclass of: object_physical
label: stoff @de

physical part of
type: ObjectProperty
comment: Composes, with one or more other physical units, some larger whole. This includes component of, division of, portion of, fragment of, section of, and layer of.
sub property of: part of
inverse of: has physical part
sub property of: physically related to

organ
type: Class
subclass of: Shape
subclass of: http://lodlaundromat.org/.well-known/genid/34402347ec86c6028255dce461dc57ae#191
subclass of: http://lodlaundromat.org/.well-known/genid/34402347ec86c6028255dce461dc57ae#195
comment: A collection of cells and tissues which are localized to a specific area or combine and carry out one or more specialized functions of an organism. This ranges from gross structures to small components of complex organs. These structures are relatively localized in comparison to tissues.
subclass of: http://lodlaundromat.org/.well-known/genid/34402347ec86c6028255dce461dc57ae#196
subclass of: structure_anatomical_fully_formed
subclass of: http://lodlaundromat.org/.well-known/genid/34402347ec86c6028255dce461dc57ae#200
label: body_part
subclass of: http://lodlaundromat.org/.well-known/genid/34402347ec86c6028255dce461dc57ae#201
label: component_organ
label: koerperteil @de
subclass of: http://lodlaundromat.org/.well-known/genid/34402347ec86c6028255dce461dc57ae#202

consists of
type: ObjectProperty
sub property of: physically related to
comment: Is structurally made up of in whole or in part of some material or matter. This includes composed of, made of, and formed of.
equivalent property: has physical part

connected to
type: ObjectProperty
comment: Directly attached to another physical unit as tendons are connected to muscles. This includes attached to and anchored to.
sub property of: physically related to

nucleotide
type: Class
label: nukleinsaeure @de
label: nukleotid @de
label: acid_nucleic
comment: A complex compound of high molecular weight occurring in living cells. These are basically of two types, ribonucleic (RNA) and deoxyribonucleic (DNA) acids. Nucleic acids are made of nucleotides (nitrogen-containing base, a 5-carbon sugar, and one or more phosphate group) linked together by a phosphodiester bond between the 5' and 3' carbon atoms. Nucleosides are compounds composed of a purine or pyrimidine base (usually adenine, cytosine, guanine, thymine, uracil) linked to either a ribose or a deoxyribose sugar.
subclass of: substance_organic
label: nukleosid @de
label: nucleoside

carbohydrate
type: Class
comment: A generic term that includes monosaccharides, oligosaccharides, and polysaccharides as well as substances derived from monosaccharides by reduction of the carbonyl group (alditols), by oxidation of one or more terminal group to carboxylic acids, or by replacement of one or more hydroxy groups by a hydrogen atom, an amino group, a thiol group or similar heteroatomic groups. It also includes derivatives of these compounds. Included here are sugar phosphates. Excluded are glycolipids and glycoproteins.
label: kohlenhydrat @de
subclass of: substance_organic

disease_environmental
type: Class
subclass of: disease
label: umweltkrankheit @de

sign
type: Class
label: krankheitserscheinung @de
label: merkmal @de
label: Symptom @de
comment: An observable manifestation of a disease or condition based on clinical judgment, or a manifestation of a disease or condition which is experienced by the patient and reported as a subjective observation.
subclass of: http://lodlaundromat.org/.well-known/genid/34402347ec86c6028255dce461dc57ae#59
label: symptom
subclass of: finding
label: Merkmal @de
label: Krankheitserscheinung @de
subclass of: http://lodlaundromat.org/.well-known/genid/34402347ec86c6028255dce461dc57ae#60

product_intellectual
type: Class
label: produkt_geistig @de
subclass of: entity_conceptual

Vitamin
type: Class
comment: A substance, usually an organic chemical complex, present in natural products or made synthetically, which is essential in the diet of man or other higher animals. Included here are vitamin precursors, provitamins, and vitamin supplements.
subclass of: substance_biologically_active

abnormality_acquired
type: Class
subclass of: http://lodlaundromat.org/.well-known/genid/34402347ec86c6028255dce461dc57ae#65
subclass of: abnormality_anatomical
label: anomalie_erworben @de
comment: An abnormal structure, or one that is abnormal in size or location, found in or deriving from a previously normal structure. Acquired abnormalities are distinguished from diseases even though they may result in pathological functioning (e.g., "hernias incarcerate").

component_cell
type: Class
subclass of: structure_anatomical_fully_formed
label: zellkomponente @de
subclass of: http://lodlaundromat.org/.well-known/genid/34402347ec86c6028255dce461dc57ae#66
comment: A part of a cell or the intercellular matrix, generally visible by light microscopy.
subclass of: http://lodlaundromat.org/.well-known/genid/34402347ec86c6028255dce461dc57ae#67
subclass of: http://lodlaundromat.org/.well-known/genid/34402347ec86c6028255dce461dc57ae#68

structure_anatomical_fully_formed
type: Class
subclass of: http://lodlaundromat.org/.well-known/genid/34402347ec86c6028255dce461dc57ae#179
comment: An anatomical structure in a fully formed organism; in mammals, for example, a structure in the body after the birth of the organism.
subclass of: http://lodlaundromat.org/.well-known/genid/34402347ec86c6028255dce461dc57ae#184
subclass of: structure_anatomical
subclass of: http://lodlaundromat.org/.well-known/genid/34402347ec86c6028255dce461dc57ae#185

cell
type: Class
subclass of: structure_anatomical_fully_formed
subclass of: http://lodlaundromat.org/.well-known/genid/34402347ec86c6028255dce461dc57ae#100
label: zelle @de
subclass of: http://lodlaundromat.org/.well-known/genid/34402347ec86c6028255dce461dc57ae#105
subclass of: http://lodlaundromat.org/.well-known/genid/34402347ec86c6028255dce461dc57ae#106
comment: The fundamental structural and functional unit of living organisms.
subclass of: Shape

tissue
type: Class
subclass of: http://lodlaundromat.org/.well-known/genid/34402347ec86c6028255dce461dc57ae#217
label: gewebe @de
subclass of: http://lodlaundromat.org/.well-known/genid/34402347ec86c6028255dce461dc57ae#218
comment: An aggregation of similarly specialized cells and the associated intercellular substance. Tissues are relatively non-localized in comparison to body parts, organs or organ components.
subclass of: Shape
subclass of: http://lodlaundromat.org/.well-known/genid/34402347ec86c6028255dce461dc57ae#222
subclass of: structure_anatomical_fully_formed

function_cell
type: Class
subclass of: function_physiologic
comment: A physiologic function inherent to cells or cell components.
label: zellfunktion @de

function_molecular
type: Class
comment: A physiologic function occurring at the molecular level.
subclass of: function_physiologic
label: funktion_molekular @de

Chemical Viewed Structurally
type: Class
comment: A chemical or chemicals viewed from the perspective of their structural characteristics. Included here are concepts which can mean either a salt, an ion, or a compound (e.g., "Bromates" and "Bromides").
subclass of: substance_chemical

substance_chemical
type: Class
subclass of: http://lodlaundromat.org/.well-known/genid/34402347ec86c6028255dce461dc57ae#110
label: stoff_chemisch @de
subclass of: substance
label: substanz_chemisch @de
comment: Compounds or substances of definite molecular composition. Chemicals are viewed from two distinct perspectives in the network, functionally and structurally. Almost every chemical concept is assigned at least two types, generally one from the structure hierarchy and at least one from the function hierarchy.
subclass of: http://lodlaundromat.org/.well-known/genid/34402347ec86c6028255dce461dc57ae#111

substance_inorganic
type: Class
comment: Chemical elements and their compounds, excluding the hydrocarbons and their derivatives (except carbides, carbonates, cyanides, cyanates and carbon disulfide). Generally inorganic compounds contain ionic bonds. Included here are inorganic acids and salts, alloys, alkalies, and minerals.
label: substanz_anorganisch @de
subclass of: Chemical Viewed Structurally

system_disease
type: Class
subclass of: disease

genome
type: Class
comment: A specific sequence, or in the case of the genome the complete sequence, of nucleotides along a molecule of DNA or RNA (in the case of some viruses) which represent the functional units of heredity.
label: gen @de
label: gene
subclass of: http://lodlaundromat.org/.well-known/genid/34402347ec86c6028255dce461dc57ae#79
subclass of: structure_anatomical_fully_formed
subclass of: http://lodlaundromat.org/.well-known/genid/34402347ec86c6028255dce461dc57ae#80
subclass of: http://lodlaundromat.org/.well-known/genid/34402347ec86c6028255dce461dc57ae#86
label: genom @de

function_tissue
type: Class
subclass of: function_physiologic
label: function_organ
subclass of: http://lodlaundromat.org/.well-known/genid/34402347ec86c6028255dce461dc57ae#87
label: funktion_gewebe @de
subclass of: http://lodlaundromat.org/.well-known/genid/34402347ec86c6028255dce461dc57ae#88
comment: A physiologic function of a particular organ, organ system, or tissue.

occurs in
type: ObjectProperty
comment: Takes place in or happens under given conditions, circumstances, or time periods, or in a given location or population. This includes appears in, transpires, comes about, is present in, and exists in.
sub property of: functionally related to

contains
type: ObjectProperty
sub property of: physically related to
sub property of: has part
inverse of: contained in
comment: Holds or is the receptacle for fluids or other substances. This includes is filled with, holds, and is occupied by.

interconnects
type: ObjectProperty
comment: Serves to link or join together two or more other physical units. This includes joins, links, conjoins, articulates, separates, and bridges.
sub property of: physically related to

adjacent to
type: ObjectProperty
comment: Close to, near or abutting another physical unit with no other structure of the same kind intervening. This includes adjoins, abuts, is contiguous to, is juxtaposed, and is close to.
sub property of: spatially related to

lipid
type: Class
subclass of: substance_organic
comment: An inclusive group of fat or fat-derived substances that are soluble in nonpolar solvents related to fatty acid esters, fatty alcohols, sterols, waxes, etc. Included in this group are the saponifiable lipids such as glycerides (fats and oils), essential (volatile) oils, and phospholipids.

phenomenon_natural
type: Class
subclass of: process
label: prozess_natuerlich @de
comment: A phenomenon or process that occurs irrespective of the activities of human beings.
subclass of: http://lodlaundromat.org/.well-known/genid/34402347ec86c6028255dce461dc57ae#142
label: process_natural
subclass of: http://lodlaundromat.org/.well-known/genid/34402347ec86c6028255dce461dc57ae#143

interacts with
type: ObjectProperty
comment: Acts, functions, or operates together with.
sub property of: affects

body_junction
type: Class
subclass of: concept_spatial
label: body_space
label: space_body
label: junction_body

concept_spatial
type: Class
subclass of: entity_conceptual
label: konzept_raeumlich @de

function_genetic
type: Class
subclass of: function_molecular
subclass of: http://lodlaundromat.org/.well-known/genid/34402347ec86c6028255dce461dc57ae#112
label: funktion_genetisch @de
comment: Functions of or related to the maintenance, translation or expression of the genetic material.

produces
type: ObjectProperty
sub property of: brings about
comment: Brings forth, generates or creates. This includes yields, secretes, emits, biosynthesizes, generates, releases, discharges, and creates.

material_dental
type: Class
label: material_biomedical
subclass of: Chemical Viewed Functionally
comment: A substance used in biomedicine or dentistry predominantly for its physical, as opposed to chemical, properties. Included here are biocompatible materials, tissue adhesives, bone cements, resins, toothpastes, etc.

Chemical Viewed Functionally
type: Class
subclass of: substance_chemical
comment: A chemical viewed from the perspective of its functional characteristics or pharmacological activities.

steroid
type: Class
comment: One of a group of polycyclic, 17-carbon-atom, fused-ring compounds occurring both in natural and synthetic forms. Included here are naturally occurring and synthetic steroids, bufanolides, cardanolides, homosteroids, norsteroids, and secosteroids.
subclass of: lipid

prevents
type: ObjectProperty
sub property of: affects
comment: Stops, hinders or eliminates an action or condition.

disrupts
type: ObjectProperty
sub property of: affects
comment: Alters or influences an already existing condition, state, or situation. Produces a negative effect on.

treats
type: ObjectProperty
inverse of: treated by
comment: Applies a remedy with the object of effecting a cure or managing a condition.
sub property of: affects

object_physical
type: Class
comment: An object perceptible to the sense of vision or touch.
label: gegenstand @de
label: objekt_physikalisch @de
subclass of: entity

Immunologic Factor
type: Class
comment: A biologically active substance whose activities affect or play a role in the functioning of the immune system.
subclass of: substance_biologically_active

reagent_indicator
type: Class
label: reagent @de
subclass of: Chemical Viewed Functionally
comment: A substance primarily of interest for its use in laboratory or diagnostic tests and procedures to detect, measure, examine, or analyze other chemicals, processes, or conditions.
label: aid_diagnostic

process_vascular
type: Class
label: gefaessprozess @de
subclass of: disease

Receptor
type: Class
subclass of: substance_biologically_active
comment: A specific structure or site on the cell surface or within its cytoplasm that recognizes and binds with other specific molecules. These include the proteins on the surface of an immunocompetent cell that binds with antigens, or proteins found on the surface molecules that bind with hormones or neurotransmitters and react with other molecules that respond in a specific way.

ion
type: Class
subclass of: Chemical Viewed Structurally
label: isotop @de
comment: One of the 109 presently known fundamental substances that comprise all matter at and above the atomic level. This includes elemental metals, rare gases, and most abundant naturally occurring radioactive elements, as well as the ionic counterparts of elements (NA+, Cl-), and the less abundant isotopic forms. This does not include organic ions such as iodoacetate to which the type 'Organic Chemical' is assigned.
label: element_chemisch @de
label: element_chemical
label: isotope

dysfunction_molecular
type: Class
subclass of: function_pathologic
label: funktionsstoerung_molekular @de
label: Funktionsstoerung_der_Zelle @de
label: funktionsstoerung_der_zelle @de
comment: A pathologic function inherent to cells, parts of cells, or molecules.
label: dysfunction_cell

process of
type: ObjectProperty
inverse of: has process
comment: Action, function, or state of.
sub property of: functionally related to

substance_hazardous
type: Class
subclass of: http://lodlaundromat.org/.well-known/genid/34402347ec86c6028255dce461dc57ae#144
subclass of: Chemical Viewed Functionally
subclass of: http://lodlaundromat.org/.well-known/genid/34402347ec86c6028255dce461dc57ae#149
label: giftstoff @de
label: substance_poisonous
comment: A substance of concern because of its potentially hazardous or toxic effects. This would include most drugs of abuse, as well as agents that require special handling because of their toxicity.

fungus
type: Class
subclass of: organism
label: pilz @de

Neuroreactive Substance or Biogenic Amine
type: Class
subclass of: substance_biologically_active
comment: An endogenous substance whose activities affect or play an important role in the functioning of the nervous system. Included here are catecholamines, neuroregulators, neurophysins, etc.

classification
type: Class
subclass of: product_intellectual
label: klassifikation @de

eicosanoid
type: Class
comment: An oxygenated metabolite from polyunsaturated 20 carbon fatty acids including lipoxygenase and cyclooxygenase products and their synthetic analogs. This includes the prostaglandins and thromboxanes.
subclass of: lipid

causes
type: ObjectProperty
sub property of: brings about
comment: Brings about a condition or an effect. Implied here is that an agent, such as for example, a pharmacologic substance or an organism, has brought about the effect. This includes induces, effects, evokes, and etiology.

associated with
type: ObjectProperty
comment: has a significant or salient relationship to.

process_neoplastic
type: Class
subclass of: disease
label: prozess_neoplastisch @de
comment: A new and abnormal growth of tissue in which the growth is uncontrolled and progressive. The growths may be malignant or benign.

dysfunction_behavioral
type: Class
subclass of: disease
comment: A clinically significant dysfunction whose major manifestation is behavioral or psychological. These dysfunctions may have identified or presumed biological etiologies or manifestations.
label: verhaltensstoerung @de
label: stoerung_psychisch @de
label: dysfunction_mental

protein
type: Class
comment: Amino acids and chains of amino acids connected by peptide linkages.
label: aminosaeure @de
subclass of: http://lodlaundromat.org/.well-known/genid/34402347ec86c6028255dce461dc57ae#190
label: peptid @de
subclass of: substance_organic
label: peptide
label: eiweiss @de
label: aminoacid

tributary of
type: ObjectProperty
sub property of: physically related to
comment: Merges with. For example, the confluence of veins.

branch of
type: ObjectProperty
sub property of: physically related to
sub property of: part of
inverse of: has branch
comment: Arises from the division of. For example, the arborization of arteries.

traverses
type: ObjectProperty
sub property of: spatially related to
comment: Crosses or extends across another physical structure or area. This includes crosses over and crosses through.

body_region
type: Class
label: region_body
subclass of: concept_spatial
label: location_body

bacterium
type: Class
subclass of: organism
label: bakterium @de
label: bakterie @de

concept_quantitative
type: Class
label: konzept_quantitativ @de
subclass of: entity_conceptual

organism_attribute
type: Class
subclass of: entity_conceptual
label: attribut_organismus @de

physically related to
type: ObjectProperty
comment: Related by virtue of some physical attribute or characteristic.
sub property of: associated with

conceptually related to
type: ObjectProperty
comment: Related by some abstract concept, thought, or idea.
sub property of: associated with

functionally related to
type: ObjectProperty
sub property of: associated with
comment: Related by the carrying out of some function or activity.

spatially related to
type: ObjectProperty
sub property of: associated with
comment: Related by place or region.

ingredient of
type: ObjectProperty
inverse of: has ingredient
comment: Is a component of, as in a constituent of a preparation.
sub property of: physically related to

brings about
type: ObjectProperty
sub property of: functionally related to
comment: Acts on or influences an entity.

temporally related to
type: ObjectProperty
sub property of: associated with
comment: Related in time by preceding, co-occuring with, or following.

conceptual part of
type: ObjectProperty
sub property of: part of
inverse of: has conceptual part
sub property of: conceptually related to
comment: Conceptually a portion, division, or component of some larger whole.