SAO-CORE_properties: contains properties from SAO-CORE
type: Ontology

located in
type: ObjectProperty
sao ID: sao4245285112
comment: Replaced with RO's located_in. Classes using this property are Chemical Synapse, Junction Complex, and Vesicle.
sub property of: obsolete Object Property
inverse of: is Location Of

obsolete Object Property
type: ObjectProperty
type: DeprecatedProperty
sao ID: sao663269984

is Location Of
type: ObjectProperty
comment: This was replaced by RO's contained_in. Classes that were using this property include Contact Site, Internode, Juxtaparanode, Node of Ranvier, Paranode, Post-synaptic Site, and Pre-synaptic Active Zone.
sub property of: obsolete Object Property
inverse of: located in
sao ID: sao9371595441

site Adjacent To
type: ObjectProperty
sub property of: obsolete Object Property
type: SymmetricProperty
sao ID: sao7022761014
comment: Replaced this property with RO's adjacent_to. Classes using this property were node related sites (Internode, Paranode, Juxtaparanode, Node of Ranvier).

has Neurotransmitter
type: ObjectProperty
sao ID: sao1490541696
comment: Replaced with RO's has_proper_part.
comment: Neurotransmitter associated with neuronal class
sub property of: has Molecular Constituent
inverse of: is Neurotransmitter Of

has Molecular Constituent
type: ObjectProperty
inverse of: is Molecular Constituent Of
sub property of: has Component
sao ID: sao152994059
comment: Replaced with RO's has_proper_part.

is Neurotransmitter Of
type: ObjectProperty
comment: Replaced with RO's proper_part_of.
sub property of: is Molecular Constituent Of
type: InverseFunctionalProperty
inverse of: has Neurotransmitter
sao ID: sao924725934

continuous With Centrifugal
type: ObjectProperty
sub property of: obsolete Object Property
sao ID: sao1454173298

site Contained In
type: ObjectProperty
sao ID: sao6748852360
sub property of: obsolete Object Property
inverse of: contains Site
comment: Replaced this property with RO's contained_in. Classes using this property were Pre-synaptic Site, Pre-synaptic Active Zone, and Post-synaptic Site.

contains Site
type: ObjectProperty
sao ID: sao554204175
sub property of: obsolete Object Property
inverse of: site Contained In

has Regional Part
type: ObjectProperty
inverse of: is Regional Part Of
comment: Replaced with RO's integral_part. Many classes used this property, including Axon, Classical Lewy Body, Dendrite, Dendritic Tree, Epithelial Cell, Glial Cell, Golgi Apparatus)
sub property of: obsolete Object Property
type: TransitiveProperty
sao ID: sao1434436507

is Regional Part Of
type: ObjectProperty
sub property of: obsolete Object Property
comment: Replaced with RO's integral_part_of. The only class using this property was Dendritic Spine.
sao ID: sao1239937685
inverse of: has Regional Part

associated With
type: ObjectProperty
sao ID: sao2047323768
comment: Indicates that there is a spatial relationship other than containment or parthood between cellular regional parts or components (e.g. microtuble associates with mitochondria)
comment: Replaced with RO's is_part_of.
sub property of: is Part Of

is Part Of
type: ObjectProperty
inverse of: has Part
sao ID: sao9906015852
comment: Replaced with RO's part_of.
sub property of: obsolete Object Property

has Part
type: ObjectProperty
inverse of: is Part Of
comment: Replaced with RO's has_part.
sao ID: sao5598458770
sub property of: obsolete Object Property

has Boundary
type: ObjectProperty
sub property of: relationship
range: http://lodlaundromat.org/.well-known/genid/26bc7220e3222f3b7a4f77feae23232e#1
domain: http://lodlaundromat.org/.well-known/genid/26bc7220e3222f3b7a4f77feae23232e#4
sao ID: sao1844377738
inverse of: boundary Of
comment: Refers to a structure that defines the boundary of a given structure

boundary Of
type: ObjectProperty
range: http://lodlaundromat.org/.well-known/genid/26bc7220e3222f3b7a4f77feae23232e#7
sub property of: relationship
domain: http://lodlaundromat.org/.well-known/genid/26bc7220e3222f3b7a4f77feae23232e#10
inverse of: has Boundary
sao ID: sao923422536
comment: Indicates that the structure forms the boundary for another structure, e.g., membrane of endoplasmic reticulum is boundary of lumen of endoplasmic reticulum
type: FunctionalProperty

has Vesicle Component
type: ObjectProperty
inverse of: is Vesicle Component Of
sao ID: sao3762365186
sub property of: obsolete Object Property

is Vesicle Component Of
type: ObjectProperty
sub property of: obsolete Object Property
inverse of: has Vesicle Component
sao ID: sao7291254923

anatomical Location
type: ObjectProperty
sao ID: sao7122682114
sub property of: obsolete Object Property
comment: Replaced with RO's located_in. Before the switch, no classes were using this property.

Anatomical location: atlas
type: ObjectProperty
sub property of: anatomical Location
sao ID: sao1597912566
comment: Replaced with RO's located_in. Before the switch, no classes were using this property.
comment: Location of a cell in a specific coordinate system
preferred label: anatomical Location Atlas
type: FunctionalProperty

has Morphological Type
type: ObjectProperty
sao ID: sao3931558608
comment: Replaced with inheres_In.
inverse of: is Morphological Type Of
sub property of: has Property

is Morphological Type Of
type: ObjectProperty
sub property of: has Property
inverse of: has Morphological Type
sao ID: sao3610809721
comment: Replaced with inheres_In.

has Property
type: ObjectProperty
comment: Replaced with inheres_In.
comment: refers to a set of property classes that reflect unique aspects of a given structure, e.g., orientation, stability
sao ID: sao2103390115
sub property of: obsolete Object Property

has Component
type: ObjectProperty
inverse of: is Component Of
type: TransitiveProperty
sub property of: obsolete Object Property
sao ID: sao1623809261
comment: Replaced with RO's has_proper_part.
comment: Cellular components found in typical cells.

is Component Of
type: ObjectProperty
comment: Replaced with RO's proper_part_of
sub property of: obsolete Object Property
inverse of: has Component
sao ID: sao138767806

has Adjacent Cellular Element
type: ObjectProperty
sub property of: obsolete Object Property
sao ID: sao8979892663

continuous With
type: ObjectProperty
curation status: graph position temporary
sub property of: relationship
comment: This idea was adopted from FMA but possibly needs reconsideration.
sao ID: sao1896217670
definition: Physical continuity between structures
comment: Note that only a section (not its entirety) of the structure is continuous with another structure. It is a physical propety that relates spatial objects. We think this property should be a combination of integral part/is_integral_part_of and has_boundary.
type: SymmetricProperty

morphometrics
type: ObjectProperty
sao ID: sao872346836
comment: Replaced with inheres_In.
comment: Measurement associated with compartment
sub property of: has Property

is Molecular Constituent Of
type: ObjectProperty
sub property of: is Component Of
sao ID: sao1939689633
inverse of: has Molecular Constituent
comment: Replaced with RO's proper_part_of.

associated Cell Component
type: ObjectProperty
sao ID: sao1356746816
comment: Used to describe a physical relationship between two or more cellular components
comment: Replaced with RO's part_of. Classes using this property were Contact Site and Nucleolus-associated Heterochromatin.
sub property of: associated With

inheres In
type: ObjectProperty
creator: Lisa Fong
created date: 07/02/2008
sao ID: sao5320776245
sub property of: relationship
temp definition: Refers to a set of properties that reflect unique qualities of a given structure, e.g., orientation, stability.

has Surrounding Cellular Element
type: ObjectProperty
sub property of: associated Cellular Element
sao ID: sao4718979881
comment: Replaced with RO's part_of. The one class using this property was Nueritic Plaque.

associated Cellular Element
type: ObjectProperty
comment: Cellular element derived from another cell associated with a compartment, e.g., myelin
comment: Replaced with RO's part_of. Classes using this property were Neuritic Plaque and Senile Plaque.
sub property of: associated With
sao ID: sao180517057

attached To
type: ObjectProperty
comment: Indicates an intimate contact between two anatomical entities, each with their own real boundaries
pending action note: Need to determine whether this property is useful in conjunction with intercellular junctions, i.e., in order for two things to be attached, there must be a junction of some sort
sub property of: obsolete Object Property
type: FunctionalProperty
sao ID: sao1896476612

is Population Of
type: ObjectProperty
sao ID: sao7905250655
sub property of: obsolete Object Property
comment: Replaced with RO's part_of.
comment: This is intended to describe what kind of object the members of a population are.

is Intercellular Junction Compartment Of
type: ObjectProperty
sao ID: sao45720944
inverse of: intercellular Junction Compartment
sub property of: obsolete Object Property

intercellular Junction Compartment
type: ObjectProperty
comment: participates in one or more types of intercellular junctions
inverse of: is Intercellular Junction Compartment Of
sub property of: obsolete Object Property
sao ID: sao733319732

has Aggregate Part
type: ObjectProperty
sao ID: sao8839644583
comment: Replaced with RO's has_part. Classes that were using this property were Amyloid Aggregate, Chemical Synapse, Ribbon Synapse, and Supra Cellular Structure.
inverse of: is Aggregate Part of
sub property of: has Part

is Aggregate Part of
type: ObjectProperty
comment: Replaced with RO's part_of.
sub property of: is Part Of
inverse of: has Aggregate Part
sao ID: sao2422696582

continuous With Centripetal
type: ObjectProperty
sub property of: obsolete Object Property
sao ID: sao158083006

anatomical Location Specific
type: ObjectProperty
sub property of: anatomical Location
sao ID: sao548011359
comment: Refers to the specific location of an instance of a cell
comment: Replaced with RO's located_in. Before the switch, no classes were using this property.

location Component
type: ObjectProperty
sao ID: sao333215121
sub property of: anatomical Location
comment: Refers to the cellular component with which a feature is associated, e.g., ion receptor is associated with the plasma membrane
comment: Replaced with RO's located_in. The one class using this property was Intracellular Calcium Channel.

Atlas Coordinate M-L
type: DatatypeProperty
type: FunctionalProperty
sao ID: sao1804901442
sub property of: obsolete Datatype Property
comment: Coordinate along the medial-lateral axis
preferred label: atlas Coordinate M-L
range: string

obsolete Datatype Property
type: DatatypeProperty
comment: All datatype properties were made obsolete on 7/23/08. However, we may end up using some of these later.
sao ID: sao5853312183

observation Conditions
type: DatatypeProperty
range: string
comment: Indicates under what conditions the observation was made
sub property of: obsolete Datatype Property
sao ID: sao1429489883

Atlas Coordinate A-P
type: DatatypeProperty
range: string
comment: Coordiante along the anteior-posterior axis
sao ID: sao2048509857
sub property of: obsolete Datatype Property
type: FunctionalProperty
preferred label: atlas Coordinate A-P

Atlas Reference
type: DatatypeProperty
type: FunctionalProperty
sub property of: obsolete Datatype Property
comment: Name and edition of atlas used to derive coordinates
sao ID: sao244654816
preferred label: atlas Reference
range: string

point Of Measurement
type: DatatypeProperty
range: http://lodlaundromat.org/.well-known/genid/26bc7220e3222f3b7a4f77feae23232e#13
sao ID: sao1669593695
sub property of: obsolete Datatype Property
comment: Indicates the point at which a described measurement was taken

http://lodlaundromat.org/.well-known/genid/26bc7220e3222f3b7a4f77feae23232e#14
first: proximal
rest: http://lodlaundromat.org/.well-known/genid/26bc7220e3222f3b7a4f77feae23232e#15

http://lodlaundromat.org/.well-known/genid/26bc7220e3222f3b7a4f77feae23232e#15
first: distal
rest: nil

atlas Reference Point
type: DatatypeProperty
sao ID: sao1945565347
sub property of: obsolete Datatype Property
comment: Reference point of the coordinate system used, e.g., bregma
range: string
label: Atlas reference point
type: FunctionalProperty

number Of Branches
type: DatatypeProperty
type: FunctionalProperty
range: string
sub property of: obsolete Datatype Property
sao ID: sao1746944408

parent Cell Identity
type: DatatypeProperty
range: http://lodlaundromat.org/.well-known/genid/26bc7220e3222f3b7a4f77feae23232e#16
sub property of: obsolete Datatype Property
comment: Used to describe the method by which the parent cell to a subcellular part is identified. "Identified cell" means that some sort of interacellular label was used to identify the parent cell with some degree of certainty; "asserted" refers to the use of morphological and anatomical criteria to assign identity to a parent.
sao ID: sao1981606713
type: FunctionalProperty

http://lodlaundromat.org/.well-known/genid/26bc7220e3222f3b7a4f77feae23232e#17
first: Asserted
rest: http://lodlaundromat.org/.well-known/genid/26bc7220e3222f3b7a4f77feae23232e#18

http://lodlaundromat.org/.well-known/genid/26bc7220e3222f3b7a4f77feae23232e#18
first: concrete
rest: http://lodlaundromat.org/.well-known/genid/26bc7220e3222f3b7a4f77feae23232e#19

http://lodlaundromat.org/.well-known/genid/26bc7220e3222f3b7a4f77feae23232e#19
first: abstract
rest: nil

is Continuant
type: DatatypeProperty
sub property of: obsolete Datatype Property
sao ID: sao1798215493
range: http://lodlaundromat.org/.well-known/genid/26bc7220e3222f3b7a4f77feae23232e#20
comment: A continuant is an entity that endures through time. If true, then entity is a continuant; if false, then entity is an occurrent. An occurrent is defined as a process, event or happening, e.g., a dividing cell.

http://lodlaundromat.org/.well-known/genid/26bc7220e3222f3b7a4f77feae23232e#21
first: false
rest: http://lodlaundromat.org/.well-known/genid/26bc7220e3222f3b7a4f77feae23232e#22

http://lodlaundromat.org/.well-known/genid/26bc7220e3222f3b7a4f77feae23232e#22
first: true
rest: nil

number
type: DatatypeProperty
range: int
type: FunctionalProperty
sub property of: obsolete Datatype Property
sao ID: sao267012610

maximum Branch Order
type: DatatypeProperty
sao ID: sao925977276
comment: Refers to the maximum branch order of the dendritic tree
sub property of: obsolete Datatype Property
range: int
type: FunctionalProperty

is Spiny
type: DatatypeProperty
sub property of: obsolete Datatype Property
sao ID: sao1863785805
comment: Denotes whether a neuron or dendrite is characterized by at least one spine.
type: FunctionalProperty
range: boolean

circuit Type
type: DatatypeProperty
type: FunctionalProperty
sao ID: sao1967171150
sub property of: obsolete Datatype Property
range: http://lodlaundromat.org/.well-known/genid/26bc7220e3222f3b7a4f77feae23232e#23

http://lodlaundromat.org/.well-known/genid/26bc7220e3222f3b7a4f77feae23232e#24
first: projection neuron
rest: http://lodlaundromat.org/.well-known/genid/26bc7220e3222f3b7a4f77feae23232e#25

http://lodlaundromat.org/.well-known/genid/26bc7220e3222f3b7a4f77feae23232e#25
rest: nil
first: local circuit neuron

shape
type: DatatypeProperty
sub property of: obsolete Datatype Property
comment: Used to describe generic shape of a component or compartment
type: FunctionalProperty
sao ID: sao166035570
range: http://lodlaundromat.org/.well-known/genid/26bc7220e3222f3b7a4f77feae23232e#26

http://lodlaundromat.org/.well-known/genid/26bc7220e3222f3b7a4f77feae23232e#27
rest: http://lodlaundromat.org/.well-known/genid/26bc7220e3222f3b7a4f77feae23232e#28
first: convex

http://lodlaundromat.org/.well-known/genid/26bc7220e3222f3b7a4f77feae23232e#28
rest: http://lodlaundromat.org/.well-known/genid/26bc7220e3222f3b7a4f77feae23232e#29
first: concave

http://lodlaundromat.org/.well-known/genid/26bc7220e3222f3b7a4f77feae23232e#29
first: spherical
rest: http://lodlaundromat.org/.well-known/genid/26bc7220e3222f3b7a4f77feae23232e#30

http://lodlaundromat.org/.well-known/genid/26bc7220e3222f3b7a4f77feae23232e#30
rest: http://lodlaundromat.org/.well-known/genid/26bc7220e3222f3b7a4f77feae23232e#31
first: elliptical

http://lodlaundromat.org/.well-known/genid/26bc7220e3222f3b7a4f77feae23232e#31
rest: http://lodlaundromat.org/.well-known/genid/26bc7220e3222f3b7a4f77feae23232e#32
first: spindle-shaped

http://lodlaundromat.org/.well-known/genid/26bc7220e3222f3b7a4f77feae23232e#32
rest: http://lodlaundromat.org/.well-known/genid/26bc7220e3222f3b7a4f77feae23232e#33
first: round

http://lodlaundromat.org/.well-known/genid/26bc7220e3222f3b7a4f77feae23232e#33
rest: http://lodlaundromat.org/.well-known/genid/26bc7220e3222f3b7a4f77feae23232e#34
first: flat

http://lodlaundromat.org/.well-known/genid/26bc7220e3222f3b7a4f77feae23232e#34
first: cylindrical
rest: nil

anatomical Location General
type: DatatypeProperty
sub property of: obsolete Datatype Property
comment: General description of the anatomical location assigned to the cell class, regardless of whether parts of the cell are located elsewhere. For neurons, this would be the location of the cell soma
comment: This property is temporarily defined as a datatype property. We anticipate that the locations of cells and cell parts will be drawn from a neuroanatomical brain region ontology in a future version.
sao ID: sao1065676773
range: string
curation status: graph position temporary

maximum
type: DatatypeProperty
range: float
comment: maximum value in a range
sao ID: sao395752640
sub property of: obsolete Datatype Property

species
type: DatatypeProperty
sao ID: sao1185641609
sub property of: obsolete Datatype Property
comment: Indicates the species of organism from which an observation derives
range: string
type: FunctionalProperty

value
type: DatatypeProperty
type: FunctionalProperty
sub property of: obsolete Datatype Property
range: float
sao ID: sao655061336
comment: measurement value

synapse Type
type: DatatypeProperty
sub property of: obsolete Datatype Property
comment: Classification of synaptic type according to Gray, except using the symmetrical (Gray's Type 2) and asymmetrical (Gray's Type 1) designations
range: http://lodlaundromat.org/.well-known/genid/26bc7220e3222f3b7a4f77feae23232e#35
sao ID: sao99760531

http://lodlaundromat.org/.well-known/genid/26bc7220e3222f3b7a4f77feae23232e#36
first: asymmetrical
rest: http://lodlaundromat.org/.well-known/genid/26bc7220e3222f3b7a4f77feae23232e#37

http://lodlaundromat.org/.well-known/genid/26bc7220e3222f3b7a4f77feae23232e#37
first: symmetrical
rest: nil

population Object
type: DatatypeProperty
sao ID: sao1428515021
sub property of: obsolete Datatype Property
comment: Used to describe whether properties are derived from a single, identified object or represent a summary derived from multiple instances of the object. For example, if a source described the properties of a single filled dendrites, this would not be a population object. If a source described the general attributes of all dendrites from a single neuron, then this would be a population object because the properties represent a summary of all dendrites lumped together. The number field can be used to specify the number of objects on which the descriptions is based.
range: http://lodlaundromat.org/.well-known/genid/26bc7220e3222f3b7a4f77feae23232e#38
type: FunctionalProperty

http://lodlaundromat.org/.well-known/genid/26bc7220e3222f3b7a4f77feae23232e#39
rest: http://lodlaundromat.org/.well-known/genid/26bc7220e3222f3b7a4f77feae23232e#40
first: Yes

http://lodlaundromat.org/.well-known/genid/26bc7220e3222f3b7a4f77feae23232e#40
first: No
rest: nil

unit
type: DatatypeProperty
sao ID: sao40919963
type: FunctionalProperty
range: http://lodlaundromat.org/.well-known/genid/26bc7220e3222f3b7a4f77feae23232e#41
sub property of: obsolete Datatype Property
comment: unit of measurement

http://lodlaundromat.org/.well-known/genid/26bc7220e3222f3b7a4f77feae23232e#42
rest: http://lodlaundromat.org/.well-known/genid/26bc7220e3222f3b7a4f77feae23232e#43
first: angstroms

http://lodlaundromat.org/.well-known/genid/26bc7220e3222f3b7a4f77feae23232e#43
rest: http://lodlaundromat.org/.well-known/genid/26bc7220e3222f3b7a4f77feae23232e#44
first: microns

http://lodlaundromat.org/.well-known/genid/26bc7220e3222f3b7a4f77feae23232e#44
rest: http://lodlaundromat.org/.well-known/genid/26bc7220e3222f3b7a4f77feae23232e#45
first: spines per micron

http://lodlaundromat.org/.well-known/genid/26bc7220e3222f3b7a4f77feae23232e#45
rest: http://lodlaundromat.org/.well-known/genid/26bc7220e3222f3b7a4f77feae23232e#46
first: cubic microns

http://lodlaundromat.org/.well-known/genid/26bc7220e3222f3b7a4f77feae23232e#46
rest: nil
first: microns squared

orientation Reference To
type: DatatypeProperty
sub property of: obsolete Datatype Property
comment: Element with reference to which orientation is defined
range: string
sao ID: sao2110623092
type: FunctionalProperty

standard Error
type: DatatypeProperty
type: FunctionalProperty
sao ID: sao1620782974
range: float
sub property of: obsolete Datatype Property
comment: Standard error (+/-)

psd Morphology
type: DatatypeProperty
sao ID: sao1056822429
label: PSD morphology
range: http://lodlaundromat.org/.well-known/genid/26bc7220e3222f3b7a4f77feae23232e#47
sub property of: obsolete Datatype Property
comment: Describes general morphology of the post synaptic density (PSD), where it is classified as macular if the thickening is continuous, or perforated when the PSD is interrupted by electron-lucent regions (Harris KM et al., 1992).

http://lodlaundromat.org/.well-known/genid/26bc7220e3222f3b7a4f77feae23232e#48
first: perforated
rest: http://lodlaundromat.org/.well-known/genid/26bc7220e3222f3b7a4f77feae23232e#49

http://lodlaundromat.org/.well-known/genid/26bc7220e3222f3b7a4f77feae23232e#49
rest: http://lodlaundromat.org/.well-known/genid/26bc7220e3222f3b7a4f77feae23232e#50
first: macular

http://lodlaundromat.org/.well-known/genid/26bc7220e3222f3b7a4f77feae23232e#50
rest: http://lodlaundromat.org/.well-known/genid/26bc7220e3222f3b7a4f77feae23232e#51
first: asymmetric

http://lodlaundromat.org/.well-known/genid/26bc7220e3222f3b7a4f77feae23232e#51
first: symmetric
rest: nil

Number of Primary Dendrites Min
type: DatatypeProperty
sub property of: obsolete Datatype Property
range: int
comment: Refers to the minimum number of primary dendrites arising from the cell soma
preferred label: number Primary Dendrites Min
sao ID: sao950829914
type: FunctionalProperty

value Type
type: DatatypeProperty
range: http://lodlaundromat.org/.well-known/genid/26bc7220e3222f3b7a4f77feae23232e#52
sao ID: sao375065056
type: FunctionalProperty
comment: Describes whether the reported values are averages, estimates, ranges, or absolute values
sub property of: obsolete Datatype Property

http://lodlaundromat.org/.well-known/genid/26bc7220e3222f3b7a4f77feae23232e#53
rest: http://lodlaundromat.org/.well-known/genid/26bc7220e3222f3b7a4f77feae23232e#54
first: range

http://lodlaundromat.org/.well-known/genid/26bc7220e3222f3b7a4f77feae23232e#54
rest: http://lodlaundromat.org/.well-known/genid/26bc7220e3222f3b7a4f77feae23232e#55
first: less than or equal to

http://lodlaundromat.org/.well-known/genid/26bc7220e3222f3b7a4f77feae23232e#55
first: estimate
rest: http://lodlaundromat.org/.well-known/genid/26bc7220e3222f3b7a4f77feae23232e#56

http://lodlaundromat.org/.well-known/genid/26bc7220e3222f3b7a4f77feae23232e#56
rest: http://lodlaundromat.org/.well-known/genid/26bc7220e3222f3b7a4f77feae23232e#57
first: greater than or equal to

http://lodlaundromat.org/.well-known/genid/26bc7220e3222f3b7a4f77feae23232e#57
first: greater than
rest: http://lodlaundromat.org/.well-known/genid/26bc7220e3222f3b7a4f77feae23232e#58

http://lodlaundromat.org/.well-known/genid/26bc7220e3222f3b7a4f77feae23232e#58
first: average
rest: http://lodlaundromat.org/.well-known/genid/26bc7220e3222f3b7a4f77feae23232e#59

http://lodlaundromat.org/.well-known/genid/26bc7220e3222f3b7a4f77feae23232e#59
rest: http://lodlaundromat.org/.well-known/genid/26bc7220e3222f3b7a4f77feae23232e#60
first: less than

http://lodlaundromat.org/.well-known/genid/26bc7220e3222f3b7a4f77feae23232e#60
first: direct
rest: http://lodlaundromat.org/.well-known/genid/26bc7220e3222f3b7a4f77feae23232e#61

http://lodlaundromat.org/.well-known/genid/26bc7220e3222f3b7a4f77feae23232e#61
rest: nil
first: absolute

location CNS PNS
type: DatatypeProperty
sub property of: obsolete Datatype Property
type: FunctionalProperty
sao ID: sao1130665397
comment: Differentiates between cells and processes that are located in the central nervous system (CNS) vs peripheral nervous system (PNS). Does not refer to embyrological origin.
range: http://lodlaundromat.org/.well-known/genid/26bc7220e3222f3b7a4f77feae23232e#62

http://lodlaundromat.org/.well-known/genid/26bc7220e3222f3b7a4f77feae23232e#63
first: CNS
rest: http://lodlaundromat.org/.well-known/genid/26bc7220e3222f3b7a4f77feae23232e#64

http://lodlaundromat.org/.well-known/genid/26bc7220e3222f3b7a4f77feae23232e#64
first: PNS
rest: nil

Age of Animal
type: DatatypeProperty
type: FunctionalProperty
comment: Indicates the age of the animal in which the observation was made
sub property of: obsolete Datatype Property
preferred label: age Of Animal
range: string
sao ID: sao2134236783

presence
type: DatatypeProperty
range: http://lodlaundromat.org/.well-known/genid/26bc7220e3222f3b7a4f77feae23232e#65
comment: This property should be updated when we switch to OBR relations to the "lacks" relationship
sub property of: obsolete Datatype Property
curation status: graph position temporary
sao ID: sao2372462654
definition: Used to denote the presence or absence of a feature. "Found" indicates that the feature described was observed in this instance. "Found" is always assumed to be the default. "Not found" indicates that a feature was looked for and specifically not found, e.g. microtubules were not found in dendritic spines. This value should not be used if the feature was merely not described.

http://lodlaundromat.org/.well-known/genid/26bc7220e3222f3b7a4f77feae23232e#66
first: not found
rest: nil

density
type: DatatypeProperty
sao ID: sao382106499
type: FunctionalProperty
sub property of: obsolete Datatype Property
range: float

has Inherent 3D Shape
type: DatatypeProperty
sub property of: obsolete Datatype Property
range: http://lodlaundromat.org/.well-known/genid/26bc7220e3222f3b7a4f77feae23232e#67
sao ID: sao1254683799

http://lodlaundromat.org/.well-known/genid/26bc7220e3222f3b7a4f77feae23232e#68
first: false
rest: http://lodlaundromat.org/.well-known/genid/26bc7220e3222f3b7a4f77feae23232e#69

http://lodlaundromat.org/.well-known/genid/26bc7220e3222f3b7a4f77feae23232e#69
rest: nil
first: true

branch Order
type: DatatypeProperty
comment: A property of branching structures such as axons and dendrites
type: FunctionalProperty
sao ID: sao996727841
range: http://lodlaundromat.org/.well-known/genid/26bc7220e3222f3b7a4f77feae23232e#70
sub property of: obsolete Datatype Property

http://lodlaundromat.org/.well-known/genid/26bc7220e3222f3b7a4f77feae23232e#71
first: 3
rest: http://lodlaundromat.org/.well-known/genid/26bc7220e3222f3b7a4f77feae23232e#72

http://lodlaundromat.org/.well-known/genid/26bc7220e3222f3b7a4f77feae23232e#72
rest: http://lodlaundromat.org/.well-known/genid/26bc7220e3222f3b7a4f77feae23232e#73
first: >3

http://lodlaundromat.org/.well-known/genid/26bc7220e3222f3b7a4f77feae23232e#73
rest: http://lodlaundromat.org/.well-known/genid/26bc7220e3222f3b7a4f77feae23232e#74
first: 2

http://lodlaundromat.org/.well-known/genid/26bc7220e3222f3b7a4f77feae23232e#74
rest: nil
first: >2

isoform
type: DatatypeProperty
sao ID: sao1267375031
type: FunctionalProperty
range: string
sub property of: obsolete Datatype Property

ccdb ID
type: DatatypeProperty
definition: Unique identifier of an instance found in the CCDB.
range: string
sao ID: sao796296921
type: FunctionalProperty
sub property of: obsolete Datatype Property

has Mass
type: DatatypeProperty
sub property of: obsolete Datatype Property
sao ID: sao1077517916
range: http://lodlaundromat.org/.well-known/genid/26bc7220e3222f3b7a4f77feae23232e#75

http://lodlaundromat.org/.well-known/genid/26bc7220e3222f3b7a4f77feae23232e#76
rest: http://lodlaundromat.org/.well-known/genid/26bc7220e3222f3b7a4f77feae23232e#77
first: false

http://lodlaundromat.org/.well-known/genid/26bc7220e3222f3b7a4f77feae23232e#77
first: true
rest: nil

total Dendritic Length
type: DatatypeProperty
type: FunctionalProperty
range: float
sub property of: obsolete Datatype Property
sao ID: sao528500906
comment: Cumulative length of all dendrites in the dendritic tree

molecular weight
type: DatatypeProperty
sao ID: sao1220772118
type: FunctionalProperty
sub property of: obsolete Datatype Property
range: string
preferred label: molecular Weight

functional Type
type: DatatypeProperty
sub property of: obsolete Datatype Property
comment: functional categorization of cell, e.g., motor, sensory, secretory, myelinating
type: FunctionalProperty
range: http://lodlaundromat.org/.well-known/genid/26bc7220e3222f3b7a4f77feae23232e#78
sao ID: sao1608074544

http://lodlaundromat.org/.well-known/genid/26bc7220e3222f3b7a4f77feae23232e#79
first: inhibitory
rest: http://lodlaundromat.org/.well-known/genid/26bc7220e3222f3b7a4f77feae23232e#80

http://lodlaundromat.org/.well-known/genid/26bc7220e3222f3b7a4f77feae23232e#80
first: modulatory
rest: http://lodlaundromat.org/.well-known/genid/26bc7220e3222f3b7a4f77feae23232e#81

http://lodlaundromat.org/.well-known/genid/26bc7220e3222f3b7a4f77feae23232e#81
first: excitatory
rest: nil

polarity Reference To
type: DatatypeProperty
range: string
sub property of: obsolete Datatype Property
sao ID: sao431495567
comment: Reference to which polarity is defined
type: FunctionalProperty

process Number
type: DatatypeProperty
sao ID: sao841626191
sub property of: obsolete Datatype Property
type: FunctionalProperty
comment: Describes the general morphology of a class of neurons with respect to the number of processes extending from the cell soma
range: http://lodlaundromat.org/.well-known/genid/26bc7220e3222f3b7a4f77feae23232e#82

http://lodlaundromat.org/.well-known/genid/26bc7220e3222f3b7a4f77feae23232e#83
first: bipolar
rest: http://lodlaundromat.org/.well-known/genid/26bc7220e3222f3b7a4f77feae23232e#84

http://lodlaundromat.org/.well-known/genid/26bc7220e3222f3b7a4f77feae23232e#84
first: unipolar
rest: http://lodlaundromat.org/.well-known/genid/26bc7220e3222f3b7a4f77feae23232e#85

http://lodlaundromat.org/.well-known/genid/26bc7220e3222f3b7a4f77feae23232e#85
rest: nil
first: multipolar

sex Of Animal
type: DatatypeProperty
sub property of: obsolete Datatype Property
type: FunctionalProperty
sao ID: sao392224970
range: http://lodlaundromat.org/.well-known/genid/26bc7220e3222f3b7a4f77feae23232e#86
comment: Indicates the sex of the animal in which the observation was made.

http://lodlaundromat.org/.well-known/genid/26bc7220e3222f3b7a4f77feae23232e#87
first: Female
rest: http://lodlaundromat.org/.well-known/genid/26bc7220e3222f3b7a4f77feae23232e#88

http://lodlaundromat.org/.well-known/genid/26bc7220e3222f3b7a4f77feae23232e#88
first: Male
rest: http://lodlaundromat.org/.well-known/genid/26bc7220e3222f3b7a4f77feae23232e#89

http://lodlaundromat.org/.well-known/genid/26bc7220e3222f3b7a4f77feae23232e#89
rest: nil
first: Unspecified

Number of Axons
type: DatatypeProperty
range: int
sub property of: obsolete Datatype Property
sao ID: sao1384659949
preferred label: number Of Axons
type: FunctionalProperty
comment: Refers to the number of axons arising from the cell soma or primary dendrite. Usually is "1", but may be "0" for some neuron types. In rare cases in mammalian neurons, may be more than 1.

number Primary Dendrites Max
type: DatatypeProperty
type: FunctionalProperty
sao ID: sao1936650489
sub property of: obsolete Datatype Property
range: int
comment: Refers to the maximum number of primary dendrites generally seen in a particulary neuronal class

Atlas Coordinate D-V
type: DatatypeProperty
preferred label: atlas Coordinate D-V
type: FunctionalProperty
sub property of: obsolete Datatype Property
range: string
comment: Coordinate along the dorsal ventral axis
sao ID: sao833783433

minimum
type: DatatypeProperty
sub property of: obsolete Datatype Property
range: float
comment: Minimum value in a range
sao ID: sao643761283