biological process xp multi organism process
type: Ontology
comment: designed to augment biological_process_xp_regulation
comment: This is an OWL translation of an ontology whose native representational form is .obo. The translation was performed using the oboInOwl xslt library. For details, see http://www.berkeleybop.org/obo-conv.cgi

response_to
type: ObjectProperty

unfolds_in_proximity_of
type: ObjectProperty
comment: chemotaxis in host environment : chemotaxis that unfolds_in_proximity_of host : "The directed movement of a motile cell or organism in response to a specific chemical concentration gradient on, *within* or near its host organism"

regulates_process_in
type: ObjectProperty
has OBO namespace: biological_role

induces
type: ObjectProperty
sub property of: positively regulates

unfolds_within
type: ObjectProperty
sub property of: unfolds_in_proximity_of

unfolds_on_or_near
type: ObjectProperty
comment: Example: chemotaxis on or near host : "The directed movement of a motile cell or organism in response to a specific chemical concentration gradient on or near its host organism"
sub property of: unfolds_in_proximity_of

Role
type: Class
has OBO namespace: biological_role

interspecies role
type: Class
has OBO namespace: biological_role
subclass of: Role

immunological role
type: Class
has OBO namespace: biological_role
subclass of: Role

virus
type: Class
has OBO namespace: biological_role
subclass of: other organism

symbiont
type: Class
has OBO namespace: biological_role
subclass of: other organism

other organism
type: Class
has exact synonym: another organism
  type: Synonym
  has db xref: GO:0031640
    type: DbXref
    has URI: http://purl.org/obo/owl/GO#GO_0031640
has OBO namespace: biological_role
subclass of: organism

host
type: Class
has OBO namespace: biological_role
subclass of: other organism

organism
type: Class
comment: example: modulation by organism of immune response of other organism during symbiotic interaction
has related synonym: self
has OBO namespace: biological_role
subclass of: interspecies role

parasite
type: Class
has OBO namespace: biological_role
subclass of: other organism