nutritive value
preferred label: valor nutritivo @es
alternative label: quality for nutrition
broader: http://lod.nal.usda.gov/nalt/33531
narrower: http://lod.nal.usda.gov/nalt/55470
narrower: http://lod.nal.usda.gov/nalt/55430
related: http://lod.nal.usda.gov/nalt/10475
alternative label: food value
alternative label: feed value
related: http://lod.nal.usda.gov/nalt/10481
related: http://lod.nal.usda.gov/nalt/15576
modified: 2014-04-11
related: http://lod.nal.usda.gov/nalt/40878
alternative label: nutritive value index
narrower: http://lod.nal.usda.gov/nalt/199028
alternative label: nutritional value
alternative label: fattening value
alternative label: feed nutritive value
narrower: http://lod.nal.usda.gov/nalt/55471
alternative label: nutritive ratio
broader: http://lod.nal.usda.gov/nalt/33532
broader: http://lod.nal.usda.gov/nalt/27606
related: http://lod.nal.usda.gov/nalt/10483
scope note: Use for evaluating the ability of a food or feed to contribute to the diet and/or nutritional status of a human or animal; for descriptions of the composition of foods/feeds, without regard to their efficacy in the organism, USE "food composition" or one of its narrower terms.
alternative label: dietary value
definition: Indicación de la contribución de un alimento al contenido nutritivo de la dieta. Este valor depende de la cantidad de alimento que es digerido y absorbido y las cantidades del nutrientes esenciales (proteína, grasa, hidratos de carbono, minerales, vitaminas) que éste contiene. @es
related: http://lod.nal.usda.gov/nalt/17238
alternative label: feeding value
definition: An indication of the contribution of a food to the nutrient content of the diet. This value depends on the quantity of a food which is digested and absorbed and the amounts of the essential nutrients (protein, fat, carbohydrate, minerals, vitamins) which it contains.
related: http://lod.nal.usda.gov/nalt/24612
alternative label: food nutritive value
alternative label: nutritional quality
created: 2006-01-19
narrower: http://lod.nal.usda.gov/nalt/17239
related: http://lod.nal.usda.gov/nalt/17237
related: http://lod.nal.usda.gov/nalt/10480
related: http://lod.nal.usda.gov/nalt/37110
alternative label: nutritional characteristics
alternative label: nutrient value
narrower: http://lod.nal.usda.gov/nalt/33535
narrower: http://lod.nal.usda.gov/nalt/33534
scope note: Usar para la acción de evaluar la capacidad de un alimento o comida para contribuir a la dieta y/o estado nutricional de un humano o animal; USAR "composición alimentaria" o un término más específico para descripciones de la composición de comidas/alimentos, sin relación con su eficacia en el organismo. @es
narrower: http://lod.nal.usda.gov/nalt/192559
type: Concept