numbers
disjoint with: workplaces
subclass of: http://lodlaundromat.org/.well-known/genid/c8e0b8b6e1bde2aaa1819fd2d1daf2fb#373
disjoint with: http://lodlaundromat.org/.well-known/genid/c8e0b8b6e1bde2aaa1819fd2d1daf2fb#1
subclass of: http://lodlaundromat.org/.well-known/genid/c8e0b8b6e1bde2aaa1819fd2d1daf2fb#269
subclass of: http://lodlaundromat.org/.well-known/genid/c8e0b8b6e1bde2aaa1819fd2d1daf2fb#64
disjoint with: diseases
disjoint with: food or drink
subclass of: http://lodlaundromat.org/.well-known/genid/c8e0b8b6e1bde2aaa1819fd2d1daf2fb#154
disjoint with: earthscape
disjoint with: plants
subclass of: http://lodlaundromat.org/.well-known/genid/c8e0b8b6e1bde2aaa1819fd2d1daf2fb#210
disjoint with: natural phenomena
subclass of: http://lodlaundromat.org/.well-known/genid/c8e0b8b6e1bde2aaa1819fd2d1daf2fb#396
disjoint with: facilities
disjoint with: natural substance
subclass of: http://lodlaundromat.org/.well-known/genid/c8e0b8b6e1bde2aaa1819fd2d1daf2fb#597
subclass of: http://lodlaundromat.org/.well-known/genid/c8e0b8b6e1bde2aaa1819fd2d1daf2fb#39
disjoint with: audio information
subclass of: http://lodlaundromat.org/.well-known/genid/c8e0b8b6e1bde2aaa1819fd2d1daf2fb#487
subclass of: http://lodlaundromat.org/.well-known/genid/c8e0b8b6e1bde2aaa1819fd2d1daf2fb#110
disjoint with: drugs
disjoint with: animals
subclass of: http://lodlaundromat.org/.well-known/genid/c8e0b8b6e1bde2aaa1819fd2d1daf2fb#352
disjoint with: http://lodlaundromat.org/.well-known/genid/c8e0b8b6e1bde2aaa1819fd2d1daf2fb#306
subclass of: http://lodlaundromat.org/.well-known/genid/c8e0b8b6e1bde2aaa1819fd2d1daf2fb#289
subclass of: Thing
disjoint with: protists fungus
subclass of: http://lodlaundromat.org/.well-known/genid/c8e0b8b6e1bde2aaa1819fd2d1daf2fb#460
subclass of: http://lodlaundromat.org/.well-known/genid/c8e0b8b6e1bde2aaa1819fd2d1daf2fb#529
subclass of: http://lodlaundromat.org/.well-known/genid/c8e0b8b6e1bde2aaa1819fd2d1daf2fb#247
disjoint with: written information
disjoint with: finance and economy
subclass of: http://lodlaundromat.org/.well-known/genid/c8e0b8b6e1bde2aaa1819fd2d1daf2fb#227
subclass of: http://lodlaundromat.org/.well-known/genid/c8e0b8b6e1bde2aaa1819fd2d1daf2fb#574
subclass of: http://lodlaundromat.org/.well-known/genid/c8e0b8b6e1bde2aaa1819fd2d1daf2fb#433
disjoint with: Nothing
disjoint with: activities
subclass of: http://lodlaundromat.org/.well-known/genid/c8e0b8b6e1bde2aaa1819fd2d1daf2fb#190
disjoint with: organizations
subclass of: http://lodlaundromat.org/.well-known/genid/c8e0b8b6e1bde2aaa1819fd2d1daf2fb#133
subclass of: http://lodlaundromat.org/.well-known/genid/c8e0b8b6e1bde2aaa1819fd2d1daf2fb#556
disjoint with: products
disjoint with: geopolitical
disjoint with: http://lodlaundromat.org/.well-known/genid/c8e0b8b6e1bde2aaa1819fd2d1daf2fb#510
subclass of: http://lodlaundromat.org/.well-known/genid/c8e0b8b6e1bde2aaa1819fd2d1daf2fb#166
disjoint with: chemistry
disjoint with: events
subclass of: http://lodlaundromat.org/.well-known/genid/c8e0b8b6e1bde2aaa1819fd2d1daf2fb#86
disjoint with: person types
disjoint with: time
type: Class
subclass of: http://lodlaundromat.org/.well-known/genid/c8e0b8b6e1bde2aaa1819fd2d1daf2fb#422
disjoint with: society
disjoint with: visual information
subclass of: http://lodlaundromat.org/.well-known/genid/c8e0b8b6e1bde2aaa1819fd2d1daf2fb#4
subclass of: SuperType
subclass of: http://lodlaundromat.org/.well-known/genid/c8e0b8b6e1bde2aaa1819fd2d1daf2fb#19
disjoint with: Extraterrestrial
disjoint with: prokaryotes
disjoint with: http://lodlaundromat.org/.well-known/genid/c8e0b8b6e1bde2aaa1819fd2d1daf2fb#325
definition: This unique SuperType is for any abstract representation of numbers and numerics

workplaces
disjoint with: society
subclass of: Thing
disjoint with: animals
type: Class
subclass of: http://lodlaundromat.org/.well-known/genid/c8e0b8b6e1bde2aaa1819fd2d1daf2fb#556
disjoint with: http://lodlaundromat.org/.well-known/genid/c8e0b8b6e1bde2aaa1819fd2d1daf2fb#1
disjoint with: diseases
subclass of: http://lodlaundromat.org/.well-known/genid/c8e0b8b6e1bde2aaa1819fd2d1daf2fb#597
disjoint with: natural phenomena
subclass of: http://lodlaundromat.org/.well-known/genid/c8e0b8b6e1bde2aaa1819fd2d1daf2fb#487
disjoint with: chemistry
disjoint with: food or drink
disjoint with: http://lodlaundromat.org/.well-known/genid/c8e0b8b6e1bde2aaa1819fd2d1daf2fb#190
disjoint with: audio information
subclass of: http://lodlaundromat.org/.well-known/genid/c8e0b8b6e1bde2aaa1819fd2d1daf2fb#510
disjoint with: events
disjoint with: written information
disjoint with: Nothing
disjoint with: protists fungus
disjoint with: numbers
subclass of: http://lodlaundromat.org/.well-known/genid/c8e0b8b6e1bde2aaa1819fd2d1daf2fb#39
disjoint with: http://lodlaundromat.org/.well-known/genid/c8e0b8b6e1bde2aaa1819fd2d1daf2fb#210
subclass of: http://lodlaundromat.org/.well-known/genid/c8e0b8b6e1bde2aaa1819fd2d1daf2fb#110
disjoint with: plants
disjoint with: Extraterrestrial
disjoint with: http://lodlaundromat.org/.well-known/genid/c8e0b8b6e1bde2aaa1819fd2d1daf2fb#574
subclass of: SuperType
subclass of: http://lodlaundromat.org/.well-known/genid/c8e0b8b6e1bde2aaa1819fd2d1daf2fb#166
subclass of: http://lodlaundromat.org/.well-known/genid/c8e0b8b6e1bde2aaa1819fd2d1daf2fb#289
disjoint with: visual information
subclass of: http://lodlaundromat.org/.well-known/genid/c8e0b8b6e1bde2aaa1819fd2d1daf2fb#529
subclass of: http://lodlaundromat.org/.well-known/genid/c8e0b8b6e1bde2aaa1819fd2d1daf2fb#396
disjoint with: natural substance
subclass of: http://lodlaundromat.org/.well-known/genid/c8e0b8b6e1bde2aaa1819fd2d1daf2fb#460
subclass of: http://lodlaundromat.org/.well-known/genid/c8e0b8b6e1bde2aaa1819fd2d1daf2fb#154
disjoint with: structured information
subclass of: http://lodlaundromat.org/.well-known/genid/c8e0b8b6e1bde2aaa1819fd2d1daf2fb#269
disjoint with: http://lodlaundromat.org/.well-known/genid/c8e0b8b6e1bde2aaa1819fd2d1daf2fb#133
disjoint with: notations
subclass of: http://lodlaundromat.org/.well-known/genid/c8e0b8b6e1bde2aaa1819fd2d1daf2fb#4
disjoint with: activities
subclass of: http://lodlaundromat.org/.well-known/genid/c8e0b8b6e1bde2aaa1819fd2d1daf2fb#373
disjoint with: person types
subclass of: http://lodlaundromat.org/.well-known/genid/c8e0b8b6e1bde2aaa1819fd2d1daf2fb#433
subclass of: http://lodlaundromat.org/.well-known/genid/c8e0b8b6e1bde2aaa1819fd2d1daf2fb#86
subclass of: http://lodlaundromat.org/.well-known/genid/c8e0b8b6e1bde2aaa1819fd2d1daf2fb#227
subclass of: http://lodlaundromat.org/.well-known/genid/c8e0b8b6e1bde2aaa1819fd2d1daf2fb#306
disjoint with: drugs
subclass of: http://lodlaundromat.org/.well-known/genid/c8e0b8b6e1bde2aaa1819fd2d1daf2fb#19
disjoint with: time
subclass of: http://lodlaundromat.org/.well-known/genid/c8e0b8b6e1bde2aaa1819fd2d1daf2fb#325
disjoint with: http://lodlaundromat.org/.well-known/genid/c8e0b8b6e1bde2aaa1819fd2d1daf2fb#247
subclass of: http://lodlaundromat.org/.well-known/genid/c8e0b8b6e1bde2aaa1819fd2d1daf2fb#64
disjoint with: prokaryotes
definition: These are various workplaces and areas of human activities, ranging from single person workstations to large aggregations of people (but which are not formal political entities)

relates to finance or economy
property disjoint with: relates to visual information
property disjoint with: relates to extraterrestrial entity
property disjoint with: relates to audio information
property disjoint with: has food drink
type: ObjectProperty
property disjoint with: relates to drug
property disjoint with: has time
property disjoint with: relates to chemistry
property disjoint with: relates to plant
property disjoint with: relates to other organism
property disjoint with: relates to society
sub property of: topObjectProperty
property disjoint with: bottomObjectProperty
property disjoint with: relates to numbers
property disjoint with: relates to disease
property disjoint with: relates to natural phenomenon
property disjoint with: has person type
property disjoint with: relates to animal
domain: Thing
range: finance and economy
definition: This predicate relates an external entity to the SuperType (ST) shown. It indicates there is a relationship to the ST of a verifiable nature, but which is undetermined as to strength or a full rdf:type relationship.

finance and economy
subclass of: http://lodlaundromat.org/.well-known/genid/c8e0b8b6e1bde2aaa1819fd2d1daf2fb#64
disjoint with: numbers
subclass of: http://lodlaundromat.org/.well-known/genid/c8e0b8b6e1bde2aaa1819fd2d1daf2fb#487
disjoint with: Extraterrestrial
disjoint with: person types
subclass of: http://lodlaundromat.org/.well-known/genid/c8e0b8b6e1bde2aaa1819fd2d1daf2fb#529
subclass of: http://lodlaundromat.org/.well-known/genid/c8e0b8b6e1bde2aaa1819fd2d1daf2fb#110
subclass of: http://lodlaundromat.org/.well-known/genid/c8e0b8b6e1bde2aaa1819fd2d1daf2fb#86
disjoint with: http://lodlaundromat.org/.well-known/genid/c8e0b8b6e1bde2aaa1819fd2d1daf2fb#210
disjoint with: Nothing
disjoint with: protists fungus
subclass of: http://lodlaundromat.org/.well-known/genid/c8e0b8b6e1bde2aaa1819fd2d1daf2fb#433
disjoint with: time
disjoint with: food or drink
subclass of: Thing
disjoint with: prokaryotes
subclass of: http://lodlaundromat.org/.well-known/genid/c8e0b8b6e1bde2aaa1819fd2d1daf2fb#373
subclass of: http://lodlaundromat.org/.well-known/genid/c8e0b8b6e1bde2aaa1819fd2d1daf2fb#39
disjoint with: drugs
disjoint with: http://lodlaundromat.org/.well-known/genid/c8e0b8b6e1bde2aaa1819fd2d1daf2fb#1
subclass of: http://lodlaundromat.org/.well-known/genid/c8e0b8b6e1bde2aaa1819fd2d1daf2fb#556
subclass of: http://lodlaundromat.org/.well-known/genid/c8e0b8b6e1bde2aaa1819fd2d1daf2fb#166
subclass of: http://lodlaundromat.org/.well-known/genid/c8e0b8b6e1bde2aaa1819fd2d1daf2fb#396
disjoint with: plants
disjoint with: society
subclass of: SuperType
disjoint with: chemistry
disjoint with: audio information
subclass of: http://lodlaundromat.org/.well-known/genid/c8e0b8b6e1bde2aaa1819fd2d1daf2fb#19
disjoint with: natural phenomena
disjoint with: visual information
subclass of: http://lodlaundromat.org/.well-known/genid/c8e0b8b6e1bde2aaa1819fd2d1daf2fb#325
subclass of: http://lodlaundromat.org/.well-known/genid/c8e0b8b6e1bde2aaa1819fd2d1daf2fb#227
type: Class
subclass of: http://lodlaundromat.org/.well-known/genid/c8e0b8b6e1bde2aaa1819fd2d1daf2fb#460
subclass of: http://lodlaundromat.org/.well-known/genid/c8e0b8b6e1bde2aaa1819fd2d1daf2fb#269
disjoint with: diseases
disjoint with: animals
definition: This SuperType pertains to all things financial and with respect to the economy, including chartable company performance, stock index entities, money, local currencies, taxes, incomes, accounts and accounting, mortgages and property.

has activity
property disjoint with: relates to geopolitical entity
property disjoint with: relates to audio information
property disjoint with: bottomObjectProperty
property disjoint with: relates to plant
property disjoint with: has workplace
property disjoint with: relates to earthscape
property disjoint with: relates to chemistry
property disjoint with: relates to facility
property disjoint with: relates to drug
property disjoint with: relates to numbers
property disjoint with: relates to extraterrestrial entity
sub property of: topObjectProperty
property disjoint with: relates to other organism
property disjoint with: relates to natural substance
type: ObjectProperty
property disjoint with: has organization type
domain: Thing
range: activities
definition: This predicate relates an external entity to the SuperType (ST) shown. It indicates there is a relationship to the ST of a verifiable nature, but which is undetermined as to strength or a full rdf:type relationship

relates to facility
property disjoint with: relates to society
type: ObjectProperty
property disjoint with: relates to animal
property disjoint with: relates to other organism
property disjoint with: has activity
property disjoint with: has person type
property disjoint with: relates to numbers
sub property of: topObjectProperty
property disjoint with: has time
property disjoint with: relates to extraterrestrial entity
property disjoint with: has event
property disjoint with: relates to audio information
property disjoint with: has food drink
property disjoint with: bottomObjectProperty
property disjoint with: relates to chemistry
property disjoint with: relates to disease
property disjoint with: relates to structured information
property disjoint with: has notation
property disjoint with: relates to plant
property disjoint with: relates to drug
domain: Thing
range: facilities
definition: This predicate relates an external entity to the SuperType (ST) shown. It indicates there is a relationship to the ST of a verifiable nature, but which is undetermined as to strength or a full rdf:type relationship.

attributes
disjoint with: Nothing
subclass of: SuperType
subclass of: Thing
type: Class
definition: This general SuperType category is for descriptive attributes of all kinds. Think of the specific attributes in Wikipedia "infoboxes" to understand the purpose and coverage of this SuperType. It includes colors, shapes, sizes, or other descriptive characteristics about an object.

relates to drug
property disjoint with: relates to society
property disjoint with: relates to facility
property disjoint with: relates to numbers
property disjoint with: bottomObjectProperty
property disjoint with: relates to structured information
property disjoint with: has person type
property disjoint with: relates to geopolitical entity
property disjoint with: has notation
property disjoint with: relates to visual information
property disjoint with: relates to earthscape
property disjoint with: relates to animal
property disjoint with: has time
property disjoint with: relates to natural phenomenon
property disjoint with: has workplace
type: ObjectProperty
property disjoint with: has organization type
property disjoint with: has activity
property disjoint with: relates to extraterrestrial entity
property disjoint with: has event
property disjoint with: relates to finance or economy
property disjoint with: relates to disease
sub property of: topObjectProperty
property disjoint with: relates to audio information
domain: Thing
range: drugs
definition: This predicate relates an external entity to the SuperType (ST) shown. It indicates there is a relationship to the ST of a verifiable nature, but which is undetermined as to strength or a full rdf:type relationship.

relates to chemistry
property disjoint with: relates to numbers
property disjoint with: relates to finance or economy
property disjoint with: relates to structured information
property disjoint with: relates to geopolitical entity
property disjoint with: relates to visual information
sub property of: topObjectProperty
property disjoint with: has activity
property disjoint with: has workplace
property disjoint with: has time
property disjoint with: has notation
property disjoint with: relates to plant
property disjoint with: relates to society
property disjoint with: relates to extraterrestrial entity
property disjoint with: has person type
property disjoint with: bottomObjectProperty
property disjoint with: relates to earthscape
type: ObjectProperty
property disjoint with: relates to disease
property disjoint with: relates to facility
property disjoint with: relates to other organism
property disjoint with: has organization type
property disjoint with: relates to audio information
domain: Thing
range: chemistry
definition: This predicate relates an external entity to the SuperType (ST) shown. It indicates there is a relationship to the ST of a verifiable nature, but which is undetermined as to strength or a full rdf:type relationship.

events
subclass of: http://lodlaundromat.org/.well-known/genid/c8e0b8b6e1bde2aaa1819fd2d1daf2fb#325
disjoint with: Nothing
type: Class
disjoint with: numbers
disjoint with: workplaces
subclass of: http://lodlaundromat.org/.well-known/genid/c8e0b8b6e1bde2aaa1819fd2d1daf2fb#110
disjoint with: prokaryotes
subclass of: http://lodlaundromat.org/.well-known/genid/c8e0b8b6e1bde2aaa1819fd2d1daf2fb#247
subclass of: http://lodlaundromat.org/.well-known/genid/c8e0b8b6e1bde2aaa1819fd2d1daf2fb#396
subclass of: Thing
disjoint with: plants
disjoint with: drugs
subclass of: http://lodlaundromat.org/.well-known/genid/c8e0b8b6e1bde2aaa1819fd2d1daf2fb#352
subclass of: http://lodlaundromat.org/.well-known/genid/c8e0b8b6e1bde2aaa1819fd2d1daf2fb#289
disjoint with: http://lodlaundromat.org/.well-known/genid/c8e0b8b6e1bde2aaa1819fd2d1daf2fb#154
disjoint with: geopolitical
disjoint with: earthscape
subclass of: SuperType
subclass of: http://lodlaundromat.org/.well-known/genid/c8e0b8b6e1bde2aaa1819fd2d1daf2fb#574
disjoint with: protists fungus
disjoint with: facilities
subclass of: http://lodlaundromat.org/.well-known/genid/c8e0b8b6e1bde2aaa1819fd2d1daf2fb#460
subclass of: http://lodlaundromat.org/.well-known/genid/c8e0b8b6e1bde2aaa1819fd2d1daf2fb#433
disjoint with: http://lodlaundromat.org/.well-known/genid/c8e0b8b6e1bde2aaa1819fd2d1daf2fb#1
subclass of: http://lodlaundromat.org/.well-known/genid/c8e0b8b6e1bde2aaa1819fd2d1daf2fb#190
disjoint with: natural substance
disjoint with: organizations
subclass of: http://lodlaundromat.org/.well-known/genid/c8e0b8b6e1bde2aaa1819fd2d1daf2fb#133
definition: These are nameable occasions, games, sports events, conferences, natural phenomena, natural disasters, wars, incidents, anniversaries, holidays, or notable moments or periods in time

Extraterrestrial
subclass of: http://lodlaundromat.org/.well-known/genid/c8e0b8b6e1bde2aaa1819fd2d1daf2fb#529
disjoint with: diseases
subclass of: http://lodlaundromat.org/.well-known/genid/c8e0b8b6e1bde2aaa1819fd2d1daf2fb#373
subclass of: SuperType
disjoint with: http://lodlaundromat.org/.well-known/genid/c8e0b8b6e1bde2aaa1819fd2d1daf2fb#1
subclass of: http://lodlaundromat.org/.well-known/genid/c8e0b8b6e1bde2aaa1819fd2d1daf2fb#597
subclass of: http://lodlaundromat.org/.well-known/genid/c8e0b8b6e1bde2aaa1819fd2d1daf2fb#352
subclass of: http://lodlaundromat.org/.well-known/genid/c8e0b8b6e1bde2aaa1819fd2d1daf2fb#4
subclass of: http://lodlaundromat.org/.well-known/genid/c8e0b8b6e1bde2aaa1819fd2d1daf2fb#19
subclass of: http://lodlaundromat.org/.well-known/genid/c8e0b8b6e1bde2aaa1819fd2d1daf2fb#487
subclass of: http://lodlaundromat.org/.well-known/genid/c8e0b8b6e1bde2aaa1819fd2d1daf2fb#190
subclass of: http://lodlaundromat.org/.well-known/genid/c8e0b8b6e1bde2aaa1819fd2d1daf2fb#510
subclass of: http://lodlaundromat.org/.well-known/genid/c8e0b8b6e1bde2aaa1819fd2d1daf2fb#433
subclass of: http://lodlaundromat.org/.well-known/genid/c8e0b8b6e1bde2aaa1819fd2d1daf2fb#64
disjoint with: notations
disjoint with: workplaces
disjoint with: activities
disjoint with: drugs
disjoint with: facilities
subclass of: http://lodlaundromat.org/.well-known/genid/c8e0b8b6e1bde2aaa1819fd2d1daf2fb#460
disjoint with: Nothing
disjoint with: http://lodlaundromat.org/.well-known/genid/c8e0b8b6e1bde2aaa1819fd2d1daf2fb#166
disjoint with: person types
disjoint with: numbers
disjoint with: chemistry
subclass of: http://lodlaundromat.org/.well-known/genid/c8e0b8b6e1bde2aaa1819fd2d1daf2fb#574
subclass of: http://lodlaundromat.org/.well-known/genid/c8e0b8b6e1bde2aaa1819fd2d1daf2fb#306
disjoint with: audio information
disjoint with: products
disjoint with: time
disjoint with: finance and economy
disjoint with: animals
type: Class
disjoint with: geopolitical
subclass of: Thing
subclass of: http://lodlaundromat.org/.well-known/genid/c8e0b8b6e1bde2aaa1819fd2d1daf2fb#86
subclass of: http://lodlaundromat.org/.well-known/genid/c8e0b8b6e1bde2aaa1819fd2d1daf2fb#247
subclass of: http://lodlaundromat.org/.well-known/genid/c8e0b8b6e1bde2aaa1819fd2d1daf2fb#210
disjoint with: prokaryotes
disjoint with: organizations
disjoint with: protists fungus
subclass of: http://lodlaundromat.org/.well-known/genid/c8e0b8b6e1bde2aaa1819fd2d1daf2fb#39
disjoint with: plants
disjoint with: society
subclass of: http://lodlaundromat.org/.well-known/genid/c8e0b8b6e1bde2aaa1819fd2d1daf2fb#227
subclass of: http://lodlaundromat.org/.well-known/genid/c8e0b8b6e1bde2aaa1819fd2d1daf2fb#422
disjoint with: structured information
subclass of: http://lodlaundromat.org/.well-known/genid/c8e0b8b6e1bde2aaa1819fd2d1daf2fb#325
subclass of: http://lodlaundromat.org/.well-known/genid/c8e0b8b6e1bde2aaa1819fd2d1daf2fb#396
disjoint with: food or drink
disjoint with: written information
subclass of: http://lodlaundromat.org/.well-known/genid/c8e0b8b6e1bde2aaa1819fd2d1daf2fb#110
definition: This SuperType includes all natural things not specifically terrestrial, including celestial bodies (planets, asteroids, stars, galaxies, etc., that can be located within a sky map).

has mapping
sub property of: topObjectProperty
property disjoint with: bottomObjectProperty
type: ObjectProperty
domain: Statement
range: Thing
definition: This property is used to reify a umbel:isAbout or a umbel:isRelatedTo property to a mapping percentage value, some quantitative metric value, or a qualitative descriptor characterizing the linkage degree or overlap between the two classes, predicates, individuals or datatypes. This value might be calculated from some external utility.

audio information
disjoint with: earthscape
subclass of: http://lodlaundromat.org/.well-known/genid/c8e0b8b6e1bde2aaa1819fd2d1daf2fb#433
subclass of: http://lodlaundromat.org/.well-known/genid/c8e0b8b6e1bde2aaa1819fd2d1daf2fb#64
subclass of: http://lodlaundromat.org/.well-known/genid/c8e0b8b6e1bde2aaa1819fd2d1daf2fb#86
subclass of: http://lodlaundromat.org/.well-known/genid/c8e0b8b6e1bde2aaa1819fd2d1daf2fb#269
subclass of: SuperType
disjoint with: time
disjoint with: diseases
disjoint with: http://lodlaundromat.org/.well-known/genid/c8e0b8b6e1bde2aaa1819fd2d1daf2fb#556
subclass of: http://lodlaundromat.org/.well-known/genid/c8e0b8b6e1bde2aaa1819fd2d1daf2fb#396
subclass of: http://lodlaundromat.org/.well-known/genid/c8e0b8b6e1bde2aaa1819fd2d1daf2fb#133
disjoint with: Extraterrestrial
disjoint with: animals
disjoint with: http://lodlaundromat.org/.well-known/genid/c8e0b8b6e1bde2aaa1819fd2d1daf2fb#154
disjoint with: food or drink
subclass of: http://lodlaundromat.org/.well-known/genid/c8e0b8b6e1bde2aaa1819fd2d1daf2fb#352
disjoint with: drugs
disjoint with: written information
subclass of: http://lodlaundromat.org/.well-known/genid/c8e0b8b6e1bde2aaa1819fd2d1daf2fb#510
disjoint with: natural substance
disjoint with: chemistry
disjoint with: natural phenomena
disjoint with: organizations
subclass of: http://lodlaundromat.org/.well-known/genid/c8e0b8b6e1bde2aaa1819fd2d1daf2fb#597
subclass of: http://lodlaundromat.org/.well-known/genid/c8e0b8b6e1bde2aaa1819fd2d1daf2fb#487
disjoint with: protists fungus
subclass of: http://lodlaundromat.org/.well-known/genid/c8e0b8b6e1bde2aaa1819fd2d1daf2fb#210
subclass of: http://lodlaundromat.org/.well-known/genid/c8e0b8b6e1bde2aaa1819fd2d1daf2fb#19
disjoint with: prokaryotes
subclass of: http://lodlaundromat.org/.well-known/genid/c8e0b8b6e1bde2aaa1819fd2d1daf2fb#227
disjoint with: http://lodlaundromat.org/.well-known/genid/c8e0b8b6e1bde2aaa1819fd2d1daf2fb#306
disjoint with: workplaces
subclass of: http://lodlaundromat.org/.well-known/genid/c8e0b8b6e1bde2aaa1819fd2d1daf2fb#460
subclass of: http://lodlaundromat.org/.well-known/genid/c8e0b8b6e1bde2aaa1819fd2d1daf2fb#247
disjoint with: society
disjoint with: finance and economy
disjoint with: activities
subclass of: http://lodlaundromat.org/.well-known/genid/c8e0b8b6e1bde2aaa1819fd2d1daf2fb#110
disjoint with: facilities
subclass of: Thing
subclass of: http://lodlaundromat.org/.well-known/genid/c8e0b8b6e1bde2aaa1819fd2d1daf2fb#190
type: Class
subclass of: http://lodlaundromat.org/.well-known/genid/c8e0b8b6e1bde2aaa1819fd2d1daf2fb#325
disjoint with: Nothing
subclass of: http://lodlaundromat.org/.well-known/genid/c8e0b8b6e1bde2aaa1819fd2d1daf2fb#4
disjoint with: geopolitical
disjoint with: structured information
disjoint with: http://lodlaundromat.org/.well-known/genid/c8e0b8b6e1bde2aaa1819fd2d1daf2fb#39
disjoint with: person types
disjoint with: plants
subclass of: http://lodlaundromat.org/.well-known/genid/c8e0b8b6e1bde2aaa1819fd2d1daf2fb#289
disjoint with: http://lodlaundromat.org/.well-known/genid/c8e0b8b6e1bde2aaa1819fd2d1daf2fb#1
subclass of: http://lodlaundromat.org/.well-known/genid/c8e0b8b6e1bde2aaa1819fd2d1daf2fb#574
subclass of: http://lodlaundromat.org/.well-known/genid/c8e0b8b6e1bde2aaa1819fd2d1daf2fb#166
subclass of: http://lodlaundromat.org/.well-known/genid/c8e0b8b6e1bde2aaa1819fd2d1daf2fb#529
subclass of: http://lodlaundromat.org/.well-known/genid/c8e0b8b6e1bde2aaa1819fd2d1daf2fb#373
disjoint with: http://lodlaundromat.org/.well-known/genid/c8e0b8b6e1bde2aaa1819fd2d1daf2fb#422
disjoint with: numbers
definition: This SuperType is for any audio-only human work. Examples include live music performances, record albums, or radion shows or individual radio broadcasts

reference concept
disjoint with: Nothing
subclass of: Concept
subclass of: Thing
type: Class
subclass of: http://lodlaundromat.org/.well-known/genid/c8e0b8b6e1bde2aaa1819fd2d1daf2fb#486
definition: Reference Concepts are a distinct subset of the more broadly understood concept such as used in the SKOS RDFS controlled vocabulary or formal concept analysis or the very general or abstract concepts common to some upper ontologies. Reference Concepts are selected for their use as concrete, subject-related or commonly used notions for describing tangible ideas and referents in human experience and language. Reference Concepts are classes, the members of which are nameable instances or named entities, which by definition are held as distinct from these concepts. The UMBEL ontology is a coherently organized structure (or reference "backbone") of these Reference Concepts.

relates to visual information
property disjoint with: relates to finance or economy
property disjoint with: relates to society
type: ObjectProperty
property disjoint with: relates to disease
property disjoint with: relates to drug
property disjoint with: has workplace
property disjoint with: relates to animal
sub property of: topObjectProperty
property disjoint with: relates to other organism
property disjoint with: has time
property disjoint with: has person type
property disjoint with: relates to plant
property disjoint with: relates to numbers
property disjoint with: relates to earthscape
property disjoint with: has organization type
property disjoint with: relates to geopolitical entity
property disjoint with: relates to chemistry
property disjoint with: relates to natural substance
property disjoint with: has food drink
property disjoint with: bottomObjectProperty
domain: Thing
range: visual information
definition: This predicate relates an external entity to the SuperType (ST) shown. It indicates there is a relationship to the ST of a verifiable nature, but which is undetermined as to strength or a full rdf:type relationship.

topics categories
disjoint with: Nothing
subclass of: SuperType
subclass of: Thing
type: Class
definition: This largely subject-oriented SuperType is a means for using controlled vocabularies and classification schemes for characterizing what content "is about". The key constituents of this category are Types, Classifications, Concepts, CCC, and controlled vocabularies

Manual - Similar Sense
type: qualifier
type: Thing
type: NamedIndividual
definition: The two mapped concepts share much overlap, but are not the exact same sense, such as an action as related to the thing it acts upo.

natural phenomena
disjoint with: http://lodlaundromat.org/.well-known/genid/c8e0b8b6e1bde2aaa1819fd2d1daf2fb#269
disjoint with: numbers
subclass of: http://lodlaundromat.org/.well-known/genid/c8e0b8b6e1bde2aaa1819fd2d1daf2fb#325
disjoint with: products
disjoint with: workplaces
disjoint with: person types
type: Class
subclass of: Thing
subclass of: http://lodlaundromat.org/.well-known/genid/c8e0b8b6e1bde2aaa1819fd2d1daf2fb#352
subclass of: http://lodlaundromat.org/.well-known/genid/c8e0b8b6e1bde2aaa1819fd2d1daf2fb#133
subclass of: http://lodlaundromat.org/.well-known/genid/c8e0b8b6e1bde2aaa1819fd2d1daf2fb#529
subclass of: http://lodlaundromat.org/.well-known/genid/c8e0b8b6e1bde2aaa1819fd2d1daf2fb#460
disjoint with: finance and economy
subclass of: http://lodlaundromat.org/.well-known/genid/c8e0b8b6e1bde2aaa1819fd2d1daf2fb#210
subclass of: http://lodlaundromat.org/.well-known/genid/c8e0b8b6e1bde2aaa1819fd2d1daf2fb#247
disjoint with: diseases
subclass of: http://lodlaundromat.org/.well-known/genid/c8e0b8b6e1bde2aaa1819fd2d1daf2fb#574
subclass of: http://lodlaundromat.org/.well-known/genid/c8e0b8b6e1bde2aaa1819fd2d1daf2fb#227
disjoint with: society
disjoint with: written information
disjoint with: time
disjoint with: organizations
disjoint with: plants
subclass of: http://lodlaundromat.org/.well-known/genid/c8e0b8b6e1bde2aaa1819fd2d1daf2fb#86
subclass of: http://lodlaundromat.org/.well-known/genid/c8e0b8b6e1bde2aaa1819fd2d1daf2fb#396
subclass of: http://lodlaundromat.org/.well-known/genid/c8e0b8b6e1bde2aaa1819fd2d1daf2fb#110
subclass of: http://lodlaundromat.org/.well-known/genid/c8e0b8b6e1bde2aaa1819fd2d1daf2fb#597
subclass of: http://lodlaundromat.org/.well-known/genid/c8e0b8b6e1bde2aaa1819fd2d1daf2fb#433
disjoint with: http://lodlaundromat.org/.well-known/genid/c8e0b8b6e1bde2aaa1819fd2d1daf2fb#1
subclass of: http://lodlaundromat.org/.well-known/genid/c8e0b8b6e1bde2aaa1819fd2d1daf2fb#487
subclass of: http://lodlaundromat.org/.well-known/genid/c8e0b8b6e1bde2aaa1819fd2d1daf2fb#306
disjoint with: earthscape
disjoint with: animals
subclass of: http://lodlaundromat.org/.well-known/genid/c8e0b8b6e1bde2aaa1819fd2d1daf2fb#373
disjoint with: food or drink
subclass of: http://lodlaundromat.org/.well-known/genid/c8e0b8b6e1bde2aaa1819fd2d1daf2fb#19
disjoint with: audio information
disjoint with: Nothing
disjoint with: notations
disjoint with: protists fungus
subclass of: http://lodlaundromat.org/.well-known/genid/c8e0b8b6e1bde2aaa1819fd2d1daf2fb#39
disjoint with: prokaryotes
subclass of: SuperType
subclass of: http://lodlaundromat.org/.well-known/genid/c8e0b8b6e1bde2aaa1819fd2d1daf2fb#422
disjoint with: geopolitical
disjoint with: drugs
definition: This SuperType includes natural phenomena and natural processes such as weather, weathering, erosion, fires, lightning, earthquakes, tectonics, etc. Clouds and weather processes are specifically included. Also includes climate cycles, general natural events (such as hurricanes) that are not specifically named, and biochemical processes and pathways.

has food drink
property disjoint with: relates to audio information
property disjoint with: relates to society
property disjoint with: has organization type
property disjoint with: relates to disease
property disjoint with: relates to earthscape
property disjoint with: relates to geopolitical entity
property disjoint with: has time
property disjoint with: relates to numbers
property disjoint with: bottomObjectProperty
property disjoint with: has workplace
property disjoint with: relates to finance or economy
sub property of: topObjectProperty
property disjoint with: relates to facility
property disjoint with: has notation
type: ObjectProperty
property disjoint with: relates to extraterrestrial entity
property disjoint with: has person type
property disjoint with: relates to visual information
property disjoint with: relates to natural phenomenon
property disjoint with: relates to structured information
domain: Thing
range: food or drink
definition: This predicate relates an external entity to the SuperType (ST) shown. It indicates there is a relationship to the ST of a verifiable nature, but which is undetermined as to strength or a full rdf:type relationship

relates to numbers
property disjoint with: relates to chemistry
property disjoint with: has product type
sub property of: topObjectProperty
property disjoint with: has organization type
property disjoint with: relates to animal
property disjoint with: has workplace
property disjoint with: relates to natural substance
property disjoint with: has food drink
property disjoint with: relates to drug
property disjoint with: relates to society
property disjoint with: relates to earthscape
property disjoint with: relates to other organism
property disjoint with: relates to finance or economy
property disjoint with: bottomObjectProperty
property disjoint with: relates to natural phenomenon
property disjoint with: has time
type: ObjectProperty
property disjoint with: has event
property disjoint with: has activity
property disjoint with: relates to extraterrestrial entity
property disjoint with: relates to audio information
property disjoint with: relates to visual information
property disjoint with: relates to disease
property disjoint with: relates to facility
property disjoint with: relates to geopolitical entity
property disjoint with: has person type
property disjoint with: relates to plant
domain: Thing
range: numbers
definition: This predicate relates an external entity to the SuperType (ST) shown. It indicates there is a relationship to the ST of a verifiable nature, but which is undetermined as to strength or a full rdf:type relationship.

Manual - Nearly Equivalent
type: qualifier
type: Thing
type: NamedIndividual
definition: The two mapped concepts are deemed to be nearly an equivalentClass or sameAs relationship, but not 100% so.

Heuristic - ListOf Basis
type: qualifier
type: Thing
type: NamedIndividual
definition: Type assignment based on Wikipedia ListOf category.

plants
subclass of: http://lodlaundromat.org/.well-known/genid/c8e0b8b6e1bde2aaa1819fd2d1daf2fb#597
disjoint with: http://lodlaundromat.org/.well-known/genid/c8e0b8b6e1bde2aaa1819fd2d1daf2fb#1
disjoint with: earthscape
subclass of: http://lodlaundromat.org/.well-known/genid/c8e0b8b6e1bde2aaa1819fd2d1daf2fb#64
subclass of: http://lodlaundromat.org/.well-known/genid/c8e0b8b6e1bde2aaa1819fd2d1daf2fb#4
disjoint with: society
disjoint with: visual information
disjoint with: workplaces
subclass of: http://lodlaundromat.org/.well-known/genid/c8e0b8b6e1bde2aaa1819fd2d1daf2fb#460
disjoint with: protists fungus
disjoint with: written information
subclass of: http://lodlaundromat.org/.well-known/genid/c8e0b8b6e1bde2aaa1819fd2d1daf2fb#373
disjoint with: facilities
disjoint with: Nothing
subclass of: SuperType
subclass of: http://lodlaundromat.org/.well-known/genid/c8e0b8b6e1bde2aaa1819fd2d1daf2fb#574
disjoint with: organizations
subclass of: http://lodlaundromat.org/.well-known/genid/c8e0b8b6e1bde2aaa1819fd2d1daf2fb#166
disjoint with: structured information
disjoint with: person types
disjoint with: activities
disjoint with: http://lodlaundromat.org/.well-known/genid/c8e0b8b6e1bde2aaa1819fd2d1daf2fb#396
subclass of: http://lodlaundromat.org/.well-known/genid/c8e0b8b6e1bde2aaa1819fd2d1daf2fb#210
disjoint with: animals
subclass of: http://lodlaundromat.org/.well-known/genid/c8e0b8b6e1bde2aaa1819fd2d1daf2fb#325
disjoint with: prokaryotes
subclass of: http://lodlaundromat.org/.well-known/genid/c8e0b8b6e1bde2aaa1819fd2d1daf2fb#247
subclass of: http://lodlaundromat.org/.well-known/genid/c8e0b8b6e1bde2aaa1819fd2d1daf2fb#133
subclass of: http://lodlaundromat.org/.well-known/genid/c8e0b8b6e1bde2aaa1819fd2d1daf2fb#556
subclass of: Thing
subclass of: http://lodlaundromat.org/.well-known/genid/c8e0b8b6e1bde2aaa1819fd2d1daf2fb#39
subclass of: http://lodlaundromat.org/.well-known/genid/c8e0b8b6e1bde2aaa1819fd2d1daf2fb#529
subclass of: http://lodlaundromat.org/.well-known/genid/c8e0b8b6e1bde2aaa1819fd2d1daf2fb#510
subclass of: http://lodlaundromat.org/.well-known/genid/c8e0b8b6e1bde2aaa1819fd2d1daf2fb#190
subclass of: http://lodlaundromat.org/.well-known/genid/c8e0b8b6e1bde2aaa1819fd2d1daf2fb#433
subclass of: http://lodlaundromat.org/.well-known/genid/c8e0b8b6e1bde2aaa1819fd2d1daf2fb#306
subclass of: http://lodlaundromat.org/.well-known/genid/c8e0b8b6e1bde2aaa1819fd2d1daf2fb#19
disjoint with: http://lodlaundromat.org/.well-known/genid/c8e0b8b6e1bde2aaa1819fd2d1daf2fb#422
disjoint with: events
disjoint with: natural substance
disjoint with: time
disjoint with: audio information
disjoint with: http://lodlaundromat.org/.well-known/genid/c8e0b8b6e1bde2aaa1819fd2d1daf2fb#227
type: Class
disjoint with: geopolitical
disjoint with: chemistry
disjoint with: finance and economy
disjoint with: Extraterrestrial
disjoint with: numbers
disjoint with: diseases
subclass of: http://lodlaundromat.org/.well-known/genid/c8e0b8b6e1bde2aaa1819fd2d1daf2fb#352
subclass of: http://lodlaundromat.org/.well-known/genid/c8e0b8b6e1bde2aaa1819fd2d1daf2fb#154
disjoint with: http://lodlaundromat.org/.well-known/genid/c8e0b8b6e1bde2aaa1819fd2d1daf2fb#110
subclass of: http://lodlaundromat.org/.well-known/genid/c8e0b8b6e1bde2aaa1819fd2d1daf2fb#269
disjoint with: natural phenomena
subclass of: http://lodlaundromat.org/.well-known/genid/c8e0b8b6e1bde2aaa1819fd2d1daf2fb#86
subclass of: http://lodlaundromat.org/.well-known/genid/c8e0b8b6e1bde2aaa1819fd2d1daf2fb#487
subclass of: http://lodlaundromat.org/.well-known/genid/c8e0b8b6e1bde2aaa1819fd2d1daf2fb#289
disjoint with: notations
definition: This SuperType includes all plant types and flora, including flowering plants, algae, non-flowering plants, gymnosperms, cycads, and plant parts and body types. Note that all Plant Parts are also included.

has product type
property disjoint with: bottomObjectProperty
property disjoint with: relates to extraterrestrial entity
property disjoint with: relates to natural phenomenon
property disjoint with: relates to numbers
property disjoint with: relates to disease
property disjoint with: has time
property disjoint with: relates to society
sub property of: topObjectProperty
property disjoint with: relates to other organism
property disjoint with: has person type
property disjoint with: has organization type
type: ObjectProperty
domain: Thing
range: products
definition: This predicate relates an external entity to the SuperType (ST) shown. It indicates there is a relationship to the ST of a verifiable nature, but which is undetermined as to strength or a full rdf:type relationship

drugs
disjoint with: written information
subclass of: http://lodlaundromat.org/.well-known/genid/c8e0b8b6e1bde2aaa1819fd2d1daf2fb#556
disjoint with: workplaces
disjoint with: organizations
disjoint with: animals
subclass of: http://lodlaundromat.org/.well-known/genid/c8e0b8b6e1bde2aaa1819fd2d1daf2fb#306
subclass of: http://lodlaundromat.org/.well-known/genid/c8e0b8b6e1bde2aaa1819fd2d1daf2fb#154
subclass of: http://lodlaundromat.org/.well-known/genid/c8e0b8b6e1bde2aaa1819fd2d1daf2fb#433
disjoint with: activities
disjoint with: person types
subclass of: http://lodlaundromat.org/.well-known/genid/c8e0b8b6e1bde2aaa1819fd2d1daf2fb#247
subclass of: http://lodlaundromat.org/.well-known/genid/c8e0b8b6e1bde2aaa1819fd2d1daf2fb#19
subclass of: http://lodlaundromat.org/.well-known/genid/c8e0b8b6e1bde2aaa1819fd2d1daf2fb#166
disjoint with: events
disjoint with: structured information
subclass of: http://lodlaundromat.org/.well-known/genid/c8e0b8b6e1bde2aaa1819fd2d1daf2fb#487
subclass of: http://lodlaundromat.org/.well-known/genid/c8e0b8b6e1bde2aaa1819fd2d1daf2fb#133
subclass of: SuperType
subclass of: http://lodlaundromat.org/.well-known/genid/c8e0b8b6e1bde2aaa1819fd2d1daf2fb#597
subclass of: Thing
disjoint with: http://lodlaundromat.org/.well-known/genid/c8e0b8b6e1bde2aaa1819fd2d1daf2fb#227
disjoint with: http://lodlaundromat.org/.well-known/genid/c8e0b8b6e1bde2aaa1819fd2d1daf2fb#110
disjoint with: facilities
disjoint with: prokaryotes
type: Class
subclass of: http://lodlaundromat.org/.well-known/genid/c8e0b8b6e1bde2aaa1819fd2d1daf2fb#510
subclass of: http://lodlaundromat.org/.well-known/genid/c8e0b8b6e1bde2aaa1819fd2d1daf2fb#574
subclass of: http://lodlaundromat.org/.well-known/genid/c8e0b8b6e1bde2aaa1819fd2d1daf2fb#269
disjoint with: Extraterrestrial
disjoint with: finance and economy
disjoint with: society
disjoint with: time
subclass of: http://lodlaundromat.org/.well-known/genid/c8e0b8b6e1bde2aaa1819fd2d1daf2fb#86
disjoint with: numbers
disjoint with: diseases
subclass of: http://lodlaundromat.org/.well-known/genid/c8e0b8b6e1bde2aaa1819fd2d1daf2fb#325
subclass of: http://lodlaundromat.org/.well-known/genid/c8e0b8b6e1bde2aaa1819fd2d1daf2fb#190
subclass of: http://lodlaundromat.org/.well-known/genid/c8e0b8b6e1bde2aaa1819fd2d1daf2fb#210
disjoint with: natural phenomena
subclass of: http://lodlaundromat.org/.well-known/genid/c8e0b8b6e1bde2aaa1819fd2d1daf2fb#352
disjoint with: audio information
subclass of: http://lodlaundromat.org/.well-known/genid/c8e0b8b6e1bde2aaa1819fd2d1daf2fb#373
disjoint with: notations
disjoint with: visual information
subclass of: http://lodlaundromat.org/.well-known/genid/c8e0b8b6e1bde2aaa1819fd2d1daf2fb#39
subclass of: http://lodlaundromat.org/.well-known/genid/c8e0b8b6e1bde2aaa1819fd2d1daf2fb#4
disjoint with: earthscape
subclass of: http://lodlaundromat.org/.well-known/genid/c8e0b8b6e1bde2aaa1819fd2d1daf2fb#529
disjoint with: Nothing
disjoint with: geopolitical
definition: This SuperType is an drug, medication or addictive substance

correspondsTo
sub property of: topObjectProperty
property disjoint with: bottomObjectProperty
type: SymmetricProperty
type: TransitiveProperty
type: ObjectProperty
comment: The property umbel:correspondsTo is used to assert a close correspondence between an external class, named entity, individual or instance with a Reference Concept class. umbel:correspondsTo relates the external class, named entity, individual or instance to the class through the basis of both its subject matter and intended scope. This predicate should be used where the correspondence between the two entities is felt to be nearly equivalent to a sameAs assertion, and is reflexive, but without the full entailments of intensional class memberships. In these cases, both entities are understood to have the same type and intended scope, but without asserting a full class-level or sameAs individual relationship. This predicate is designed for the circumstance of aligning two different ontologies or knowledge bases based on node-level correspondences, but without entailing the actual ontological relationships and structure of the object source. For example, the umbel:correspondsTo predicate is used to assert close correspondence between UMBEL Reference Concepts and Wikipedia categories or pages, yet without entailing the actual Wikipedia category structure. This property asserts a different and stronger relationship than umbel:isAbout. One practical use is to guide specific instance member determinations when, say, the native structure of the external ontology or knowledge base is to be analyzed and replaced with an UMBEL-based structure. This property is therefore used to create a nearly equivalent assertion (however, with the degree of that equivalence being unknown or unknowable) between an external instance or class and a Reference Concept class
domain: Thing
range: reference concept

External - DBOntology Mapping
type: qualifier
type: Thing
type: NamedIndividual
definition: Mapping based on existing DBOntology assertion.

Automatic - Not Specified
type: qualifier
type: Thing
type: NamedIndividual
preferred label: Mapping based on automatic scoring of concepts using a script or technique not otherwise specified.

visual information
disjoint with: organizations
disjoint with: geopolitical
subclass of: http://lodlaundromat.org/.well-known/genid/c8e0b8b6e1bde2aaa1819fd2d1daf2fb#352
subclass of: http://lodlaundromat.org/.well-known/genid/c8e0b8b6e1bde2aaa1819fd2d1daf2fb#433
disjoint with: protists fungus
disjoint with: numbers
disjoint with: food or drink
subclass of: http://lodlaundromat.org/.well-known/genid/c8e0b8b6e1bde2aaa1819fd2d1daf2fb#460
disjoint with: workplaces
subclass of: http://lodlaundromat.org/.well-known/genid/c8e0b8b6e1bde2aaa1819fd2d1daf2fb#86
subclass of: http://lodlaundromat.org/.well-known/genid/c8e0b8b6e1bde2aaa1819fd2d1daf2fb#574
disjoint with: chemistry
subclass of: http://lodlaundromat.org/.well-known/genid/c8e0b8b6e1bde2aaa1819fd2d1daf2fb#529
subclass of: http://lodlaundromat.org/.well-known/genid/c8e0b8b6e1bde2aaa1819fd2d1daf2fb#133
subclass of: http://lodlaundromat.org/.well-known/genid/c8e0b8b6e1bde2aaa1819fd2d1daf2fb#396
subclass of: http://lodlaundromat.org/.well-known/genid/c8e0b8b6e1bde2aaa1819fd2d1daf2fb#210
type: Class
disjoint with: Nothing
subclass of: http://lodlaundromat.org/.well-known/genid/c8e0b8b6e1bde2aaa1819fd2d1daf2fb#487
subclass of: http://lodlaundromat.org/.well-known/genid/c8e0b8b6e1bde2aaa1819fd2d1daf2fb#289
disjoint with: drugs
disjoint with: http://lodlaundromat.org/.well-known/genid/c8e0b8b6e1bde2aaa1819fd2d1daf2fb#556
subclass of: http://lodlaundromat.org/.well-known/genid/c8e0b8b6e1bde2aaa1819fd2d1daf2fb#373
subclass of: http://lodlaundromat.org/.well-known/genid/c8e0b8b6e1bde2aaa1819fd2d1daf2fb#64
subclass of: http://lodlaundromat.org/.well-known/genid/c8e0b8b6e1bde2aaa1819fd2d1daf2fb#247
subclass of: http://lodlaundromat.org/.well-known/genid/c8e0b8b6e1bde2aaa1819fd2d1daf2fb#325
subclass of: http://lodlaundromat.org/.well-known/genid/c8e0b8b6e1bde2aaa1819fd2d1daf2fb#227
disjoint with: plants
disjoint with: http://lodlaundromat.org/.well-known/genid/c8e0b8b6e1bde2aaa1819fd2d1daf2fb#1
subclass of: http://lodlaundromat.org/.well-known/genid/c8e0b8b6e1bde2aaa1819fd2d1daf2fb#19
disjoint with: prokaryotes
disjoint with: society
subclass of: SuperType
disjoint with: natural substance
disjoint with: diseases
subclass of: http://lodlaundromat.org/.well-known/genid/c8e0b8b6e1bde2aaa1819fd2d1daf2fb#110
disjoint with: animals
disjoint with: finance and economy
subclass of: Thing
disjoint with: time
disjoint with: person types
disjoint with: earthscape
definition: any still image or picture or streaming video human work, with or without audio. Examples include graphics, pictures, movies, TV shows, individual shows from a TV show, etc.

has topic
sub property of: topObjectProperty
property disjoint with: bottomObjectProperty
type: ObjectProperty
domain: Thing
range: topics categories
definition: This predicate relates an external entity to the SuperType (ST) shown. It indicates there is a relationship to the ST of a verifiable nature, but which is undetermined as to strength or a full rdf:type relationship

relates to structured information
property disjoint with: has workplace
property disjoint with: has food drink
property disjoint with: relates to extraterrestrial entity
property disjoint with: relates to disease
property disjoint with: relates to facility
type: ObjectProperty
property disjoint with: relates to other organism
property disjoint with: relates to earthscape
property disjoint with: relates to animal
property disjoint with: relates to geopolitical entity
property disjoint with: relates to chemistry
property disjoint with: relates to society
property disjoint with: relates to plant
sub property of: topObjectProperty
property disjoint with: has person type
property disjoint with: relates to audio information
property disjoint with: has organization type
property disjoint with: bottomObjectProperty
property disjoint with: relates to drug
property disjoint with: has time
domain: Thing
range: structured information
definition: This predicate relates an external entity to the SuperType (ST) shown. It indicates there is a relationship to the ST of a verifiable nature, but which is undetermined as to strength or a full rdf:type relationship.

structured information
subclass of: http://lodlaundromat.org/.well-known/genid/c8e0b8b6e1bde2aaa1819fd2d1daf2fb#529
subclass of: http://lodlaundromat.org/.well-known/genid/c8e0b8b6e1bde2aaa1819fd2d1daf2fb#39
disjoint with: diseases
subclass of: http://lodlaundromat.org/.well-known/genid/c8e0b8b6e1bde2aaa1819fd2d1daf2fb#86
disjoint with: earthscape
subclass of: http://lodlaundromat.org/.well-known/genid/c8e0b8b6e1bde2aaa1819fd2d1daf2fb#433
subclass of: Thing
subclass of: http://lodlaundromat.org/.well-known/genid/c8e0b8b6e1bde2aaa1819fd2d1daf2fb#460
subclass of: http://lodlaundromat.org/.well-known/genid/c8e0b8b6e1bde2aaa1819fd2d1daf2fb#574
disjoint with: facilities
subclass of: http://lodlaundromat.org/.well-known/genid/c8e0b8b6e1bde2aaa1819fd2d1daf2fb#227
disjoint with: workplaces
subclass of: http://lodlaundromat.org/.well-known/genid/c8e0b8b6e1bde2aaa1819fd2d1daf2fb#133
disjoint with: drugs
subclass of: http://lodlaundromat.org/.well-known/genid/c8e0b8b6e1bde2aaa1819fd2d1daf2fb#247
subclass of: http://lodlaundromat.org/.well-known/genid/c8e0b8b6e1bde2aaa1819fd2d1daf2fb#396
disjoint with: person types
disjoint with: Extraterrestrial
disjoint with: audio information
disjoint with: http://lodlaundromat.org/.well-known/genid/c8e0b8b6e1bde2aaa1819fd2d1daf2fb#510
subclass of: http://lodlaundromat.org/.well-known/genid/c8e0b8b6e1bde2aaa1819fd2d1daf2fb#373
disjoint with: http://lodlaundromat.org/.well-known/genid/c8e0b8b6e1bde2aaa1819fd2d1daf2fb#1
disjoint with: organizations
type: Class
disjoint with: time
disjoint with: animals
subclass of: http://lodlaundromat.org/.well-known/genid/c8e0b8b6e1bde2aaa1819fd2d1daf2fb#352
disjoint with: society
subclass of: http://lodlaundromat.org/.well-known/genid/c8e0b8b6e1bde2aaa1819fd2d1daf2fb#19
disjoint with: protists fungus
disjoint with: prokaryotes
subclass of: http://lodlaundromat.org/.well-known/genid/c8e0b8b6e1bde2aaa1819fd2d1daf2fb#487
disjoint with: food or drink
disjoint with: Nothing
subclass of: http://lodlaundromat.org/.well-known/genid/c8e0b8b6e1bde2aaa1819fd2d1daf2fb#110
subclass of: http://lodlaundromat.org/.well-known/genid/c8e0b8b6e1bde2aaa1819fd2d1daf2fb#64
subclass of: SuperType
subclass of: http://lodlaundromat.org/.well-known/genid/c8e0b8b6e1bde2aaa1819fd2d1daf2fb#166
disjoint with: plants
disjoint with: chemistry
disjoint with: geopolitical
subclass of: http://lodlaundromat.org/.well-known/genid/c8e0b8b6e1bde2aaa1819fd2d1daf2fb#190
definition: This information SuperType is for all kinds of structured information and datasets, including compute programs, databases, files, Web pages and structured data that can be presented in tabular form

market industries
disjoint with: Nothing
subclass of: SuperType
subclass of: Thing
type: Class
definition: This SuperType is a specialized classificatory system for markets and industries. It could be combined with the SuperType above, but is kept separate in order to provide a separate, economy-oriented system.

super property of
sub property of: topObjectProperty
property disjoint with: bottomObjectProperty
type: ObjectProperty
type: AnnotationProperty
domain: Property
range: Property
definition: Specifies that a property is a super property of another property. This is the inverse of rdfs:subPropertyOf

activities
disjoint with: facilities
subclass of: http://lodlaundromat.org/.well-known/genid/c8e0b8b6e1bde2aaa1819fd2d1daf2fb#460
subclass of: http://lodlaundromat.org/.well-known/genid/c8e0b8b6e1bde2aaa1819fd2d1daf2fb#247
subclass of: http://lodlaundromat.org/.well-known/genid/c8e0b8b6e1bde2aaa1819fd2d1daf2fb#166
disjoint with: prokaryotes
disjoint with: numbers
disjoint with: plants
subclass of: http://lodlaundromat.org/.well-known/genid/c8e0b8b6e1bde2aaa1819fd2d1daf2fb#64
subclass of: http://lodlaundromat.org/.well-known/genid/c8e0b8b6e1bde2aaa1819fd2d1daf2fb#289
disjoint with: audio information
disjoint with: drugs
disjoint with: http://lodlaundromat.org/.well-known/genid/c8e0b8b6e1bde2aaa1819fd2d1daf2fb#154
disjoint with: http://lodlaundromat.org/.well-known/genid/c8e0b8b6e1bde2aaa1819fd2d1daf2fb#4
subclass of: http://lodlaundromat.org/.well-known/genid/c8e0b8b6e1bde2aaa1819fd2d1daf2fb#325
subclass of: http://lodlaundromat.org/.well-known/genid/c8e0b8b6e1bde2aaa1819fd2d1daf2fb#39
disjoint with: geopolitical
disjoint with: chemistry
disjoint with: workplaces
subclass of: http://lodlaundromat.org/.well-known/genid/c8e0b8b6e1bde2aaa1819fd2d1daf2fb#352
disjoint with: Extraterrestrial
subclass of: http://lodlaundromat.org/.well-known/genid/c8e0b8b6e1bde2aaa1819fd2d1daf2fb#433
subclass of: http://lodlaundromat.org/.well-known/genid/c8e0b8b6e1bde2aaa1819fd2d1daf2fb#396
disjoint with: earthscape
subclass of: http://lodlaundromat.org/.well-known/genid/c8e0b8b6e1bde2aaa1819fd2d1daf2fb#133
subclass of: Thing
disjoint with: organizations
subclass of: http://lodlaundromat.org/.well-known/genid/c8e0b8b6e1bde2aaa1819fd2d1daf2fb#110
subclass of: SuperType
disjoint with: protists fungus
subclass of: http://lodlaundromat.org/.well-known/genid/c8e0b8b6e1bde2aaa1819fd2d1daf2fb#190
subclass of: http://lodlaundromat.org/.well-known/genid/c8e0b8b6e1bde2aaa1819fd2d1daf2fb#574
disjoint with: Nothing
disjoint with: natural substance
disjoint with: http://lodlaundromat.org/.well-known/genid/c8e0b8b6e1bde2aaa1819fd2d1daf2fb#1
type: Class
definition: These are ongoing activities that result (mostly) from human effort, often conducted by organizations to assist other organizations or individuals (in which case they are known as services, such as medicine, law, printing, consulting or teaching) or individual or group efforts for leisure, fun, sports, games or personal interests (activities)

is about
sub property of: topObjectProperty
property disjoint with: bottomObjectProperty
inverse of: links entity
type: ObjectProperty
domain: Thing
range: reference concept
definition: The property umbel:isAbout is used to assert the relation between a named entity (individual) and a Reference Concept class. umbel:isAbout relates the named entity (individual) to the class through the basis of its subject matter. The relation acknowledges that the scope of the class can not be determined solely by the aggregation or extent of its associated individual entity members, and that the nature of the Reference Concept class may not alone bound or define the individual entity. This property is therefore used to create a topical assertion between an individual and a Reference Concept.

chemistry
disjoint with: written information
disjoint with: organizations
disjoint with: protists fungus
subclass of: http://lodlaundromat.org/.well-known/genid/c8e0b8b6e1bde2aaa1819fd2d1daf2fb#574
disjoint with: activities
disjoint with: person types
subclass of: http://lodlaundromat.org/.well-known/genid/c8e0b8b6e1bde2aaa1819fd2d1daf2fb#39
subclass of: http://lodlaundromat.org/.well-known/genid/c8e0b8b6e1bde2aaa1819fd2d1daf2fb#373
subclass of: http://lodlaundromat.org/.well-known/genid/c8e0b8b6e1bde2aaa1819fd2d1daf2fb#325
disjoint with: workplaces
disjoint with: Nothing
disjoint with: finance and economy
subclass of: Thing
disjoint with: visual information
subclass of: http://lodlaundromat.org/.well-known/genid/c8e0b8b6e1bde2aaa1819fd2d1daf2fb#133
disjoint with: diseases
subclass of: http://lodlaundromat.org/.well-known/genid/c8e0b8b6e1bde2aaa1819fd2d1daf2fb#396
subclass of: http://lodlaundromat.org/.well-known/genid/c8e0b8b6e1bde2aaa1819fd2d1daf2fb#4
disjoint with: plants
subclass of: http://lodlaundromat.org/.well-known/genid/c8e0b8b6e1bde2aaa1819fd2d1daf2fb#529
subclass of: http://lodlaundromat.org/.well-known/genid/c8e0b8b6e1bde2aaa1819fd2d1daf2fb#433
subclass of: http://lodlaundromat.org/.well-known/genid/c8e0b8b6e1bde2aaa1819fd2d1daf2fb#352
disjoint with: earthscape
subclass of: http://lodlaundromat.org/.well-known/genid/c8e0b8b6e1bde2aaa1819fd2d1daf2fb#210
disjoint with: Extraterrestrial
subclass of: http://lodlaundromat.org/.well-known/genid/c8e0b8b6e1bde2aaa1819fd2d1daf2fb#247
disjoint with: audio information
subclass of: http://lodlaundromat.org/.well-known/genid/c8e0b8b6e1bde2aaa1819fd2d1daf2fb#510
disjoint with: prokaryotes
subclass of: SuperType
subclass of: http://lodlaundromat.org/.well-known/genid/c8e0b8b6e1bde2aaa1819fd2d1daf2fb#487
subclass of: http://lodlaundromat.org/.well-known/genid/c8e0b8b6e1bde2aaa1819fd2d1daf2fb#597
disjoint with: time
disjoint with: society
disjoint with: numbers
disjoint with: facilities
subclass of: http://lodlaundromat.org/.well-known/genid/c8e0b8b6e1bde2aaa1819fd2d1daf2fb#460
disjoint with: geopolitical
disjoint with: http://lodlaundromat.org/.well-known/genid/c8e0b8b6e1bde2aaa1819fd2d1daf2fb#1
disjoint with: notations
type: Class
subclass of: http://lodlaundromat.org/.well-known/genid/c8e0b8b6e1bde2aaa1819fd2d1daf2fb#166
subclass of: http://lodlaundromat.org/.well-known/genid/c8e0b8b6e1bde2aaa1819fd2d1daf2fb#190
disjoint with: structured information
subclass of: http://lodlaundromat.org/.well-known/genid/c8e0b8b6e1bde2aaa1819fd2d1daf2fb#86
disjoint with: http://lodlaundromat.org/.well-known/genid/c8e0b8b6e1bde2aaa1819fd2d1daf2fb#64
definition: This SuperType is a residual category (n.o.c., not otherwise categorized) for chemical bonds, chemical composition groupings, and the like. It is formed by what is not a natural substance or living thing (organic) substance.

has person type
property disjoint with: has product type
property disjoint with: relates to geopolitical entity
property disjoint with: relates to numbers
property disjoint with: relates to finance or economy
property disjoint with: relates to structured information
property disjoint with: relates to natural phenomenon
property disjoint with: has food drink
property disjoint with: relates to earthscape
property disjoint with: relates to extraterrestrial entity
property disjoint with: relates to drug
property disjoint with: relates to facility
property disjoint with: has workplace
property disjoint with: relates to chemistry
type: ObjectProperty
sub property of: topObjectProperty
property disjoint with: has notation
property disjoint with: relates to other organism
property disjoint with: relates to audio information
property disjoint with: has time
property disjoint with: relates to natural substance
property disjoint with: bottomObjectProperty
property disjoint with: relates to plant
property disjoint with: relates to visual information
domain: Thing
range: person types
definition: This predicate relates an external entity to the SuperType (ST) shown. It indicates there is a relationship to the ST of a verifiable nature, but which is undetermined as to strength or a full rdf:type relationship

relates to extraterrestrial entity
property disjoint with: relates to numbers
property disjoint with: has notation
property disjoint with: relates to facility
property disjoint with: relates to audio information
property disjoint with: has food drink
property disjoint with: relates to chemistry
sub property of: topObjectProperty
property disjoint with: has activity
property disjoint with: relates to drug
property disjoint with: has organization type
property disjoint with: relates to plant
property disjoint with: has product type
property disjoint with: relates to society
property disjoint with: has time
property disjoint with: relates to animal
property disjoint with: relates to geopolitical entity
property disjoint with: relates to other organism
property disjoint with: relates to structured information
type: ObjectProperty
property disjoint with: bottomObjectProperty
property disjoint with: relates to disease
property disjoint with: has person type
property disjoint with: has workplace
property disjoint with: relates to finance or economy
domain: Thing
range: Extraterrestrial
definition: This predicate relates an external entity to the SuperType (ST) shown. It indicates there is a relationship to the ST of a verifiable nature, but which is undetermined as to strength or a full rdf:type relationship.

Heuristic - Not Specified
type: qualifier
type: Thing
type: NamedIndividual
definition: Heuristic mapping method applied; script or technique not otherwise specified.

products
disjoint with: Nothing
type: Class
subclass of: http://lodlaundromat.org/.well-known/genid/c8e0b8b6e1bde2aaa1819fd2d1daf2fb#529
subclass of: http://lodlaundromat.org/.well-known/genid/c8e0b8b6e1bde2aaa1819fd2d1daf2fb#460
subclass of: http://lodlaundromat.org/.well-known/genid/c8e0b8b6e1bde2aaa1819fd2d1daf2fb#269
subclass of: http://lodlaundromat.org/.well-known/genid/c8e0b8b6e1bde2aaa1819fd2d1daf2fb#86
disjoint with: society
disjoint with: protists fungus
subclass of: http://lodlaundromat.org/.well-known/genid/c8e0b8b6e1bde2aaa1819fd2d1daf2fb#325
disjoint with: http://lodlaundromat.org/.well-known/genid/c8e0b8b6e1bde2aaa1819fd2d1daf2fb#422
subclass of: http://lodlaundromat.org/.well-known/genid/c8e0b8b6e1bde2aaa1819fd2d1daf2fb#373
disjoint with: time
disjoint with: natural phenomena
disjoint with: diseases
subclass of: http://lodlaundromat.org/.well-known/genid/c8e0b8b6e1bde2aaa1819fd2d1daf2fb#352
disjoint with: Extraterrestrial
disjoint with: person types
disjoint with: organizations
disjoint with: numbers
subclass of: http://lodlaundromat.org/.well-known/genid/c8e0b8b6e1bde2aaa1819fd2d1daf2fb#166
subclass of: http://lodlaundromat.org/.well-known/genid/c8e0b8b6e1bde2aaa1819fd2d1daf2fb#487
disjoint with: http://lodlaundromat.org/.well-known/genid/c8e0b8b6e1bde2aaa1819fd2d1daf2fb#1
disjoint with: prokaryotes
subclass of: Thing
subclass of: SuperType
subclass of: http://lodlaundromat.org/.well-known/genid/c8e0b8b6e1bde2aaa1819fd2d1daf2fb#433
definition: This is the largest SuperType and includes any instance offered for sale or performed as a commercial service. Often physical object made by humans that is not a conceptual work or a facility, such as vehicles, cars, trains, aircraft, spaceships, ships, foods, beverages, clothes, drugs, weapons. Products also include the concept of 'state' (e/g/., on/off)

has organization type
property disjoint with: has product type
property disjoint with: relates to numbers
property disjoint with: relates to structured information
property disjoint with: has food drink
property disjoint with: relates to chemistry
property disjoint with: has activity
property disjoint with: relates to plant
sub property of: topObjectProperty
property disjoint with: relates to audio information
property disjoint with: relates to other organism
property disjoint with: relates to extraterrestrial entity
property disjoint with: relates to drug
property disjoint with: relates to disease
property disjoint with: relates to natural phenomenon
property disjoint with: has notation
property disjoint with: relates to natural substance
property disjoint with: has event
property disjoint with: bottomObjectProperty
property disjoint with: relates to visual information
type: ObjectProperty
property disjoint with: has time
domain: Thing
range: organizations
definition: This predicate relates an external entity to the SuperType (ST) shown. It indicates there is a relationship to the ST of a verifiable nature, but which is undetermined as to strength or a full rdf:type relationship

protists fungus
type: Class
disjoint with: written information
disjoint with: numbers
disjoint with: natural substance
subclass of: http://lodlaundromat.org/.well-known/genid/c8e0b8b6e1bde2aaa1819fd2d1daf2fb#1
subclass of: http://lodlaundromat.org/.well-known/genid/c8e0b8b6e1bde2aaa1819fd2d1daf2fb#306
subclass of: http://lodlaundromat.org/.well-known/genid/c8e0b8b6e1bde2aaa1819fd2d1daf2fb#210
subclass of: http://lodlaundromat.org/.well-known/genid/c8e0b8b6e1bde2aaa1819fd2d1daf2fb#289
subclass of: http://lodlaundromat.org/.well-known/genid/c8e0b8b6e1bde2aaa1819fd2d1daf2fb#86
subclass of: http://lodlaundromat.org/.well-known/genid/c8e0b8b6e1bde2aaa1819fd2d1daf2fb#422
subclass of: http://lodlaundromat.org/.well-known/genid/c8e0b8b6e1bde2aaa1819fd2d1daf2fb#269
disjoint with: organizations
subclass of: http://lodlaundromat.org/.well-known/genid/c8e0b8b6e1bde2aaa1819fd2d1daf2fb#154
disjoint with: facilities
subclass of: http://lodlaundromat.org/.well-known/genid/c8e0b8b6e1bde2aaa1819fd2d1daf2fb#4
subclass of: http://lodlaundromat.org/.well-known/genid/c8e0b8b6e1bde2aaa1819fd2d1daf2fb#325
disjoint with: time
subclass of: http://lodlaundromat.org/.well-known/genid/c8e0b8b6e1bde2aaa1819fd2d1daf2fb#39
disjoint with: person types
subclass of: http://lodlaundromat.org/.well-known/genid/c8e0b8b6e1bde2aaa1819fd2d1daf2fb#574
disjoint with: society
disjoint with: finance and economy
disjoint with: earthscape
disjoint with: animals
subclass of: http://lodlaundromat.org/.well-known/genid/c8e0b8b6e1bde2aaa1819fd2d1daf2fb#556
disjoint with: natural phenomena
disjoint with: audio information
disjoint with: Nothing
disjoint with: products
subclass of: http://lodlaundromat.org/.well-known/genid/c8e0b8b6e1bde2aaa1819fd2d1daf2fb#64
disjoint with: activities
disjoint with: workplaces
subclass of: http://lodlaundromat.org/.well-known/genid/c8e0b8b6e1bde2aaa1819fd2d1daf2fb#487
disjoint with: plants
subclass of: http://lodlaundromat.org/.well-known/genid/c8e0b8b6e1bde2aaa1819fd2d1daf2fb#510
subclass of: http://lodlaundromat.org/.well-known/genid/c8e0b8b6e1bde2aaa1819fd2d1daf2fb#352
disjoint with: http://lodlaundromat.org/.well-known/genid/c8e0b8b6e1bde2aaa1819fd2d1daf2fb#460
subclass of: http://lodlaundromat.org/.well-known/genid/c8e0b8b6e1bde2aaa1819fd2d1daf2fb#19
subclass of: http://lodlaundromat.org/.well-known/genid/c8e0b8b6e1bde2aaa1819fd2d1daf2fb#396
subclass of: http://lodlaundromat.org/.well-known/genid/c8e0b8b6e1bde2aaa1819fd2d1daf2fb#597
disjoint with: structured information
subclass of: http://lodlaundromat.org/.well-known/genid/c8e0b8b6e1bde2aaa1819fd2d1daf2fb#166
disjoint with: Extraterrestrial
disjoint with: notations
disjoint with: geopolitical
subclass of: http://lodlaundromat.org/.well-known/genid/c8e0b8b6e1bde2aaa1819fd2d1daf2fb#247
subclass of: SuperType
subclass of: Thing
disjoint with: events
subclass of: http://lodlaundromat.org/.well-known/genid/c8e0b8b6e1bde2aaa1819fd2d1daf2fb#529
disjoint with: diseases
subclass of: http://lodlaundromat.org/.well-known/genid/c8e0b8b6e1bde2aaa1819fd2d1daf2fb#133
subclass of: http://lodlaundromat.org/.well-known/genid/c8e0b8b6e1bde2aaa1819fd2d1daf2fb#373
subclass of: http://lodlaundromat.org/.well-known/genid/c8e0b8b6e1bde2aaa1819fd2d1daf2fb#190
disjoint with: chemistry
disjoint with: visual information
definition: This is the remaining cluster of eukaryotic organisms, specifically including the fungus and the protista (protozoans and slime molds).

prokaryotes
disjoint with: geopolitical
disjoint with: organizations
subclass of: http://lodlaundromat.org/.well-known/genid/c8e0b8b6e1bde2aaa1819fd2d1daf2fb#154
subclass of: http://lodlaundromat.org/.well-known/genid/c8e0b8b6e1bde2aaa1819fd2d1daf2fb#133
disjoint with: animals
disjoint with: events
disjoint with: Extraterrestrial
disjoint with: facilities
subclass of: http://lodlaundromat.org/.well-known/genid/c8e0b8b6e1bde2aaa1819fd2d1daf2fb#574
disjoint with: time
disjoint with: finance and economy
subclass of: http://lodlaundromat.org/.well-known/genid/c8e0b8b6e1bde2aaa1819fd2d1daf2fb#227
disjoint with: activities
subclass of: http://lodlaundromat.org/.well-known/genid/c8e0b8b6e1bde2aaa1819fd2d1daf2fb#306
subclass of: http://lodlaundromat.org/.well-known/genid/c8e0b8b6e1bde2aaa1819fd2d1daf2fb#110
subclass of: http://lodlaundromat.org/.well-known/genid/c8e0b8b6e1bde2aaa1819fd2d1daf2fb#529
disjoint with: society
subclass of: http://lodlaundromat.org/.well-known/genid/c8e0b8b6e1bde2aaa1819fd2d1daf2fb#373
disjoint with: visual information
subclass of: http://lodlaundromat.org/.well-known/genid/c8e0b8b6e1bde2aaa1819fd2d1daf2fb#64
subclass of: http://lodlaundromat.org/.well-known/genid/c8e0b8b6e1bde2aaa1819fd2d1daf2fb#510
subclass of: Thing
disjoint with: http://lodlaundromat.org/.well-known/genid/c8e0b8b6e1bde2aaa1819fd2d1daf2fb#460
subclass of: http://lodlaundromat.org/.well-known/genid/c8e0b8b6e1bde2aaa1819fd2d1daf2fb#4
disjoint with: workplaces
disjoint with: audio information
subclass of: SuperType
disjoint with: drugs
disjoint with: notations
subclass of: http://lodlaundromat.org/.well-known/genid/c8e0b8b6e1bde2aaa1819fd2d1daf2fb#1
disjoint with: Nothing
subclass of: http://lodlaundromat.org/.well-known/genid/c8e0b8b6e1bde2aaa1819fd2d1daf2fb#19
subclass of: http://lodlaundromat.org/.well-known/genid/c8e0b8b6e1bde2aaa1819fd2d1daf2fb#269
subclass of: http://lodlaundromat.org/.well-known/genid/c8e0b8b6e1bde2aaa1819fd2d1daf2fb#86
subclass of: http://lodlaundromat.org/.well-known/genid/c8e0b8b6e1bde2aaa1819fd2d1daf2fb#166
disjoint with: chemistry
subclass of: http://lodlaundromat.org/.well-known/genid/c8e0b8b6e1bde2aaa1819fd2d1daf2fb#210
subclass of: http://lodlaundromat.org/.well-known/genid/c8e0b8b6e1bde2aaa1819fd2d1daf2fb#422
disjoint with: natural substance
subclass of: http://lodlaundromat.org/.well-known/genid/c8e0b8b6e1bde2aaa1819fd2d1daf2fb#289
disjoint with: http://lodlaundromat.org/.well-known/genid/c8e0b8b6e1bde2aaa1819fd2d1daf2fb#433
disjoint with: earthscape
subclass of: http://lodlaundromat.org/.well-known/genid/c8e0b8b6e1bde2aaa1819fd2d1daf2fb#556
subclass of: http://lodlaundromat.org/.well-known/genid/c8e0b8b6e1bde2aaa1819fd2d1daf2fb#352
subclass of: http://lodlaundromat.org/.well-known/genid/c8e0b8b6e1bde2aaa1819fd2d1daf2fb#325
disjoint with: numbers
disjoint with: natural phenomena
disjoint with: products
type: Class
subclass of: http://lodlaundromat.org/.well-known/genid/c8e0b8b6e1bde2aaa1819fd2d1daf2fb#487
disjoint with: food or drink
disjoint with: person types
disjoint with: written information
disjoint with: plants
subclass of: http://lodlaundromat.org/.well-known/genid/c8e0b8b6e1bde2aaa1819fd2d1daf2fb#39
disjoint with: structured information
subclass of: http://lodlaundromat.org/.well-known/genid/c8e0b8b6e1bde2aaa1819fd2d1daf2fb#597
disjoint with: diseases
subclass of: http://lodlaundromat.org/.well-known/genid/c8e0b8b6e1bde2aaa1819fd2d1daf2fb#396
subclass of: http://lodlaundromat.org/.well-known/genid/c8e0b8b6e1bde2aaa1819fd2d1daf2fb#247
subclass of: http://lodlaundromat.org/.well-known/genid/c8e0b8b6e1bde2aaa1819fd2d1daf2fb#190
definition: The Prokaryotes include all prokaryotic organisms, including the Monera, Archaebacteria, Bacteria, and Blue-green algas. Also included in this SuperType are viruses and prions.

SuperType
disjoint with: Nothing
subclass of: Thing
type: Class
definition: SuperTypes are a collection of (mostly) similar Reference Concepts. Most of the SuperType classes have been designed to be (mostly) disjoint from the other SuperType classes. SuperTypes thus provide a higher-level of clustering and organization of Reference Concepts for use in user interfaces and for reasoning purposes.

has workplace
property disjoint with: relates to chemistry
property disjoint with: relates to structured information
property disjoint with: has event
property disjoint with: relates to natural substance
property disjoint with: relates to audio information
property disjoint with: relates to drug
property disjoint with: bottomObjectProperty
property disjoint with: has person type
property disjoint with: relates to plant
property disjoint with: has notation
property disjoint with: relates to disease
property disjoint with: has food drink
property disjoint with: relates to society
property disjoint with: relates to animal
sub property of: topObjectProperty
type: ObjectProperty
property disjoint with: relates to visual information
property disjoint with: has time
property disjoint with: relates to natural phenomenon
property disjoint with: relates to extraterrestrial entity
property disjoint with: relates to other organism
property disjoint with: relates to numbers
property disjoint with: has activity
domain: Thing
range: workplaces
definition: This predicate relates an external entity to the SuperType (ST) shown. It indicates there is a relationship to the ST of a verifiable nature, but which is undetermined as to strength or a full rdf:type relationship

time
subclass of: http://lodlaundromat.org/.well-known/genid/c8e0b8b6e1bde2aaa1819fd2d1daf2fb#64
subclass of: Thing
disjoint with: written information
subclass of: SuperType
subclass of: http://lodlaundromat.org/.well-known/genid/c8e0b8b6e1bde2aaa1819fd2d1daf2fb#210
subclass of: http://lodlaundromat.org/.well-known/genid/c8e0b8b6e1bde2aaa1819fd2d1daf2fb#487
disjoint with: earthscape
subclass of: http://lodlaundromat.org/.well-known/genid/c8e0b8b6e1bde2aaa1819fd2d1daf2fb#133
subclass of: http://lodlaundromat.org/.well-known/genid/c8e0b8b6e1bde2aaa1819fd2d1daf2fb#597
disjoint with: organizations
subclass of: http://lodlaundromat.org/.well-known/genid/c8e0b8b6e1bde2aaa1819fd2d1daf2fb#306
subclass of: http://lodlaundromat.org/.well-known/genid/c8e0b8b6e1bde2aaa1819fd2d1daf2fb#433
disjoint with: Nothing
subclass of: http://lodlaundromat.org/.well-known/genid/c8e0b8b6e1bde2aaa1819fd2d1daf2fb#510
disjoint with: http://lodlaundromat.org/.well-known/genid/c8e0b8b6e1bde2aaa1819fd2d1daf2fb#1
subclass of: http://lodlaundromat.org/.well-known/genid/c8e0b8b6e1bde2aaa1819fd2d1daf2fb#574
disjoint with: chemistry
disjoint with: food or drink
disjoint with: protists fungus
type: Class
disjoint with: workplaces
disjoint with: finance and economy
disjoint with: http://lodlaundromat.org/.well-known/genid/c8e0b8b6e1bde2aaa1819fd2d1daf2fb#154
subclass of: http://lodlaundromat.org/.well-known/genid/c8e0b8b6e1bde2aaa1819fd2d1daf2fb#19
disjoint with: Extraterrestrial
disjoint with: diseases
disjoint with: http://lodlaundromat.org/.well-known/genid/c8e0b8b6e1bde2aaa1819fd2d1daf2fb#4
subclass of: http://lodlaundromat.org/.well-known/genid/c8e0b8b6e1bde2aaa1819fd2d1daf2fb#227
disjoint with: notations
subclass of: http://lodlaundromat.org/.well-known/genid/c8e0b8b6e1bde2aaa1819fd2d1daf2fb#269
subclass of: http://lodlaundromat.org/.well-known/genid/c8e0b8b6e1bde2aaa1819fd2d1daf2fb#110
subclass of: http://lodlaundromat.org/.well-known/genid/c8e0b8b6e1bde2aaa1819fd2d1daf2fb#86
subclass of: http://lodlaundromat.org/.well-known/genid/c8e0b8b6e1bde2aaa1819fd2d1daf2fb#325
subclass of: http://lodlaundromat.org/.well-known/genid/c8e0b8b6e1bde2aaa1819fd2d1daf2fb#556
disjoint with: natural substance
disjoint with: numbers
subclass of: http://lodlaundromat.org/.well-known/genid/c8e0b8b6e1bde2aaa1819fd2d1daf2fb#39
subclass of: http://lodlaundromat.org/.well-known/genid/c8e0b8b6e1bde2aaa1819fd2d1daf2fb#166
disjoint with: structured information
disjoint with: http://lodlaundromat.org/.well-known/genid/c8e0b8b6e1bde2aaa1819fd2d1daf2fb#529
disjoint with: plants
disjoint with: drugs
disjoint with: animals
disjoint with: products
subclass of: http://lodlaundromat.org/.well-known/genid/c8e0b8b6e1bde2aaa1819fd2d1daf2fb#396
subclass of: http://lodlaundromat.org/.well-known/genid/c8e0b8b6e1bde2aaa1819fd2d1daf2fb#289
subclass of: http://lodlaundromat.org/.well-known/genid/c8e0b8b6e1bde2aaa1819fd2d1daf2fb#190
disjoint with: person types
disjoint with: geopolitical
subclass of: http://lodlaundromat.org/.well-known/genid/c8e0b8b6e1bde2aaa1819fd2d1daf2fb#422
disjoint with: natural phenomena
disjoint with: facilities
subclass of: http://lodlaundromat.org/.well-known/genid/c8e0b8b6e1bde2aaa1819fd2d1daf2fb#460
disjoint with: society
subclass of: http://lodlaundromat.org/.well-known/genid/c8e0b8b6e1bde2aaa1819fd2d1daf2fb#373
disjoint with: audio information
disjoint with: prokaryotes
subclass of: http://lodlaundromat.org/.well-known/genid/c8e0b8b6e1bde2aaa1819fd2d1daf2fb#352
subclass of: http://lodlaundromat.org/.well-known/genid/c8e0b8b6e1bde2aaa1819fd2d1daf2fb#247
disjoint with: visual information
definition: This SuperType is for specific time or date or period (such as eras, or days, weeks, months type intervals) references in various formats

Automatic - Inspected SV
type: qualifier
type: Thing
type: NamedIndividual
definition: Mapping based on automatic scoring of concepts using Semantic Vectors, with specific alignment choice based on hand selection.

person types
subclass of: http://lodlaundromat.org/.well-known/genid/c8e0b8b6e1bde2aaa1819fd2d1daf2fb#396
subclass of: http://lodlaundromat.org/.well-known/genid/c8e0b8b6e1bde2aaa1819fd2d1daf2fb#306
disjoint with: plants
subclass of: http://lodlaundromat.org/.well-known/genid/c8e0b8b6e1bde2aaa1819fd2d1daf2fb#574
subclass of: http://lodlaundromat.org/.well-known/genid/c8e0b8b6e1bde2aaa1819fd2d1daf2fb#39
subclass of: http://lodlaundromat.org/.well-known/genid/c8e0b8b6e1bde2aaa1819fd2d1daf2fb#64
subclass of: http://lodlaundromat.org/.well-known/genid/c8e0b8b6e1bde2aaa1819fd2d1daf2fb#433
disjoint with: drugs
disjoint with: products
disjoint with: food or drink
subclass of: http://lodlaundromat.org/.well-known/genid/c8e0b8b6e1bde2aaa1819fd2d1daf2fb#247
disjoint with: protists fungus
disjoint with: notations
subclass of: http://lodlaundromat.org/.well-known/genid/c8e0b8b6e1bde2aaa1819fd2d1daf2fb#110
subclass of: http://lodlaundromat.org/.well-known/genid/c8e0b8b6e1bde2aaa1819fd2d1daf2fb#529
disjoint with: http://lodlaundromat.org/.well-known/genid/c8e0b8b6e1bde2aaa1819fd2d1daf2fb#19
subclass of: http://lodlaundromat.org/.well-known/genid/c8e0b8b6e1bde2aaa1819fd2d1daf2fb#210
subclass of: http://lodlaundromat.org/.well-known/genid/c8e0b8b6e1bde2aaa1819fd2d1daf2fb#227
disjoint with: Nothing
disjoint with: facilities
disjoint with: finance and economy
disjoint with: chemistry
subclass of: http://lodlaundromat.org/.well-known/genid/c8e0b8b6e1bde2aaa1819fd2d1daf2fb#166
disjoint with: natural phenomena
subclass of: http://lodlaundromat.org/.well-known/genid/c8e0b8b6e1bde2aaa1819fd2d1daf2fb#190
subclass of: http://lodlaundromat.org/.well-known/genid/c8e0b8b6e1bde2aaa1819fd2d1daf2fb#289
disjoint with: natural substance
type: Class
subclass of: http://lodlaundromat.org/.well-known/genid/c8e0b8b6e1bde2aaa1819fd2d1daf2fb#269
disjoint with: structured information
subclass of: http://lodlaundromat.org/.well-known/genid/c8e0b8b6e1bde2aaa1819fd2d1daf2fb#133
disjoint with: http://lodlaundromat.org/.well-known/genid/c8e0b8b6e1bde2aaa1819fd2d1daf2fb#373
subclass of: http://lodlaundromat.org/.well-known/genid/c8e0b8b6e1bde2aaa1819fd2d1daf2fb#597
disjoint with: workplaces
disjoint with: written information
disjoint with: Extraterrestrial
disjoint with: time
subclass of: http://lodlaundromat.org/.well-known/genid/c8e0b8b6e1bde2aaa1819fd2d1daf2fb#510
disjoint with: audio information
subclass of: http://lodlaundromat.org/.well-known/genid/c8e0b8b6e1bde2aaa1819fd2d1daf2fb#422
subclass of: http://lodlaundromat.org/.well-known/genid/c8e0b8b6e1bde2aaa1819fd2d1daf2fb#460
disjoint with: prokaryotes
disjoint with: earthscape
disjoint with: geopolitical
subclass of: SuperType
subclass of: http://lodlaundromat.org/.well-known/genid/c8e0b8b6e1bde2aaa1819fd2d1daf2fb#325
subclass of: Thing
disjoint with: numbers
disjoint with: http://lodlaundromat.org/.well-known/genid/c8e0b8b6e1bde2aaa1819fd2d1daf2fb#1
disjoint with: visual information
subclass of: http://lodlaundromat.org/.well-known/genid/c8e0b8b6e1bde2aaa1819fd2d1daf2fb#556
definition: The appropriate SuperType for all named, individual human beings. This SuperType also includes the assignment of formal, honorific or cultural titles given to specific human individuals. It further includes names given to humans who conduct specific jobs or activities (the latter case is known as an avocation). Examples include steelworker, waitress, lawyer, plumber, artisan. Ethnic groups are specifically included.

relates to market or industry
sub property of: topObjectProperty
property disjoint with: bottomObjectProperty
type: ObjectProperty
domain: Thing
range: market industries
definition: This predicate relates an external entity to the SuperType (ST) shown. It indicates there is a relationship to the ST of a verifiable nature, but which is undetermined as to strength or a full rdf:type relationship.

abstract level
disjoint with: Nothing
subclass of: SuperType
subclass of: Thing
type: Class
definition: This general SuperType category is largely composed of former AbstractConcepts, and represent some of the more abstract upper-level nodes for connecting the UMBEL structure together. This SuperType also includes theories or processes or methods for humans to do stuff or any human technology

relates to disease
property disjoint with: relates to drug
property disjoint with: has food drink
property disjoint with: relates to chemistry
property disjoint with: has notation
property disjoint with: relates to extraterrestrial entity
property disjoint with: relates to structured information
property disjoint with: relates to plant
property disjoint with: has workplace
property disjoint with: relates to natural substance
type: ObjectProperty
property disjoint with: relates to earthscape
property disjoint with: has time
property disjoint with: relates to society
property disjoint with: relates to visual information
property disjoint with: bottomObjectProperty
sub property of: topObjectProperty
property disjoint with: relates to geopolitical entity
property disjoint with: relates to other organism
property disjoint with: relates to finance or economy
property disjoint with: relates to facility
property disjoint with: relates to natural phenomenon
property disjoint with: has organization type
property disjoint with: relates to numbers
property disjoint with: has product type
property disjoint with: relates to audio information
domain: Thing
range: diseases
definition: This predicate relates an external entity to the SuperType (ST) shown. It indicates there is a relationship to the ST of a verifiable nature, but which is undetermined as to strength or a full rdf:type relationship.

written information
disjoint with: workplaces
subclass of: http://lodlaundromat.org/.well-known/genid/c8e0b8b6e1bde2aaa1819fd2d1daf2fb#39
disjoint with: protists fungus
subclass of: http://lodlaundromat.org/.well-known/genid/c8e0b8b6e1bde2aaa1819fd2d1daf2fb#269
subclass of: SuperType
disjoint with: audio information
disjoint with: numbers
disjoint with: http://lodlaundromat.org/.well-known/genid/c8e0b8b6e1bde2aaa1819fd2d1daf2fb#597
subclass of: Thing
subclass of: http://lodlaundromat.org/.well-known/genid/c8e0b8b6e1bde2aaa1819fd2d1daf2fb#64
disjoint with: Extraterrestrial
subclass of: http://lodlaundromat.org/.well-known/genid/c8e0b8b6e1bde2aaa1819fd2d1daf2fb#460
subclass of: http://lodlaundromat.org/.well-known/genid/c8e0b8b6e1bde2aaa1819fd2d1daf2fb#166
subclass of: http://lodlaundromat.org/.well-known/genid/c8e0b8b6e1bde2aaa1819fd2d1daf2fb#325
subclass of: http://lodlaundromat.org/.well-known/genid/c8e0b8b6e1bde2aaa1819fd2d1daf2fb#289
subclass of: http://lodlaundromat.org/.well-known/genid/c8e0b8b6e1bde2aaa1819fd2d1daf2fb#352
disjoint with: Nothing
disjoint with: http://lodlaundromat.org/.well-known/genid/c8e0b8b6e1bde2aaa1819fd2d1daf2fb#1
subclass of: http://lodlaundromat.org/.well-known/genid/c8e0b8b6e1bde2aaa1819fd2d1daf2fb#19
disjoint with: geopolitical
disjoint with: natural phenomena
disjoint with: organizations
subclass of: http://lodlaundromat.org/.well-known/genid/c8e0b8b6e1bde2aaa1819fd2d1daf2fb#133
type: Class
disjoint with: facilities
disjoint with: http://lodlaundromat.org/.well-known/genid/c8e0b8b6e1bde2aaa1819fd2d1daf2fb#154
subclass of: http://lodlaundromat.org/.well-known/genid/c8e0b8b6e1bde2aaa1819fd2d1daf2fb#247
subclass of: http://lodlaundromat.org/.well-known/genid/c8e0b8b6e1bde2aaa1819fd2d1daf2fb#574
disjoint with: animals
disjoint with: drugs
subclass of: http://lodlaundromat.org/.well-known/genid/c8e0b8b6e1bde2aaa1819fd2d1daf2fb#86
subclass of: http://lodlaundromat.org/.well-known/genid/c8e0b8b6e1bde2aaa1819fd2d1daf2fb#396
subclass of: http://lodlaundromat.org/.well-known/genid/c8e0b8b6e1bde2aaa1819fd2d1daf2fb#190
disjoint with: diseases
disjoint with: earthscape
disjoint with: prokaryotes
subclass of: http://lodlaundromat.org/.well-known/genid/c8e0b8b6e1bde2aaa1819fd2d1daf2fb#433
disjoint with: natural substance
disjoint with: chemistry
subclass of: http://lodlaundromat.org/.well-known/genid/c8e0b8b6e1bde2aaa1819fd2d1daf2fb#373
disjoint with: plants
disjoint with: person types
subclass of: http://lodlaundromat.org/.well-known/genid/c8e0b8b6e1bde2aaa1819fd2d1daf2fb#227
disjoint with: http://lodlaundromat.org/.well-known/genid/c8e0b8b6e1bde2aaa1819fd2d1daf2fb#4
subclass of: http://lodlaundromat.org/.well-known/genid/c8e0b8b6e1bde2aaa1819fd2d1daf2fb#529
disjoint with: time
disjoint with: food or drink
subclass of: http://lodlaundromat.org/.well-known/genid/c8e0b8b6e1bde2aaa1819fd2d1daf2fb#110
definition: This SuperType includes any general material written by humans including books, blogs, articles, manuscripts, but any written information conveyed via text.

diseases
subclass of: http://lodlaundromat.org/.well-known/genid/c8e0b8b6e1bde2aaa1819fd2d1daf2fb#460
disjoint with: geopolitical
disjoint with: Nothing
subclass of: http://lodlaundromat.org/.well-known/genid/c8e0b8b6e1bde2aaa1819fd2d1daf2fb#306
subclass of: http://lodlaundromat.org/.well-known/genid/c8e0b8b6e1bde2aaa1819fd2d1daf2fb#352
subclass of: http://lodlaundromat.org/.well-known/genid/c8e0b8b6e1bde2aaa1819fd2d1daf2fb#487
disjoint with: food or drink
disjoint with: audio information
subclass of: http://lodlaundromat.org/.well-known/genid/c8e0b8b6e1bde2aaa1819fd2d1daf2fb#289
subclass of: http://lodlaundromat.org/.well-known/genid/c8e0b8b6e1bde2aaa1819fd2d1daf2fb#325
subclass of: http://lodlaundromat.org/.well-known/genid/c8e0b8b6e1bde2aaa1819fd2d1daf2fb#529
disjoint with: http://lodlaundromat.org/.well-known/genid/c8e0b8b6e1bde2aaa1819fd2d1daf2fb#1
disjoint with: drugs
disjoint with: http://lodlaundromat.org/.well-known/genid/c8e0b8b6e1bde2aaa1819fd2d1daf2fb#19
subclass of: http://lodlaundromat.org/.well-known/genid/c8e0b8b6e1bde2aaa1819fd2d1daf2fb#510
disjoint with: Extraterrestrial
disjoint with: plants
disjoint with: structured information
subclass of: http://lodlaundromat.org/.well-known/genid/c8e0b8b6e1bde2aaa1819fd2d1daf2fb#133
subclass of: http://lodlaundromat.org/.well-known/genid/c8e0b8b6e1bde2aaa1819fd2d1daf2fb#556
disjoint with: products
subclass of: http://lodlaundromat.org/.well-known/genid/c8e0b8b6e1bde2aaa1819fd2d1daf2fb#110
subclass of: Thing
disjoint with: chemistry
type: Class
subclass of: SuperType
subclass of: http://lodlaundromat.org/.well-known/genid/c8e0b8b6e1bde2aaa1819fd2d1daf2fb#64
disjoint with: facilities
disjoint with: finance and economy
subclass of: http://lodlaundromat.org/.well-known/genid/c8e0b8b6e1bde2aaa1819fd2d1daf2fb#227
disjoint with: natural substance
disjoint with: workplaces
disjoint with: http://lodlaundromat.org/.well-known/genid/c8e0b8b6e1bde2aaa1819fd2d1daf2fb#373
disjoint with: society
disjoint with: visual information
subclass of: http://lodlaundromat.org/.well-known/genid/c8e0b8b6e1bde2aaa1819fd2d1daf2fb#39
subclass of: http://lodlaundromat.org/.well-known/genid/c8e0b8b6e1bde2aaa1819fd2d1daf2fb#166
disjoint with: protists fungus
disjoint with: prokaryotes
subclass of: http://lodlaundromat.org/.well-known/genid/c8e0b8b6e1bde2aaa1819fd2d1daf2fb#433
disjoint with: earthscape
subclass of: http://lodlaundromat.org/.well-known/genid/c8e0b8b6e1bde2aaa1819fd2d1daf2fb#210
subclass of: http://lodlaundromat.org/.well-known/genid/c8e0b8b6e1bde2aaa1819fd2d1daf2fb#396
disjoint with: time
subclass of: http://lodlaundromat.org/.well-known/genid/c8e0b8b6e1bde2aaa1819fd2d1daf2fb#190
disjoint with: numbers
disjoint with: organizations
disjoint with: natural phenomena
disjoint with: http://lodlaundromat.org/.well-known/genid/c8e0b8b6e1bde2aaa1819fd2d1daf2fb#154
disjoint with: notations
subclass of: http://lodlaundromat.org/.well-known/genid/c8e0b8b6e1bde2aaa1819fd2d1daf2fb#574
disjoint with: http://lodlaundromat.org/.well-known/genid/c8e0b8b6e1bde2aaa1819fd2d1daf2fb#4
subclass of: http://lodlaundromat.org/.well-known/genid/c8e0b8b6e1bde2aaa1819fd2d1daf2fb#247
subclass of: http://lodlaundromat.org/.well-known/genid/c8e0b8b6e1bde2aaa1819fd2d1daf2fb#597
subclass of: http://lodlaundromat.org/.well-known/genid/c8e0b8b6e1bde2aaa1819fd2d1daf2fb#422
disjoint with: http://lodlaundromat.org/.well-known/genid/c8e0b8b6e1bde2aaa1819fd2d1daf2fb#86
disjoint with: written information
definition: Diseases are atypical or unusual or unhealthy conditions for (mostly human) living things, generally known as conditions, disorders, infections, diseases or syndromes. Diseases only affect living things and sometimes are caused by living things. This SuperType also includes impairments, disease vectors, wounds and injuries, and poisoning.

animals
disjoint with: plants
subclass of: http://lodlaundromat.org/.well-known/genid/c8e0b8b6e1bde2aaa1819fd2d1daf2fb#460
disjoint with: numbers
disjoint with: drugs
disjoint with: finance and economy
subclass of: http://lodlaundromat.org/.well-known/genid/c8e0b8b6e1bde2aaa1819fd2d1daf2fb#269
subclass of: Thing
subclass of: http://lodlaundromat.org/.well-known/genid/c8e0b8b6e1bde2aaa1819fd2d1daf2fb#306
disjoint with: Extraterrestrial
subclass of: SuperType
disjoint with: geopolitical
disjoint with: audio information
subclass of: http://lodlaundromat.org/.well-known/genid/c8e0b8b6e1bde2aaa1819fd2d1daf2fb#529
type: Class
disjoint with: workplaces
disjoint with: natural substance
subclass of: http://lodlaundromat.org/.well-known/genid/c8e0b8b6e1bde2aaa1819fd2d1daf2fb#556
disjoint with: prokaryotes
disjoint with: http://lodlaundromat.org/.well-known/genid/c8e0b8b6e1bde2aaa1819fd2d1daf2fb#19
disjoint with: natural phenomena
subclass of: http://lodlaundromat.org/.well-known/genid/c8e0b8b6e1bde2aaa1819fd2d1daf2fb#247
subclass of: http://lodlaundromat.org/.well-known/genid/c8e0b8b6e1bde2aaa1819fd2d1daf2fb#190
disjoint with: structured information
subclass of: http://lodlaundromat.org/.well-known/genid/c8e0b8b6e1bde2aaa1819fd2d1daf2fb#210
disjoint with: facilities
subclass of: http://lodlaundromat.org/.well-known/genid/c8e0b8b6e1bde2aaa1819fd2d1daf2fb#133
subclass of: http://lodlaundromat.org/.well-known/genid/c8e0b8b6e1bde2aaa1819fd2d1daf2fb#510
subclass of: http://lodlaundromat.org/.well-known/genid/c8e0b8b6e1bde2aaa1819fd2d1daf2fb#433
subclass of: http://lodlaundromat.org/.well-known/genid/c8e0b8b6e1bde2aaa1819fd2d1daf2fb#597
disjoint with: earthscape
disjoint with: protists fungus
subclass of: http://lodlaundromat.org/.well-known/genid/c8e0b8b6e1bde2aaa1819fd2d1daf2fb#396
disjoint with: notations
disjoint with: Nothing
subclass of: http://lodlaundromat.org/.well-known/genid/c8e0b8b6e1bde2aaa1819fd2d1daf2fb#325
subclass of: http://lodlaundromat.org/.well-known/genid/c8e0b8b6e1bde2aaa1819fd2d1daf2fb#39
disjoint with: time
subclass of: http://lodlaundromat.org/.well-known/genid/c8e0b8b6e1bde2aaa1819fd2d1daf2fb#110
disjoint with: visual information
disjoint with: written information
subclass of: http://lodlaundromat.org/.well-known/genid/c8e0b8b6e1bde2aaa1819fd2d1daf2fb#166
subclass of: http://lodlaundromat.org/.well-known/genid/c8e0b8b6e1bde2aaa1819fd2d1daf2fb#574
disjoint with: http://lodlaundromat.org/.well-known/genid/c8e0b8b6e1bde2aaa1819fd2d1daf2fb#1
definition: This large SuperType includes all animal types, including specific animal types and vertebrates, invertebrates, insects, crustaceans, fish, reptiles, amphibia, birds, mammals, and animal body parts. Animal parts are specifically included. Also, groupings of such animals are included. Humans, as an animal, are included (versus as an individual Person). Diseases are specifically excluded. Animals have many of the similar overlaps to Plants. However, in addition, there are more terms for animal groups, animal parts, animal secretions, etc. Also Animals can include some human traits (posture, dead animal, etc)

facilities
subclass of: http://lodlaundromat.org/.well-known/genid/c8e0b8b6e1bde2aaa1819fd2d1daf2fb#110
subclass of: http://lodlaundromat.org/.well-known/genid/c8e0b8b6e1bde2aaa1819fd2d1daf2fb#306
subclass of: http://lodlaundromat.org/.well-known/genid/c8e0b8b6e1bde2aaa1819fd2d1daf2fb#510
disjoint with: diseases
disjoint with: society
type: Class
disjoint with: Extraterrestrial
disjoint with: drugs
disjoint with: written information
disjoint with: events
subclass of: http://lodlaundromat.org/.well-known/genid/c8e0b8b6e1bde2aaa1819fd2d1daf2fb#433
disjoint with: person types
disjoint with: food or drink
disjoint with: protists fungus
subclass of: http://lodlaundromat.org/.well-known/genid/c8e0b8b6e1bde2aaa1819fd2d1daf2fb#154
disjoint with: http://lodlaundromat.org/.well-known/genid/c8e0b8b6e1bde2aaa1819fd2d1daf2fb#190
subclass of: http://lodlaundromat.org/.well-known/genid/c8e0b8b6e1bde2aaa1819fd2d1daf2fb#373
subclass of: http://lodlaundromat.org/.well-known/genid/c8e0b8b6e1bde2aaa1819fd2d1daf2fb#529
subclass of: http://lodlaundromat.org/.well-known/genid/c8e0b8b6e1bde2aaa1819fd2d1daf2fb#86
subclass of: http://lodlaundromat.org/.well-known/genid/c8e0b8b6e1bde2aaa1819fd2d1daf2fb#4
disjoint with: prokaryotes
disjoint with: activities
subclass of: http://lodlaundromat.org/.well-known/genid/c8e0b8b6e1bde2aaa1819fd2d1daf2fb#227
subclass of: http://lodlaundromat.org/.well-known/genid/c8e0b8b6e1bde2aaa1819fd2d1daf2fb#396
disjoint with: animals
disjoint with: numbers
disjoint with: notations
subclass of: http://lodlaundromat.org/.well-known/genid/c8e0b8b6e1bde2aaa1819fd2d1daf2fb#39
subclass of: Thing
disjoint with: plants
subclass of: http://lodlaundromat.org/.well-known/genid/c8e0b8b6e1bde2aaa1819fd2d1daf2fb#19
subclass of: http://lodlaundromat.org/.well-known/genid/c8e0b8b6e1bde2aaa1819fd2d1daf2fb#64
disjoint with: structured information
disjoint with: http://lodlaundromat.org/.well-known/genid/c8e0b8b6e1bde2aaa1819fd2d1daf2fb#1
subclass of: http://lodlaundromat.org/.well-known/genid/c8e0b8b6e1bde2aaa1819fd2d1daf2fb#487
subclass of: http://lodlaundromat.org/.well-known/genid/c8e0b8b6e1bde2aaa1819fd2d1daf2fb#325
subclass of: http://lodlaundromat.org/.well-known/genid/c8e0b8b6e1bde2aaa1819fd2d1daf2fb#166
disjoint with: audio information
subclass of: http://lodlaundromat.org/.well-known/genid/c8e0b8b6e1bde2aaa1819fd2d1daf2fb#597
disjoint with: chemistry
subclass of: http://lodlaundromat.org/.well-known/genid/c8e0b8b6e1bde2aaa1819fd2d1daf2fb#460
disjoint with: time
disjoint with: Nothing
subclass of: SuperType
definition: Facilities are physical places or buildings constructed by humans, such as schools, public institutions, markets, museums, amusement parks, worship places, stations, airports, ports, carstops, lines, railroads, roads, waterways, tunnels, bridges, parks, sport facilities, monuments. All can be geospatially located. Facilities also include animal pens and enclosures and general human "activity" areas (golf course, archeology sites, etc.). Iportantly Facilities include infrastructure systems such as roadways and physical networks. Facilities also include the component parts that go into making them (such as foundations, doors, windows, roofs, etc.)

food or drink
subclass of: http://lodlaundromat.org/.well-known/genid/c8e0b8b6e1bde2aaa1819fd2d1daf2fb#39
subclass of: http://lodlaundromat.org/.well-known/genid/c8e0b8b6e1bde2aaa1819fd2d1daf2fb#373
disjoint with: geopolitical
subclass of: SuperType
subclass of: http://lodlaundromat.org/.well-known/genid/c8e0b8b6e1bde2aaa1819fd2d1daf2fb#269
disjoint with: finance and economy
subclass of: http://lodlaundromat.org/.well-known/genid/c8e0b8b6e1bde2aaa1819fd2d1daf2fb#306
subclass of: http://lodlaundromat.org/.well-known/genid/c8e0b8b6e1bde2aaa1819fd2d1daf2fb#556
subclass of: http://lodlaundromat.org/.well-known/genid/c8e0b8b6e1bde2aaa1819fd2d1daf2fb#574
disjoint with: visual information
disjoint with: Extraterrestrial
disjoint with: http://lodlaundromat.org/.well-known/genid/c8e0b8b6e1bde2aaa1819fd2d1daf2fb#227
disjoint with: audio information
disjoint with: facilities
disjoint with: notations
disjoint with: earthscape
disjoint with: structured information
subclass of: http://lodlaundromat.org/.well-known/genid/c8e0b8b6e1bde2aaa1819fd2d1daf2fb#247
disjoint with: Nothing
disjoint with: natural phenomena
disjoint with: time
disjoint with: diseases
subclass of: http://lodlaundromat.org/.well-known/genid/c8e0b8b6e1bde2aaa1819fd2d1daf2fb#133
disjoint with: written information
disjoint with: numbers
disjoint with: prokaryotes
subclass of: http://lodlaundromat.org/.well-known/genid/c8e0b8b6e1bde2aaa1819fd2d1daf2fb#166
subclass of: http://lodlaundromat.org/.well-known/genid/c8e0b8b6e1bde2aaa1819fd2d1daf2fb#510
disjoint with: workplaces
type: Class
subclass of: http://lodlaundromat.org/.well-known/genid/c8e0b8b6e1bde2aaa1819fd2d1daf2fb#210
subclass of: http://lodlaundromat.org/.well-known/genid/c8e0b8b6e1bde2aaa1819fd2d1daf2fb#597
subclass of: Thing
subclass of: http://lodlaundromat.org/.well-known/genid/c8e0b8b6e1bde2aaa1819fd2d1daf2fb#487
disjoint with: person types
disjoint with: organizations
subclass of: http://lodlaundromat.org/.well-known/genid/c8e0b8b6e1bde2aaa1819fd2d1daf2fb#325
subclass of: http://lodlaundromat.org/.well-known/genid/c8e0b8b6e1bde2aaa1819fd2d1daf2fb#352
disjoint with: society
subclass of: http://lodlaundromat.org/.well-known/genid/c8e0b8b6e1bde2aaa1819fd2d1daf2fb#529
subclass of: http://lodlaundromat.org/.well-known/genid/c8e0b8b6e1bde2aaa1819fd2d1daf2fb#86
subclass of: http://lodlaundromat.org/.well-known/genid/c8e0b8b6e1bde2aaa1819fd2d1daf2fb#190
definition: This SuperType is any edible substance grown, made or harvested by humans. The category also specifically includes the concept of cuisines

geopolitical
subclass of: http://lodlaundromat.org/.well-known/genid/c8e0b8b6e1bde2aaa1819fd2d1daf2fb#396
disjoint with: structured information
subclass of: http://lodlaundromat.org/.well-known/genid/c8e0b8b6e1bde2aaa1819fd2d1daf2fb#306
disjoint with: time
disjoint with: food or drink
subclass of: http://lodlaundromat.org/.well-known/genid/c8e0b8b6e1bde2aaa1819fd2d1daf2fb#460
disjoint with: http://lodlaundromat.org/.well-known/genid/c8e0b8b6e1bde2aaa1819fd2d1daf2fb#210
disjoint with: written information
subclass of: http://lodlaundromat.org/.well-known/genid/c8e0b8b6e1bde2aaa1819fd2d1daf2fb#110
subclass of: http://lodlaundromat.org/.well-known/genid/c8e0b8b6e1bde2aaa1819fd2d1daf2fb#556
disjoint with: numbers
disjoint with: natural phenomena
disjoint with: http://lodlaundromat.org/.well-known/genid/c8e0b8b6e1bde2aaa1819fd2d1daf2fb#1
subclass of: http://lodlaundromat.org/.well-known/genid/c8e0b8b6e1bde2aaa1819fd2d1daf2fb#64
subclass of: http://lodlaundromat.org/.well-known/genid/c8e0b8b6e1bde2aaa1819fd2d1daf2fb#269
disjoint with: person types
disjoint with: prokaryotes
subclass of: http://lodlaundromat.org/.well-known/genid/c8e0b8b6e1bde2aaa1819fd2d1daf2fb#19
disjoint with: protists fungus
disjoint with: events
subclass of: http://lodlaundromat.org/.well-known/genid/c8e0b8b6e1bde2aaa1819fd2d1daf2fb#325
type: Class
disjoint with: animals
disjoint with: http://lodlaundromat.org/.well-known/genid/c8e0b8b6e1bde2aaa1819fd2d1daf2fb#247
disjoint with: chemistry
subclass of: http://lodlaundromat.org/.well-known/genid/c8e0b8b6e1bde2aaa1819fd2d1daf2fb#4
disjoint with: Extraterrestrial
subclass of: http://lodlaundromat.org/.well-known/genid/c8e0b8b6e1bde2aaa1819fd2d1daf2fb#154
disjoint with: audio information
disjoint with: http://lodlaundromat.org/.well-known/genid/c8e0b8b6e1bde2aaa1819fd2d1daf2fb#133
subclass of: http://lodlaundromat.org/.well-known/genid/c8e0b8b6e1bde2aaa1819fd2d1daf2fb#227
subclass of: http://lodlaundromat.org/.well-known/genid/c8e0b8b6e1bde2aaa1819fd2d1daf2fb#433
subclass of: http://lodlaundromat.org/.well-known/genid/c8e0b8b6e1bde2aaa1819fd2d1daf2fb#510
disjoint with: activities
disjoint with: http://lodlaundromat.org/.well-known/genid/c8e0b8b6e1bde2aaa1819fd2d1daf2fb#190
subclass of: http://lodlaundromat.org/.well-known/genid/c8e0b8b6e1bde2aaa1819fd2d1daf2fb#166
disjoint with: notations
subclass of: SuperType
disjoint with: plants
subclass of: http://lodlaundromat.org/.well-known/genid/c8e0b8b6e1bde2aaa1819fd2d1daf2fb#39
disjoint with: society
subclass of: http://lodlaundromat.org/.well-known/genid/c8e0b8b6e1bde2aaa1819fd2d1daf2fb#529
disjoint with: visual information
subclass of: http://lodlaundromat.org/.well-known/genid/c8e0b8b6e1bde2aaa1819fd2d1daf2fb#487
subclass of: http://lodlaundromat.org/.well-known/genid/c8e0b8b6e1bde2aaa1819fd2d1daf2fb#597
disjoint with: drugs
disjoint with: diseases
subclass of: Thing
disjoint with: Nothing
subclass of: http://lodlaundromat.org/.well-known/genid/c8e0b8b6e1bde2aaa1819fd2d1daf2fb#373
subclass of: http://lodlaundromat.org/.well-known/genid/c8e0b8b6e1bde2aaa1819fd2d1daf2fb#86
definition: Named places that have some informal or formal political (authorized) component. Important subcollections include Country, IndependentCountry, State_Geopolitical, City, and Province.

society
disjoint with: prokaryotes
disjoint with: structured information
subclass of: http://lodlaundromat.org/.well-known/genid/c8e0b8b6e1bde2aaa1819fd2d1daf2fb#433
subclass of: http://lodlaundromat.org/.well-known/genid/c8e0b8b6e1bde2aaa1819fd2d1daf2fb#460
disjoint with: protists fungus
subclass of: http://lodlaundromat.org/.well-known/genid/c8e0b8b6e1bde2aaa1819fd2d1daf2fb#190
disjoint with: products
subclass of: http://lodlaundromat.org/.well-known/genid/c8e0b8b6e1bde2aaa1819fd2d1daf2fb#227
disjoint with: http://lodlaundromat.org/.well-known/genid/c8e0b8b6e1bde2aaa1819fd2d1daf2fb#1
disjoint with: facilities
disjoint with: audio information
disjoint with: notations
disjoint with: plants
disjoint with: numbers
disjoint with: earthscape
subclass of: http://lodlaundromat.org/.well-known/genid/c8e0b8b6e1bde2aaa1819fd2d1daf2fb#247
disjoint with: natural substance
disjoint with: time
subclass of: http://lodlaundromat.org/.well-known/genid/c8e0b8b6e1bde2aaa1819fd2d1daf2fb#325
disjoint with: visual information
disjoint with: natural phenomena
subclass of: http://lodlaundromat.org/.well-known/genid/c8e0b8b6e1bde2aaa1819fd2d1daf2fb#39
subclass of: SuperType
disjoint with: diseases
disjoint with: drugs
subclass of: http://lodlaundromat.org/.well-known/genid/c8e0b8b6e1bde2aaa1819fd2d1daf2fb#574
disjoint with: finance and economy
subclass of: Thing
subclass of: http://lodlaundromat.org/.well-known/genid/c8e0b8b6e1bde2aaa1819fd2d1daf2fb#556
subclass of: http://lodlaundromat.org/.well-known/genid/c8e0b8b6e1bde2aaa1819fd2d1daf2fb#396
subclass of: http://lodlaundromat.org/.well-known/genid/c8e0b8b6e1bde2aaa1819fd2d1daf2fb#110
disjoint with: Nothing
disjoint with: geopolitical
type: Class
subclass of: http://lodlaundromat.org/.well-known/genid/c8e0b8b6e1bde2aaa1819fd2d1daf2fb#86
subclass of: http://lodlaundromat.org/.well-known/genid/c8e0b8b6e1bde2aaa1819fd2d1daf2fb#306
subclass of: http://lodlaundromat.org/.well-known/genid/c8e0b8b6e1bde2aaa1819fd2d1daf2fb#269
subclass of: http://lodlaundromat.org/.well-known/genid/c8e0b8b6e1bde2aaa1819fd2d1daf2fb#210
subclass of: http://lodlaundromat.org/.well-known/genid/c8e0b8b6e1bde2aaa1819fd2d1daf2fb#166
disjoint with: workplaces
subclass of: http://lodlaundromat.org/.well-known/genid/c8e0b8b6e1bde2aaa1819fd2d1daf2fb#64
subclass of: http://lodlaundromat.org/.well-known/genid/c8e0b8b6e1bde2aaa1819fd2d1daf2fb#422
disjoint with: chemistry
subclass of: http://lodlaundromat.org/.well-known/genid/c8e0b8b6e1bde2aaa1819fd2d1daf2fb#510
subclass of: http://lodlaundromat.org/.well-known/genid/c8e0b8b6e1bde2aaa1819fd2d1daf2fb#289
disjoint with: Extraterrestrial
disjoint with: food or drink
subclass of: http://lodlaundromat.org/.well-known/genid/c8e0b8b6e1bde2aaa1819fd2d1daf2fb#133
disjoint with: http://lodlaundromat.org/.well-known/genid/c8e0b8b6e1bde2aaa1819fd2d1daf2fb#487
subclass of: http://lodlaundromat.org/.well-known/genid/c8e0b8b6e1bde2aaa1819fd2d1daf2fb#529
definition: This category includes concepts related to political systems, laws, rules or cultural mores governing societal or community behavior, or doctrinal, faith or religious bases or entities (such as gods, angels, totems) governing spiritual human matters. Culture, Issues, beliefs and various activisms (most -isms) are included

relates to audio information
property disjoint with: has workplace
property disjoint with: relates to society
property disjoint with: relates to facility
property disjoint with: relates to drug
property disjoint with: has organization type
property disjoint with: relates to finance or economy
property disjoint with: relates to plant
property disjoint with: relates to geopolitical entity
property disjoint with: relates to natural substance
sub property of: topObjectProperty
property disjoint with: relates to extraterrestrial entity
property disjoint with: has activity
property disjoint with: relates to numbers
property disjoint with: relates to chemistry
property disjoint with: has food drink
property disjoint with: has person type
type: ObjectProperty
property disjoint with: relates to natural phenomenon
property disjoint with: relates to earthscape
property disjoint with: relates to disease
property disjoint with: bottomObjectProperty
property disjoint with: relates to structured information
property disjoint with: has time
property disjoint with: relates to other organism
property disjoint with: relates to animal
domain: Thing
range: audio information
definition: This predicate relates an external entity to the SuperType (ST) shown. It indicates there is a relationship to the ST of a verifiable nature, but which is undetermined as to strength or a full rdf:type relationship

notations
subclass of: http://lodlaundromat.org/.well-known/genid/c8e0b8b6e1bde2aaa1819fd2d1daf2fb#396
subclass of: http://lodlaundromat.org/.well-known/genid/c8e0b8b6e1bde2aaa1819fd2d1daf2fb#64
disjoint with: protists fungus
disjoint with: Extraterrestrial
subclass of: http://lodlaundromat.org/.well-known/genid/c8e0b8b6e1bde2aaa1819fd2d1daf2fb#352
disjoint with: organizations
subclass of: http://lodlaundromat.org/.well-known/genid/c8e0b8b6e1bde2aaa1819fd2d1daf2fb#110
disjoint with: facilities
disjoint with: society
disjoint with: earthscape
type: Class
disjoint with: natural phenomena
disjoint with: person types
disjoint with: geopolitical
disjoint with: prokaryotes
subclass of: http://lodlaundromat.org/.well-known/genid/c8e0b8b6e1bde2aaa1819fd2d1daf2fb#86
subclass of: http://lodlaundromat.org/.well-known/genid/c8e0b8b6e1bde2aaa1819fd2d1daf2fb#529
disjoint with: plants
subclass of: http://lodlaundromat.org/.well-known/genid/c8e0b8b6e1bde2aaa1819fd2d1daf2fb#190
subclass of: http://lodlaundromat.org/.well-known/genid/c8e0b8b6e1bde2aaa1819fd2d1daf2fb#166
disjoint with: http://lodlaundromat.org/.well-known/genid/c8e0b8b6e1bde2aaa1819fd2d1daf2fb#306
subclass of: Thing
subclass of: http://lodlaundromat.org/.well-known/genid/c8e0b8b6e1bde2aaa1819fd2d1daf2fb#247
disjoint with: food or drink
disjoint with: chemistry
disjoint with: animals
subclass of: http://lodlaundromat.org/.well-known/genid/c8e0b8b6e1bde2aaa1819fd2d1daf2fb#227
subclass of: http://lodlaundromat.org/.well-known/genid/c8e0b8b6e1bde2aaa1819fd2d1daf2fb#19
subclass of: http://lodlaundromat.org/.well-known/genid/c8e0b8b6e1bde2aaa1819fd2d1daf2fb#133
subclass of: SuperType
disjoint with: drugs
subclass of: http://lodlaundromat.org/.well-known/genid/c8e0b8b6e1bde2aaa1819fd2d1daf2fb#487
disjoint with: time
disjoint with: workplaces
subclass of: http://lodlaundromat.org/.well-known/genid/c8e0b8b6e1bde2aaa1819fd2d1daf2fb#289
disjoint with: http://lodlaundromat.org/.well-known/genid/c8e0b8b6e1bde2aaa1819fd2d1daf2fb#1
subclass of: http://lodlaundromat.org/.well-known/genid/c8e0b8b6e1bde2aaa1819fd2d1daf2fb#574
subclass of: http://lodlaundromat.org/.well-known/genid/c8e0b8b6e1bde2aaa1819fd2d1daf2fb#373
disjoint with: diseases
subclass of: http://lodlaundromat.org/.well-known/genid/c8e0b8b6e1bde2aaa1819fd2d1daf2fb#460
subclass of: http://lodlaundromat.org/.well-known/genid/c8e0b8b6e1bde2aaa1819fd2d1daf2fb#433
subclass of: http://lodlaundromat.org/.well-known/genid/c8e0b8b6e1bde2aaa1819fd2d1daf2fb#269
disjoint with: Nothing
disjoint with: natural substance
definition: Akin to conceptual works, these are codified means of human expression. Examples range from human languages themselves, to more domain-specific cases such as chemical symbols, genetic code (A-G-C-T), protocols, and computer languages, mathematical and set notations, etc. Identifiers (numeric or alphanumeric identifiers for objects, often in a highly patterned way, such as phone numbers, URLs, zip and postal codes, SKUs, product codes, etc.), Units (any of the various ways in which measurement, space, volume, weight, speed, intensity, temperature, calories, siesmic intensity or other quantitative descriptions of phenomena can be made) and key reference types are also included in this SuperType

relates to animal
sub property of: topObjectProperty
property disjoint with: relates to visual information
property disjoint with: relates to finance or economy
property disjoint with: relates to extraterrestrial entity
property disjoint with: has notation
property disjoint with: relates to numbers
property disjoint with: has workplace
property disjoint with: bottomObjectProperty
type: ObjectProperty
property disjoint with: relates to audio information
property disjoint with: relates to geopolitical entity
property disjoint with: has time
property disjoint with: relates to facility
property disjoint with: relates to plant
property disjoint with: relates to earthscape
property disjoint with: relates to natural phenomenon
property disjoint with: relates to other organism
property disjoint with: relates to drug
property disjoint with: relates to natural substance
property disjoint with: relates to structured information
domain: Thing
range: animals
definition: This predicate relates an external entity to the SuperType (ST) shown. It indicates there is a relationship to the ST of a verifiable nature, but which is undetermined as to strength or a full rdf:type relationship

External - OpenCyc Mapping
type: qualifier
type: Thing
type: NamedIndividual
definition: Mapping based on existing OpenCyc assertion.

organizations
subclass of: http://lodlaundromat.org/.well-known/genid/c8e0b8b6e1bde2aaa1819fd2d1daf2fb#4
subclass of: http://lodlaundromat.org/.well-known/genid/c8e0b8b6e1bde2aaa1819fd2d1daf2fb#227
subclass of: http://lodlaundromat.org/.well-known/genid/c8e0b8b6e1bde2aaa1819fd2d1daf2fb#154
disjoint with: http://lodlaundromat.org/.well-known/genid/c8e0b8b6e1bde2aaa1819fd2d1daf2fb#1
disjoint with: Nothing
disjoint with: chemistry
subclass of: http://lodlaundromat.org/.well-known/genid/c8e0b8b6e1bde2aaa1819fd2d1daf2fb#166
disjoint with: http://lodlaundromat.org/.well-known/genid/c8e0b8b6e1bde2aaa1819fd2d1daf2fb#352
subclass of: http://lodlaundromat.org/.well-known/genid/c8e0b8b6e1bde2aaa1819fd2d1daf2fb#422
disjoint with: notations
disjoint with: natural substance
disjoint with: drugs
subclass of: http://lodlaundromat.org/.well-known/genid/c8e0b8b6e1bde2aaa1819fd2d1daf2fb#289
subclass of: http://lodlaundromat.org/.well-known/genid/c8e0b8b6e1bde2aaa1819fd2d1daf2fb#396
subclass of: http://lodlaundromat.org/.well-known/genid/c8e0b8b6e1bde2aaa1819fd2d1daf2fb#460
subclass of: http://lodlaundromat.org/.well-known/genid/c8e0b8b6e1bde2aaa1819fd2d1daf2fb#269
subclass of: http://lodlaundromat.org/.well-known/genid/c8e0b8b6e1bde2aaa1819fd2d1daf2fb#529
subclass of: SuperType
disjoint with: plants
disjoint with: prokaryotes
subclass of: http://lodlaundromat.org/.well-known/genid/c8e0b8b6e1bde2aaa1819fd2d1daf2fb#556
disjoint with: protists fungus
subclass of: Thing
disjoint with: natural phenomena
disjoint with: written information
disjoint with: products
type: Class
subclass of: http://lodlaundromat.org/.well-known/genid/c8e0b8b6e1bde2aaa1819fd2d1daf2fb#86
disjoint with: visual information
subclass of: http://lodlaundromat.org/.well-known/genid/c8e0b8b6e1bde2aaa1819fd2d1daf2fb#597
disjoint with: structured information
subclass of: http://lodlaundromat.org/.well-known/genid/c8e0b8b6e1bde2aaa1819fd2d1daf2fb#110
disjoint with: time
subclass of: http://lodlaundromat.org/.well-known/genid/c8e0b8b6e1bde2aaa1819fd2d1daf2fb#510
subclass of: http://lodlaundromat.org/.well-known/genid/c8e0b8b6e1bde2aaa1819fd2d1daf2fb#325
disjoint with: audio information
subclass of: http://lodlaundromat.org/.well-known/genid/c8e0b8b6e1bde2aaa1819fd2d1daf2fb#64
disjoint with: events
disjoint with: diseases
disjoint with: food or drink
disjoint with: numbers
subclass of: http://lodlaundromat.org/.well-known/genid/c8e0b8b6e1bde2aaa1819fd2d1daf2fb#306
disjoint with: Extraterrestrial
disjoint with: activities
subclass of: http://lodlaundromat.org/.well-known/genid/c8e0b8b6e1bde2aaa1819fd2d1daf2fb#433
subclass of: http://lodlaundromat.org/.well-known/genid/c8e0b8b6e1bde2aaa1819fd2d1daf2fb#39
definition: Organization is a broad SuperType and includes formal collections of humans, sometimes by legal means, charter, agreement or some mode of formal understanding. Examples include geoplotical entities such as nations, municipalities or countries; or companies, institutes, governments, universities, militaries, political parties, game groups, international organizations, trade associations, etc. All institutions, for example, are organizations. Also included are informal collections of humans. Informal or less defined groupings of humans may result from ethnicity or tribes or nationality or from shared interests (such as social networks or mailing lists) or expertise ("communities of practice"). This dimension also includes the notion of identifiable human groups with set members at any given point in time. Examples include music groups, cast members of a play, directors on a corporate Board, TV show members, gangs, mobs, juries, generations, minorities, etc. Finally, Organizations contain the concepts of Industries and Programs and Communities.

Automatic - Inspected S-Match
type: qualifier
type: Thing
type: NamedIndividual
definition: Mapping based on automatic scoring of concepts using S-Match, with specific alignment choice based on hand selection.

qualifier
disjoint with: Nothing
subclass of: Thing
type: Class
definition: The Qualifier class is a set of descriptions that indicate the method used in order to establish an isAbout relationship between an UMBEL reference concept (RC) and an external entity. This description should be complete enough to aid understanding of the nature and reliability of the "aboutness" assertion and to be usable for filtering or user interface information. The descriptions may be literal strings or may refer to literal numeric values resulting from an automated alignment technique.

has attribute
sub property of: topObjectProperty
property disjoint with: bottomObjectProperty
type: ObjectProperty
domain: Thing
range: attributes
definition: This predicate relates an external entity to the SuperType (ST) shown. It indicates there is a relationship to the ST of a verifiable nature, but which is undetermined as to strength or a full rdf:type relationship

has notation
property disjoint with: has organization type
property disjoint with: relates to other organism
property disjoint with: relates to facility
property disjoint with: relates to plant
property disjoint with: has person type
property disjoint with: relates to extraterrestrial entity
property disjoint with: relates to drug
property disjoint with: relates to earthscape
property disjoint with: has time
sub property of: topObjectProperty
property disjoint with: relates to society
property disjoint with: relates to animal
property disjoint with: has food drink
property disjoint with: has workplace
property disjoint with: relates to natural substance
property disjoint with: relates to natural phenomenon
property disjoint with: relates to disease
property disjoint with: relates to chemistry
property disjoint with: bottomObjectProperty
property disjoint with: relates to geopolitical entity
type: ObjectProperty
domain: Thing
range: notations
definition: This predicate relates an external entity to the SuperType (ST) shown. It indicates there is a relationship to the ST of a verifiable nature, but which is undetermined as to strength or a full rdf:type relationship

relates to earthscape
property disjoint with: relates to disease
property disjoint with: has event
property disjoint with: relates to other organism
property disjoint with: has food drink
property disjoint with: relates to chemistry
sub property of: topObjectProperty
property disjoint with: relates to animal
property disjoint with: relates to plant
property disjoint with: has activity
property disjoint with: relates to numbers
property disjoint with: relates to visual information
property disjoint with: relates to structured information
property disjoint with: bottomObjectProperty
property disjoint with: has notation
property disjoint with: has time
property disjoint with: relates to natural phenomenon
property disjoint with: has person type
property disjoint with: relates to drug
property disjoint with: relates to audio information
type: ObjectProperty
property disjoint with: relates to society
domain: Thing
range: earthscape
definition: This predicate relates an external entity to the SuperType (ST) shown. It indicates there is a relationship to the ST of a verifiable nature, but which is undetermined as to strength or a full rdf:type relationship.

has event
property disjoint with: has workplace
property disjoint with: has organization type
sub property of: topObjectProperty
property disjoint with: relates to other organism
property disjoint with: relates to natural substance
property disjoint with: relates to earthscape
property disjoint with: relates to numbers
property disjoint with: relates to facility
type: ObjectProperty
property disjoint with: relates to plant
property disjoint with: relates to geopolitical entity
property disjoint with: bottomObjectProperty
property disjoint with: relates to drug
domain: Thing
range: events
definition: This predicate relates an external entity to the SuperType (ST) shown. It indicates there is a relationship to the ST of a verifiable nature, but which is undetermined as to strength or a full rdf:type relationship

natural substance
subclass of: http://lodlaundromat.org/.well-known/genid/c8e0b8b6e1bde2aaa1819fd2d1daf2fb#597
subclass of: http://lodlaundromat.org/.well-known/genid/c8e0b8b6e1bde2aaa1819fd2d1daf2fb#460
subclass of: http://lodlaundromat.org/.well-known/genid/c8e0b8b6e1bde2aaa1819fd2d1daf2fb#487
disjoint with: events
subclass of: http://lodlaundromat.org/.well-known/genid/c8e0b8b6e1bde2aaa1819fd2d1daf2fb#154
subclass of: http://lodlaundromat.org/.well-known/genid/c8e0b8b6e1bde2aaa1819fd2d1daf2fb#352
disjoint with: visual information
disjoint with: time
subclass of: http://lodlaundromat.org/.well-known/genid/c8e0b8b6e1bde2aaa1819fd2d1daf2fb#306
subclass of: http://lodlaundromat.org/.well-known/genid/c8e0b8b6e1bde2aaa1819fd2d1daf2fb#19
disjoint with: protists fungus
disjoint with: http://lodlaundromat.org/.well-known/genid/c8e0b8b6e1bde2aaa1819fd2d1daf2fb#1
disjoint with: society
disjoint with: organizations
disjoint with: activities
disjoint with: numbers
disjoint with: notations
subclass of: http://lodlaundromat.org/.well-known/genid/c8e0b8b6e1bde2aaa1819fd2d1daf2fb#433
disjoint with: workplaces
disjoint with: animals
disjoint with: prokaryotes
subclass of: Thing
disjoint with: written information
subclass of: SuperType
disjoint with: person types
subclass of: http://lodlaundromat.org/.well-known/genid/c8e0b8b6e1bde2aaa1819fd2d1daf2fb#373
subclass of: http://lodlaundromat.org/.well-known/genid/c8e0b8b6e1bde2aaa1819fd2d1daf2fb#325
subclass of: http://lodlaundromat.org/.well-known/genid/c8e0b8b6e1bde2aaa1819fd2d1daf2fb#556
subclass of: http://lodlaundromat.org/.well-known/genid/c8e0b8b6e1bde2aaa1819fd2d1daf2fb#574
disjoint with: audio information
subclass of: http://lodlaundromat.org/.well-known/genid/c8e0b8b6e1bde2aaa1819fd2d1daf2fb#39
disjoint with: http://lodlaundromat.org/.well-known/genid/c8e0b8b6e1bde2aaa1819fd2d1daf2fb#289
type: Class
subclass of: http://lodlaundromat.org/.well-known/genid/c8e0b8b6e1bde2aaa1819fd2d1daf2fb#529
disjoint with: diseases
disjoint with: plants
disjoint with: Nothing
subclass of: http://lodlaundromat.org/.well-known/genid/c8e0b8b6e1bde2aaa1819fd2d1daf2fb#4
subclass of: http://lodlaundromat.org/.well-known/genid/c8e0b8b6e1bde2aaa1819fd2d1daf2fb#396
definition: Notable inclusions are minerals, compounds, chemicals, or physical objects that are not the outcome of purposeful human effort, but are found naturally occurring. Other natural objects (such as rock, fossil, etc.) are also found under this SuperType. Natural Substances include subatomic particles. The contrast is with Earthscape, which covers natural "features" or living substances, which are covered under the appropriate SuperTypes. Chemicals can be Natural Substances, but only if they are naturally occurring, such as limestone or salt.

earthscape
disjoint with: food or drink
disjoint with: written information
subclass of: http://lodlaundromat.org/.well-known/genid/c8e0b8b6e1bde2aaa1819fd2d1daf2fb#39
subclass of: http://lodlaundromat.org/.well-known/genid/c8e0b8b6e1bde2aaa1819fd2d1daf2fb#4
subclass of: http://lodlaundromat.org/.well-known/genid/c8e0b8b6e1bde2aaa1819fd2d1daf2fb#306
disjoint with: structured information
subclass of: http://lodlaundromat.org/.well-known/genid/c8e0b8b6e1bde2aaa1819fd2d1daf2fb#154
disjoint with: person types
disjoint with: visual information
subclass of: http://lodlaundromat.org/.well-known/genid/c8e0b8b6e1bde2aaa1819fd2d1daf2fb#64
disjoint with: animals
disjoint with: http://lodlaundromat.org/.well-known/genid/c8e0b8b6e1bde2aaa1819fd2d1daf2fb#133
subclass of: http://lodlaundromat.org/.well-known/genid/c8e0b8b6e1bde2aaa1819fd2d1daf2fb#373
disjoint with: natural phenomena
subclass of: http://lodlaundromat.org/.well-known/genid/c8e0b8b6e1bde2aaa1819fd2d1daf2fb#556
disjoint with: prokaryotes
disjoint with: audio information
disjoint with: drugs
subclass of: http://lodlaundromat.org/.well-known/genid/c8e0b8b6e1bde2aaa1819fd2d1daf2fb#269
subclass of: http://lodlaundromat.org/.well-known/genid/c8e0b8b6e1bde2aaa1819fd2d1daf2fb#396
disjoint with: time
subclass of: http://lodlaundromat.org/.well-known/genid/c8e0b8b6e1bde2aaa1819fd2d1daf2fb#487
subclass of: http://lodlaundromat.org/.well-known/genid/c8e0b8b6e1bde2aaa1819fd2d1daf2fb#597
subclass of: http://lodlaundromat.org/.well-known/genid/c8e0b8b6e1bde2aaa1819fd2d1daf2fb#110
subclass of: http://lodlaundromat.org/.well-known/genid/c8e0b8b6e1bde2aaa1819fd2d1daf2fb#325
disjoint with: notations
disjoint with: plants
disjoint with: events
disjoint with: chemistry
subclass of: http://lodlaundromat.org/.well-known/genid/c8e0b8b6e1bde2aaa1819fd2d1daf2fb#460
subclass of: http://lodlaundromat.org/.well-known/genid/c8e0b8b6e1bde2aaa1819fd2d1daf2fb#86
disjoint with: Nothing
subclass of: http://lodlaundromat.org/.well-known/genid/c8e0b8b6e1bde2aaa1819fd2d1daf2fb#19
disjoint with: activities
disjoint with: diseases
disjoint with: numbers
disjoint with: protists fungus
disjoint with: http://lodlaundromat.org/.well-known/genid/c8e0b8b6e1bde2aaa1819fd2d1daf2fb#1
subclass of: http://lodlaundromat.org/.well-known/genid/c8e0b8b6e1bde2aaa1819fd2d1daf2fb#433
subclass of: http://lodlaundromat.org/.well-known/genid/c8e0b8b6e1bde2aaa1819fd2d1daf2fb#510
subclass of: http://lodlaundromat.org/.well-known/genid/c8e0b8b6e1bde2aaa1819fd2d1daf2fb#227
subclass of: http://lodlaundromat.org/.well-known/genid/c8e0b8b6e1bde2aaa1819fd2d1daf2fb#529
subclass of: Thing
disjoint with: society
subclass of: SuperType
type: Class
definition: The Natural Feature SuperType is the collection of cartographic features that occur on the surface of the Earth. Positive examples include Mountain, Ocean, and Mesa. Artificial features such as canals are excluded. Most instances of these features have a fixed location in space. Underground and underwater are also explicitly contained. This SuperType is explicitly disjoint with Extraterrestrial (see below).

has time
property disjoint with: relates to numbers
property disjoint with: relates to other organism
property disjoint with: relates to structured information
property disjoint with: has person type
sub property of: topObjectProperty
property disjoint with: relates to finance or economy
property disjoint with: relates to plant
property disjoint with: has food drink
property disjoint with: relates to geopolitical entity
property disjoint with: has notation
property disjoint with: relates to animal
property disjoint with: relates to extraterrestrial entity
property disjoint with: relates to drug
property disjoint with: relates to disease
property disjoint with: has organization type
property disjoint with: relates to society
property disjoint with: relates to earthscape
property disjoint with: relates to facility
property disjoint with: has product type
property disjoint with: relates to natural substance
property disjoint with: bottomObjectProperty
type: ObjectProperty
property disjoint with: relates to chemistry
property disjoint with: relates to natural phenomenon
property disjoint with: has workplace
property disjoint with: relates to visual information
property disjoint with: relates to audio information
domain: Thing
range: time
definition: This predicate relates an external entity to the SuperType (ST) shown. It indicates there is a relationship to the ST of a verifiable nature, but which is undetermined as to strength or a full rdf:type relationship

relates to written information
sub property of: topObjectProperty
property disjoint with: bottomObjectProperty
type: ObjectProperty
domain: Thing
definition: This predicate relates an external entity to the SuperType (ST) shown. It indicates there is a relationship to the ST of a verifiable nature, but which is undetermined as to strength or a full rdf:type relationship.

relates to natural phenomenon
property disjoint with: relates to animal
property disjoint with: has person type
property disjoint with: relates to drug
property disjoint with: relates to geopolitical entity
property disjoint with: relates to society
property disjoint with: relates to finance or economy
property disjoint with: has food drink
property disjoint with: relates to other organism
property disjoint with: relates to plant
property disjoint with: has time
sub property of: topObjectProperty
property disjoint with: has notation
property disjoint with: relates to disease
property disjoint with: bottomObjectProperty
type: ObjectProperty
property disjoint with: has workplace
property disjoint with: has organization type
property disjoint with: relates to audio information
property disjoint with: relates to numbers
property disjoint with: has product type
property disjoint with: relates to earthscape
domain: Thing
range: natural phenomena
definition: This predicate relates an external entity to the SuperType (ST) shown. It indicates there is a relationship to the ST of a verifiable nature, but which is undetermined as to strength or a full rdf:type relationship.

has abstraction
sub property of: topObjectProperty
property disjoint with: bottomObjectProperty
type: ObjectProperty
domain: Thing
range: abstract level
definition: This predicate relates an external entity to the SuperType (ST) shown. It indicates there is a relationship to the ST of a verifiable nature, but which is undetermined as to strength or a full rdf:type relationship

relates to other organism
property disjoint with: relates to audio information
property disjoint with: relates to extraterrestrial entity
type: ObjectProperty
property disjoint with: relates to structured information
property disjoint with: relates to finance or economy
property disjoint with: relates to chemistry
property disjoint with: relates to plant
property disjoint with: has time
sub property of: topObjectProperty
property disjoint with: relates to natural phenomenon
property disjoint with: has event
property disjoint with: relates to numbers
property disjoint with: relates to natural substance
property disjoint with: has workplace
property disjoint with: relates to disease
property disjoint with: has activity
property disjoint with: has product type
property disjoint with: relates to facility
property disjoint with: relates to society
property disjoint with: has notation
property disjoint with: has organization type
property disjoint with: relates to earthscape
property disjoint with: bottomObjectProperty
property disjoint with: relates to animal
property disjoint with: relates to geopolitical entity
property disjoint with: relates to visual information
property disjoint with: has person type
domain: Thing
range: http://lodlaundromat.org/.well-known/genid/c8e0b8b6e1bde2aaa1819fd2d1daf2fb#1
definition: This predicate relates an external entity to the SuperType (ST) shown. It indicates there is a relationship to the ST of a verifiable nature, but which is undetermined as to strength or a full rdf:type relationship.

relates to geopolitical entity
property disjoint with: relates to chemistry
property disjoint with: relates to disease
property disjoint with: relates to other organism
property disjoint with: has event
property disjoint with: relates to visual information
type: ObjectProperty
property disjoint with: relates to animal
property disjoint with: relates to audio information
property disjoint with: has notation
property disjoint with: has activity
property disjoint with: relates to extraterrestrial entity
property disjoint with: has food drink
sub property of: topObjectProperty
property disjoint with: relates to natural phenomenon
property disjoint with: relates to drug
property disjoint with: has person type
property disjoint with: relates to plant
property disjoint with: relates to numbers
property disjoint with: relates to structured information
property disjoint with: relates to society
property disjoint with: bottomObjectProperty
property disjoint with: has time
domain: Thing
range: geopolitical
definition: This predicate relates an external entity to the SuperType (ST) shown. It indicates there is a relationship to the ST of a verifiable nature, but which is undetermined as to strength or a full rdf:type relationship.

relates to natural substance
property disjoint with: relates to society
property disjoint with: relates to disease
property disjoint with: has organization type
property disjoint with: relates to other organism
property disjoint with: relates to animal
sub property of: topObjectProperty
property disjoint with: has notation
property disjoint with: relates to plant
property disjoint with: relates to visual information
property disjoint with: has event
property disjoint with: has person type
property disjoint with: relates to numbers
property disjoint with: bottomObjectProperty
property disjoint with: has time
type: ObjectProperty
property disjoint with: has activity
property disjoint with: relates to audio information
property disjoint with: has workplace
domain: Thing
range: natural substance
definition: This predicate relates an external entity to the SuperType (ST) shown. It indicates there is a relationship to the ST of a verifiable nature, but which is undetermined as to strength or a full rdf:type relationship.

links entity
sub property of: topObjectProperty
property disjoint with: bottomObjectProperty
inverse of: is about
type: ObjectProperty
domain: reference concept
range: Thing
definition: Check the definition of umbel:isAbout for the definition of this property; isRelatedTo is the inverse property of isAbout.

External - GeoNames Mapping
type: qualifier
type: Thing
type: NamedIndividual
definition: Mapping based on existing GeoNames assertion.

is like
sub property of: topObjectProperty
property disjoint with: bottomObjectProperty
type: SymmetricProperty
type: ObjectProperty
domain: Thing
range: Thing
definition: The property umbel:isLike is used to assert an associative link between similar individuals who may or may not be identical, but are believed to be so. This property is not intended as a general expression of similarity, but rather the likely but uncertain same identity of the two resources being related. This property can and should be changed if the certainty of the sameness of identity is subsequently determined. In general, we may not be able to assert that two individuals are the same based solely on current information on hand. However, there may be quite reasonable bases or methods that the two individuals are likely the same without being one hundred percent sure. umbel:isLike has the semantics of likely identity, but where there is some uncertainty that the two resources indeed refer to the exact same individual with the same identity. Such uncertainty can arise when, for example, common names may be used for different individuals (e.g., John Smith). It is appropriate to use this property when there is strong belief the two resources refer to the same individual with the same identity, but that association can not be asserted at the present time with certitude.

relates to plant
property disjoint with: has time
type: ObjectProperty
property disjoint with: relates to geopolitical entity
property disjoint with: bottomObjectProperty
property disjoint with: relates to natural substance
property disjoint with: relates to numbers
property disjoint with: relates to structured information
property disjoint with: relates to other organism
property disjoint with: has notation
property disjoint with: relates to finance or economy
property disjoint with: relates to facility
property disjoint with: relates to visual information
property disjoint with: relates to chemistry
property disjoint with: has event
property disjoint with: has activity
property disjoint with: relates to society
property disjoint with: relates to natural phenomenon
sub property of: topObjectProperty
property disjoint with: relates to extraterrestrial entity
property disjoint with: has workplace
property disjoint with: relates to disease
property disjoint with: relates to animal
property disjoint with: has organization type
property disjoint with: relates to earthscape
property disjoint with: relates to audio information
property disjoint with: has person type
domain: Thing
range: plants
definition: This predicate relates an external entity to the SuperType (ST) shown. It indicates there is a relationship to the ST of a verifiable nature, but which is undetermined as to strength or a full rdf:type relationship.

relates to society
property disjoint with: relates to extraterrestrial entity
property disjoint with: relates to numbers
property disjoint with: relates to natural substance
property disjoint with: relates to chemistry
property disjoint with: relates to visual information
property disjoint with: has product type
property disjoint with: relates to audio information
property disjoint with: has workplace
property disjoint with: relates to disease
property disjoint with: relates to other organism
property disjoint with: relates to natural phenomenon
property disjoint with: has food drink
property disjoint with: relates to finance or economy
property disjoint with: relates to drug
property disjoint with: has notation
type: ObjectProperty
property disjoint with: relates to structured information
property disjoint with: has time
property disjoint with: relates to facility
property disjoint with: bottomObjectProperty
property disjoint with: relates to plant
sub property of: topObjectProperty
property disjoint with: relates to geopolitical entity
property disjoint with: relates to earthscape
domain: Thing
range: society
definition: This predicate relates an external entity to the SuperType (ST) shown. It indicates there is a relationship to the ST of a verifiable nature, but which is undetermined as to strength or a full rdf:type relationship.

has characteristic
type: AnnotationProperty
definition: The property umbel:hasCharacteristic is used to assert the relation between a Reference Concept and external properties that may be used in external ontologies to characterize, describe, or provide attributes for data records associated with that concept. It is via this property or its inverse, umbel:isCharacteristicOf, that external data characterizations may be incorporated and modeled within a domain ontology based on the UMBEL vocabulary.

Upper Mapping and Binding Exchange Layer (UMBEL) Vocabulary
creator: Ontotext AD
creator: Structured Dynamics LLC
preferred namespace prefix: umbel
preferred namespace uri: http://umbel.org/umbel#
type: Ontology
imports: skos-owl1-dl.rdf
version IRI: v101#
definition: UMBEL (Upper Mapping and Binding Exchange Layer) vocabulary provides a general vocabulary (the UMBEL "vocabulary") of classes and predicates for describing domain ontologies, with the specific aim of promoting interoperability with external datasets and domains.

is characteristic of
type: AnnotationProperty
definition: The property umbel:isCharacteristicOf is used to assert the relation between a property and a Reference Concept (or its punned individual) to which it applies. Such properties may be used in external ontologies to characterize, describe, or provide attributes for data records associated with that concept. It is via this property or its inverse, umbel:hasCharacteristic, that external data characterizations may be incorporated and modeled within a domain ontology based on the UMBEL vocabulary.