feature of interest
sub property of: constraint
sub property of: related
type: ObjectProperty
sub property of: topObjectProperty
property disjoint with: bottomObjectProperty
sub property of: featureOfInterest
type: Thing
comment: In an observable property definition, the feature-of-interest constrains the feature realm that the property is associated with.
domain: Property kind

object of interest
type: Thing
sub property of: related
sub property of: constraint
sub property of: topObjectProperty
property disjoint with: bottomObjectProperty
type: ObjectProperty
comment: In an observable property definition, the object-of-interest constrains the substance or taxon involved in a count, concentration, presence, or other simialr property.
domain: Property kind
range: Substance or Taxon

CAS Number
sub property of: notation
sub property of: topDataProperty
property disjoint with: bottomDataProperty
type: DatatypeProperty
domain: Substance or Taxon
range: CAS Number

CAS Number
disjoint with: Nothing
subclass of: Resource
subclass of: Thing
type: Class
type: Datatype
equivalent class: http://lodlaundromat.org/.well-known/genid/c3074a80b58a81f7205d2d00d1cf1112#9

constraint
type: Thing
sub property of: related
sub property of: topObjectProperty
property disjoint with: bottomObjectProperty
type: ObjectProperty
comment: Constraint that refines the definition of an abservable property definition. This may include concerns such as realm of application, substance or taxon involved, applicable units or vocabulary.
domain: Property kind

Substance or Taxon
type: Thing
disjoint with: Nothing
subclass of: Concept
subclass of: Thing
subclass of: EnumeratedValue
type: Class
comment: Class of stuff and things, individuals of which identify a class of stuff and things that make observed properties concrete.

applicable vocabulary
type: Thing
sub property of: topObjectProperty
property disjoint with: bottomObjectProperty
type: ObjectProperty
comment: Set of terms or concepts from which the value must be drawn. This may be implemented as a skos:ConceptScheme or skos:Collection Compare with QUDT2 'applicable unit'
domain: Quality Kind

procedure
sub property of: procedure
sub property of: topObjectProperty
property disjoint with: bottomObjectProperty
type: ObjectProperty
type: Thing
sub property of: constraint
sub property of: related
comment: link to procedure or sensor system used in making observation or estimate of property value
domain: Property kind

Scaled Quantity Kind
subclass of: Thing
type: Thing
disjoint with: Quality Kind
disjoint with: Nothing
subclass of: EnumeratedValue
type: Class
subclass of: Property kind
subclass of: QuantityKind
subclass of: Concept
equivalent class: QuantityKind
comment: Scaled quantity kind has one or more unit properties, which indicate valid units of measure for this quantity kind. It is likely that this class is equivalent to qudt:QuantityKind, but has been declared independently for governance of the attached qudt:unit property
subclass of: http://lodlaundromat.org/.well-known/genid/c3074a80b58a81f7205d2d00d1cf1112#7
subclass of: http://lodlaundromat.org/.well-known/genid/c3074a80b58a81f7205d2d00d1cf1112#8

substance
type: Thing
subclass of: EnumeratedValue
subclass of: Substance or Taxon
subclass of: Thing
subclass of: Concept
type: Class
disjoint with: Nothing

Property kind
type: Thing
disjoint with: Nothing
subclass of: Concept
subclass of: Thing
subclass of: EnumeratedValue
type: Class
subclass of: http://lodlaundromat.org/.well-known/genid/c3074a80b58a81f7205d2d00d1cf1112#2
subclass of: http://lodlaundromat.org/.well-known/genid/c3074a80b58a81f7205d2d00d1cf1112#3
comment: Superclass of qudt:QuantityKind This class accommodates all kinds of properties, including those (qualities) that are not described by quantities (numeric values). May carry an objectOfInterest property, to point to the substance or taxon with which the property is associated - e.g. tree-height, organism-count, nitrogen-concentration
subclass of: http://lodlaundromat.org/.well-known/genid/c3074a80b58a81f7205d2d00d1cf1112#5
subclass of: http://lodlaundromat.org/.well-known/genid/c3074a80b58a81f7205d2d00d1cf1112#1
subclass of: http://lodlaundromat.org/.well-known/genid/c3074a80b58a81f7205d2d00d1cf1112#4

Observable properties
has part: Scaled Quantity Kind
license: http://creativecommons.org/licenses/by/3.0/
has part: Property kind
has part: procedure
type: Thing
preferred namespace prefix: op
creator: Simon J D Cox
type: Vocabulary
has part: object of interest
vocabulary: qudt
creator: Bruce A Simons
has part: constraint
publisher: CSIRO
has part: quality kind
has part: applicable vocabulary
modified: 2014-02-02
has part: Substance or Taxon
description: A general purpose ontology for observable properties. The ontology supports description of both qualitative and quantitative properties. The allowed scale or units of measure may be specified. A property may be linked to substances-or-taxa and to features or realms, if they play a role in the definition.
has part: Quality Kind
preferred namespace uri: http://environment.data.gov.au/def/op#
has part: matrix
creator: Jonathan Yu
extends: qudt
uri space: http://environment.data.gov.au/def/op#
created: 2013
rights: Copyright © 2012-2013 CSIRO
publisher: AGIMO
has part: feature of interest
has part: property kind
imports: core
imports: quantity
type: Ontology
imports: vann
imports: void
imports: voaf
comment: A general purpose ontology for observable properties. The ontology supports description of both qualitative and quantitative properties. The allowed scale or units of measure may be specified. A property may be linked to substances-or-taxa and to features or realms, if they play a role in the definition. This ontology was developed to enable publication of a vocabulary of water quality properties for the Bioregional Assessments and eReefs projects. This ontology extends the QUDT schema. Some key classes and properties are linked to SKOS, so that instances of an observable-property vocabulary are implicitly also SKOS concepts, and may be accessed through general purpose vocabulary APIs based on SKOS.
label: Observable-Properties ontology
imports: http://purl.org/dc/elements/1.1/

taxon
subclass of: EnumeratedValue
type: Thing
subclass of: Substance or Taxon
disjoint with: Nothing
subclass of: Thing
subclass of: Concept
type: Class

Quality Kind
disjoint with: Nothing
disjoint with: QuantityKind
subclass of: Concept
subclass of: EnumeratedValue
type: Class
subclass of: Thing
subclass of: Property kind
disjoint with: Scaled Quantity Kind
type: Thing
comment: non-numeric PropertyKind
subclass of: http://lodlaundromat.org/.well-known/genid/c3074a80b58a81f7205d2d00d1cf1112#6

matrix
sub property of: feature of interest
type: ObjectProperty
sub property of: constraint
sub property of: related
type: Thing
property disjoint with: bottomObjectProperty
sub property of: topObjectProperty
sub property of: featureOfInterest
comment: In an observable property definition, the matrix is a special case of a feature-of-interest that provides the context (container feeaure or medium) for an observable property.

property kind
type: Thing
sub property of: related
sub property of: topObjectProperty
sub property of: observedProperty
property disjoint with: bottomObjectProperty
type: ObjectProperty
range: Property kind

quality kind
property disjoint with: quantityKind
type: Thing
sub property of: topObjectProperty
sub property of: property kind
sub property of: observedProperty
property disjoint with: bottomObjectProperty
sub property of: related
type: ObjectProperty
range: Quality Kind

http://lodlaundromat.org/.well-known/genid/c3074a80b58a81f7205d2d00d1cf1112#4
type: Restriction
min cardinality: 0
on property: procedure

http://lodlaundromat.org/.well-known/genid/c3074a80b58a81f7205d2d00d1cf1112#10
pattern: [0-9]+\-[0-9]+\-[0-9]+

http://lodlaundromat.org/.well-known/genid/c3074a80b58a81f7205d2d00d1cf1112#2
type: Restriction
min cardinality: 0
on property: feature of interest

http://lodlaundromat.org/.well-known/genid/c3074a80b58a81f7205d2d00d1cf1112#7
type: Restriction
min cardinality: 1
on property: unit

http://lodlaundromat.org/.well-known/genid/c3074a80b58a81f7205d2d00d1cf1112#6
type: Restriction
min cardinality: 0
on property: applicable vocabulary

http://lodlaundromat.org/.well-known/genid/c3074a80b58a81f7205d2d00d1cf1112#5
type: Restriction
min cardinality: 0
on property: constraint