Asset
subclass of: Resource
type: Class
comment: The Asset resource

Artifact
subclass of: Resource
type: Class
comment: The Artifact fragment

state
type: Property
comment: Used to indicate the state of the asset based on values defined by the service provider. This specification does not define the resource for this property, however it should contain a dcterms:title property.
range: Asset
range: Resource

size
type: Property
comment: The size of the artifact media resource in bytes.
range: Artifact
range: Resource

relationshipType
type: Property
comment: The type of this relationship from the perspective of the oslc_asset:relatedAsset resource based on values defined by the service provider. This specification does not define the resource for this property, however it should contain a dcterms:title property.
range: Asset
range: Resource

version
type: Property
comment: The version of the asset. Possible values may include '1.0', '2.0', etc.
range: Asset
range: Resource

guid
type: Property
comment: An identifier for the asset. Assigned by the service provider when a resource is created. Different versions of the same asset will share the same identifier.
range: Asset
range: Resource

serialNumber
type: Property
comment: The serial number assigned by the asset manufacturer.
range: Asset
range: Resource

identifier
type: Property
comment: A unique identifier for a resource. Assigned by the service provider when a resource is created.
range: Asset
range: Resource

artifact
type: Property
comment: The multi valued list of artifacts.
range: Asset
range: Resource

model
type: Property
comment: The value of the asset model.
range: Asset
range: Resource

categorization
type: Property
comment: A categorization to classify an asset. The category schema values are defined by the service provider. This specification does not define the resource for this property, however it should contain a dcterms:title property.
range: Asset
range: Resource

The OSLC Asset Management(Asset) Vocabulary
description: All vocabulary URIs defined in the OSLC Asset Management (Asset) namespace.
type: Ontology
label: Asset Management(Asset)

artifactFactory
type: Property
comment: Resource URI used to post new artifacts to the asset.
range: Asset
range: Resource

tag
type: Property
comment: Specifies the asset tag value for an Asset. Asset tags are typically human readable labels. For hardware assets, these tags are durable, securely attached to equipment, and may also be readable by barcode and/or RFID.
range: Asset
range: Resource

content
type: Property
comment: The media resource reference URI (the artifact bytes).
range: Artifact
range: Resource

manufacturer
type: Property
comment: The name of the asset manufacturer.
range: Asset
range: Resource