Holds Leadership
sub property of: memberOf
sub property of: topObjectProperty
property disjoint with: bottomObjectProperty
inverse of: Holds Leadership
type: ObjectProperty
type: Property
comment: This property indicates that a person holds the leadership of a political party.
domain: Party Leader
range: Person

Leader of
sub property of: topObjectProperty
sub property of: headOf
property disjoint with: bottomObjectProperty
inverse of: Leader
type: ObjectProperty
type: Property
comment: Indicates that a Leader is the leader of a political party.
domain: Party Leader
range: Political party

Member of
sub property of: memberOf
sub property of: topObjectProperty
property disjoint with: bottomObjectProperty
inverse of: Member
type: ObjectProperty
type: Property
domain: Person
range: Political party

Held By
sub property of: topObjectProperty
property disjoint with: bottomObjectProperty
type: ObjectProperty
type: Property
comment: Indicates the person holding this seat in parliament.
domain: Seat
range: Person

Devolved administration
type: Thing
disjoint with: Nothing
subclass of: FormalOrganization
subclass of: Parliament
subclass of: Thing
type: Class
comment: Defines an administration to which independent law-making powers have been delegated. Example instances are The Scottish Parliament and The Welsh Assembly

Chamber
type: Thing
disjoint with: Nothing
subclass of: FormalOrganization
subclass of: Thing
type: Class
comment: Defines the chambers with instances like The House of Commons and The House of Lords.

Political party
disjoint with: Nothing
subclass of: FormalOrganization
subclass of: Thing
type: Class
comment: A Political party such as The Conservative Party or The Labour Party.

Member
sub property of: hasMember
sub property of: topObjectProperty
property disjoint with: bottomObjectProperty
inverse of: Member of
type: ObjectProperty
type: Property
comment: A member of this parliament.
domain: Parliament
range: Agent

Represents
editorial note: No range set on this though for the House of Commons it will be a <http://data.ordnancesurvey.co.uk/ontology/admingeo/WestminsterConstituency>.
type: Thing
sub property of: topObjectProperty
property disjoint with: bottomObjectProperty
type: ObjectProperty
type: Property
comment: The constituency that the MP holding this seat in parliament represents.
domain: Seat

Post
disjoint with: Nothing
subclass of: Organization
subclass of: Thing
type: Class

Member
sub property of: hasMember
sub property of: topObjectProperty
property disjoint with: bottomObjectProperty
inverse of: Member of
type: ObjectProperty
type: Property
comment: Indicates that a political party has a person as member.
domain: Political party
range: Person

Leader
sub property of: hasMember
sub property of: topObjectProperty
property disjoint with: bottomObjectProperty
inverse of: Leader of
type: ObjectProperty
type: Property
comment: Indicates the Leader of this political party.
domain: Political party
range: Party Leader

Parliament
note: Parliament of the United Kingdom
type: Thing
disjoint with: Nothing
subclass of: FormalOrganization
subclass of: Thing
type: Class
comment: Defines a parliament, the law-making assembly of a nation. Examples are Westminster, The Welsh Assembly, The Scottish Parliament and Northern Ireland Assembly.

Party Leader
type: Class
disjoint with: Nothing
subclass of: Thing
note: Party leader
subclass of: Post
type: Thing
subclass of: Organization
comment: Represents the leader of the political party

Parliament Ontology
vocabulary: core#
vocabulary: http://xmlns.com/foaf/0.1/
example resource: Party Leader
vocabulary: parliament
example resource: Parliament
example resource: Seat
type: Dataset
vocabulary: rdf-schema#
example resource: Chamber
created: 2010-06-17
vocabulary: org#
type: Thing
vocabulary: owl#
example resource: Devolved administration
type: Ontology

Seat
note: List of United Kingdom Parliament constituencies
type: Thing
subclass of: Organization
subclass of: Post
type: Class
subclass of: Thing
disjoint with: Nothing
comment: A seat in a Parliament

Holds Leadership
sub property of: memberOf
sub property of: topObjectProperty
property disjoint with: bottomObjectProperty
inverse of: Holds Leadership
type: ObjectProperty
type: Property
comment: This property indicates that a person holds the leadership of a political party.
domain: Person
range: Party Leader

devolves to
note: index.htm
type: Thing
sub property of: topObjectProperty
property disjoint with: bottomObjectProperty
inverse of: devolved from
type: ObjectProperty
range: Devolved administration
type: Property
comment: Links a Parliament to a Devolved Assembly to which has devolved powers.
domain: Parliament

devolved from
sub property of: topObjectProperty
property disjoint with: bottomObjectProperty
inverse of: devolves to
type: ObjectProperty
type: Property
comment: A property linking a Devolved Assembly to the Parliament from which it was devolved.
domain: Devolved administration
range: Parliament

Member of
sub property of: memberOf
sub property of: topObjectProperty
property disjoint with: bottomObjectProperty
inverse of: Member
type: ObjectProperty
type: Property
comment: The parliament this person or post is a member of.
domain: Agent
range: Parliament

Seat
sub property of: topObjectProperty
property disjoint with: bottomObjectProperty
type: ObjectProperty
type: Property
comment: Indicates the seat in parliament that this person holds.
domain: Person
range: Seat