Holds Leadership
range: Thing
domain: Thing
type: Property
type: ObjectProperty
comment: This property indicates that a person holds the leadership of a political party.
domain: Party Leader
range: Person
sub property of: memberOf
inverse of: Holds Leadership
domain: Post
domain: Resource
domain: Organization
range: Resource

Leader of
range: Thing
domain: Thing
type: Property
type: ObjectProperty
comment: Indicates that a Leader is the leader of a political party.
domain: Party Leader
range: Political party
sub property of: headOf
inverse of: Leader
domain: Post
domain: Resource
domain: Organization
range: Resource
range: FormalOrganization

Member of
range: Thing
domain: Thing
type: Property
type: ObjectProperty
domain: Person
range: Political party
sub property of: memberOf
inverse of: Member
domain: Resource
range: Resource
range: FormalOrganization

Held By
range: Thing
domain: Thing
type: Property
type: ObjectProperty
comment: Indicates the person holding this seat in parliament.
domain: Seat
range: Person
domain: Resource
domain: Post
domain: Organization
range: Resource

Devolved administration
subclass of: Resource
type: Class
comment: Defines an administration to which independent law-making powers have been delegated. Example instances are The Scottish Parliament and The Welsh Assembly
subclass of: Parliament

Chamber
subclass of: Resource
type: Class
comment: Defines the chambers with instances like The House of Commons and The House of Lords.
subclass of: FormalOrganization

Political party
subclass of: Resource
type: Class
comment: A Political party such as The Conservative Party or The Labour Party.
subclass of: FormalOrganization

Member
range: Thing
domain: Thing
domain: Parliament
type: Property
type: ObjectProperty
comment: A member of this parliament.
range: Agent
sub property of: hasMember
inverse of: Member of
domain: Resource
domain: FormalOrganization
range: Resource

Represents
range: Thing
domain: Thing
type: Property
type: ObjectProperty
comment: The constituency that the MP holding this seat in parliament represents.
domain: Seat
editorial note: No range set on this though for the House of Commons it will be a <http://data.ordnancesurvey.co.uk/ontology/admingeo/WestminsterConstituency>.
domain: Resource
domain: Post
domain: Organization
range: Resource

Post
subclass of: Resource
type: Class
subclass of: Organization

Member
range: Thing
domain: Thing
type: Property
type: ObjectProperty
comment: Indicates that a political party has a person as member.
domain: Political party
range: Person
sub property of: hasMember
inverse of: Member of
domain: Resource
domain: FormalOrganization
range: Resource

Leader
range: Thing
domain: Thing
type: Property
type: ObjectProperty
comment: Indicates the Leader of this political party.
domain: Political party
range: Party Leader
sub property of: hasMember
inverse of: Leader of
domain: Resource
domain: FormalOrganization
range: Resource
range: Post
range: Organization

Parliament
subclass of: Resource
type: Class
comment: Defines a parliament, the law-making assembly of a nation. Examples are Westminster, The Welsh Assembly, The Scottish Parliament and Northern Ireland Assembly.
subclass of: FormalOrganization
note: Parliament of the United Kingdom

Party Leader
subclass of: Resource
type: Class
comment: Represents the leader of the political party
subclass of: Post
note: Party leader

Seat
subclass of: Resource
type: Class
comment: A seat in a Parliament
subclass of: Post
note: List of United Kingdom Parliament constituencies

Holds Leadership
range: Thing
domain: Thing
type: Property
type: ObjectProperty
comment: This property indicates that a person holds the leadership of a political party.
domain: Person
range: Party Leader
sub property of: memberOf
inverse of: Holds Leadership
domain: Resource
range: Resource
range: Post
range: Organization

devolves to
range: Thing
domain: Thing
inverse of: devolved from
range: Devolved administration
type: Property
type: ObjectProperty
comment: Links a Parliament to a Devolved Assembly to which has devolved powers.
note: index.htm
domain: Parliament
domain: Resource
domain: FormalOrganization
range: Parliament
range: Resource
range: FormalOrganization

devolved from
range: Thing
domain: Thing
type: Property
type: ObjectProperty
comment: A property linking a Devolved Assembly to the Parliament from which it was devolved.
domain: Devolved administration
range: Parliament
inverse of: devolves to
domain: Parliament
domain: Resource
domain: FormalOrganization
range: Resource
range: FormalOrganization

Member of
range: Parliament
range: Thing
domain: Thing
type: Property
type: ObjectProperty
comment: The parliament this person or post is a member of.
domain: Agent
sub property of: memberOf
inverse of: Member
domain: Resource
range: Resource
range: FormalOrganization

Seat
range: Thing
domain: Thing
type: Property
type: ObjectProperty
comment: Indicates the seat in parliament that this person holds.
domain: Person
range: Seat
domain: Resource
range: Resource
range: Post
range: Organization

Parliament Ontology
vocabulary: core#
vocabulary: http://xmlns.com/foaf/0.1/
example resource: Party Leader
vocabulary: parliament
type: Ontology
example resource: Parliament
example resource: Seat
type: Dataset
vocabulary: rdf-schema#
example resource: Chamber
created: 2010-06-17
vocabulary: org#
vocabulary: owl#
example resource: Devolved administration