Update template
subclass of: Resource
constraint: http://lodlaundromat.org/.well-known/genid/9fb05f53ba0c66117a615cb1cd805aaa#4
type: Class
comment: A SPIN template that has an UPDATE command as its body.
subclass of: Template
query: http://lodlaundromat.org/.well-known/genid/9fb05f53ba0c66117a615cb1cd805aaa#4
command: http://lodlaundromat.org/.well-known/genid/9fb05f53ba0c66117a615cb1cd805aaa#4

Magic property
subclass of: Resource
type: Class
subclass of: Function
subclass of: Property

Rule
subclass of: Resource
type: Class
comment: Groups together the kinds of SPARQL commands that can appear as SPIN rules and constructors: CONSTRUCT, DELETE WHERE and DELETE/INSERT. This class is never to be instantiated directly.
subclass of: Command

Construct template
subclass of: Resource
constraint: http://lodlaundromat.org/.well-known/genid/9fb05f53ba0c66117a615cb1cd805aaa#2
type: Class
subclass of: Template
query: http://lodlaundromat.org/.well-known/genid/9fb05f53ba0c66117a615cb1cd805aaa#2
command: http://lodlaundromat.org/.well-known/genid/9fb05f53ba0c66117a615cb1cd805aaa#2

Constraint violation level
type: Class
comment: The type of the supported levels of constraint violations, including spin:Error and spin:Warning.
subclass of: Resource

Column
type: Class
comment: Provides metadata about a column in the result set of a (SPARQL) query, for example of the body queries of SPIN templates. Columns can define human-readable labels that serve as column titles, using rdfs:label.
subclass of: Resource

Modules
constructor: http://lodlaundromat.org/.well-known/genid/9fb05f53ba0c66117a615cb1cd805aaa#5
type: Class
comment: An "artificial" parent class for all Functions and Templates.
subclass of: Resource
command: http://lodlaundromat.org/.well-known/genid/9fb05f53ba0c66117a615cb1cd805aaa#5

Rule property
subclass of: Resource
type: Class
comment: The metaclass of spin:rule and its subproperties. spin:RuleProperties can have additional metadata attached to them.
subclass of: Property

Select template
subclass of: Resource
constraint: http://lodlaundromat.org/.well-known/genid/9fb05f53ba0c66117a615cb1cd805aaa#6
type: Class
comment: A SPIN template that wraps a SELECT query.
subclass of: Table data provider
subclass of: Template
query: http://lodlaundromat.org/.well-known/genid/9fb05f53ba0c66117a615cb1cd805aaa#6
command: http://lodlaundromat.org/.well-known/genid/9fb05f53ba0c66117a615cb1cd805aaa#6

Constraint violation
type: Class
comment: An object that can be created by spin:constraints to provide information about a constraint violation.
subclass of: Resource

Template
subclass of: Resource
constraint: http://lodlaundromat.org/.well-known/genid/9fb05f53ba0c66117a615cb1cd805aaa#7
type: Class
comment: The metaclass of SPIN templates. Templates are classes that are instances of this class. A template represents a reusable SPARQL query or update request that can be parameterized with arguments. Templates can be instantiated in places where normally a SPARQL query or update request is used, in particular as spin:rules and spin:constraints.
subclass of: Module
query: http://lodlaundromat.org/.well-known/genid/9fb05f53ba0c66117a615cb1cd805aaa#7
command: http://lodlaundromat.org/.well-known/genid/9fb05f53ba0c66117a615cb1cd805aaa#7

Library ontology
subclass of: Resource
type: Class
comment: A marker class that can be attached to base URIs (ontologies) to instruct SPIN engines that this ontology only contains a library of SPIN declarations. Library Ontologies should be ignored by SPIN inference engines even if they have been imported by a domain model. For example, a SPIN version of OWL RL may contain all the OWL RL axioms, attached to owl:Thing, but nothing else. However, when executed, these axioms should not be executed over themselves, because we don't want the system to reason about the SPIN triples to speed up things.
subclass of: Ontology

constraint
sub property of: command
type: Property
comment: Links a class with constraints on its instances. The values of this property are "axioms" expressed as CONSTRUCT or ASK queries where the variable ?this refers to the instances of the surrounding class. ASK queries must evaluate to false for each member of this class - returning true means that the instance ?this violates the constraint. CONSTRUCT queries must create instances of spin:ConstraintViolation to provide details on the reason for the violation.
domain: Class
sub property of: query
range: Command
range: Resource
range: Query
domain: Resource

Module
subclass of: Resource
type: Class
comment: An abstract building block of a SPARQL system. A Module can take Arguments as input and applies them on an input RDF Graph. The Arguments should be declared as spin:constraints.
subclass of: Class

Function
subclass of: Resource
constraint: http://lodlaundromat.org/.well-known/genid/9fb05f53ba0c66117a615cb1cd805aaa#1
type: Class
comment: Metaclass for functions that can be used in SPARQL expressions (e.g. FILTER or BIND). The function themselves are classes that are instances of this metaclass. Function calls are instances of the function classes, with property values for the arguments.
subclass of: Module
query: http://lodlaundromat.org/.well-known/genid/9fb05f53ba0c66117a615cb1cd805aaa#1
command: http://lodlaundromat.org/.well-known/genid/9fb05f53ba0c66117a615cb1cd805aaa#1

Ask template
subclass of: Resource
constraint: http://lodlaundromat.org/.well-known/genid/9fb05f53ba0c66117a615cb1cd805aaa#3
type: Class
comment: A SPIN template that wraps an ASK query.
subclass of: Template
query: http://lodlaundromat.org/.well-known/genid/9fb05f53ba0c66117a615cb1cd805aaa#3
command: http://lodlaundromat.org/.well-known/genid/9fb05f53ba0c66117a615cb1cd805aaa#3

Table data provider
subclass of: Resource
type: Class
comment: An abstraction of objects that can produce tabular data. This serves as a base class of spin:SelectTemplate, because SELECT queries can produce tables with columns for each result variable. However, other types of TableDataProviders are conceivable by other frameworks, and this class may prove as a useful shared foundation. TableDataProviders can link to definitions of columns via spin:column, and these definitions can inform rendering engines.
subclass of: Class

eval
type: Function
comment: Evaluates a given SPIN expression or SELECT or ASK query, and returns its result. The first argument must be the expression in SPIN RDF syntax. All other arguments must come in pairs: first a property name, and then a value. These name/value pairs will be pre-bound variables for the execution of the expression.
subclass of: Functions
type: Class
type: Module

ask
type: Function
comment: Executes a given ASK query and returns its boolean result. The first argument must point to an sp:Ask or a SPIN template call that has an ASK query as its body. All subsequent argument can come in pairs, with the first one being a variable name and the second its binding. Example: BIND (spin:ask(?query, "this", owl:Thing) AS ?result) . will execute the sp:Ask behind ?query with the variable ?this pre-bound to owl:Thing.
subclass of: Functions
type: Class
type: Module

violation value
type: Property
comment: An optional attribute of ConstraintViolations to point at a specific RDF node that caused the violation. Should be accessible from the root via the violationPath.
domain: Constraint violation
sub property of: system property
domain: Resource

symbol
type: Property
comment: The symbol of a function, e.g. "=" for the eq function.
domain: Function
range: string
sub property of: system property
domain: Class
domain: Resource
domain: Module
range: Resource

return type
type: Property
comment: The return type of a Function, e.g. xsd:string.
domain: Function
range: Class
sub property of: system property
domain: Class
domain: Resource
domain: Module
range: Resource

imports
type: OntologyProperty
comment: Can be used to link an RDF graph (usually the instance of owl:Ontology) with a SPIN library to define constraints. SPIN-aware tools should include the definitions from those libraries for constraint checking. Using such libraries is a simpler alternative than explicitly importing them using owl:imports, because it does not force all the SPIN triples into the RDF model.
domain: Ontology
range: Ontology
sub property of: system property
type: Property
domain: Resource
range: Resource

system property
type: Property
comment: An "abstract" base property that groups together those system properties that the user will hardly ever need to see in property trees. This property may be dropped in future versions of this ontology - right now it's mainly here for convenience.

fix
type: Property
comment: Can be used to link a ConstraintViolation with one or more UPDATE Templates that would help fix the violation.
domain: Constraint violation
range: Update template
sub property of: system property
domain: Resource
range: Class
range: Resource
range: Template
range: Module

violation source
type: Property
comment: Can be used to link a spin:ConstraintViolation with the query or template call that caused it. This property is typically filled in automatically by the constraint checking engine and does not need to be set manually. However, it can be useful to learn more about the origin of a violation.
domain: Constraint violation
range: Resource
sub property of: system property
domain: Resource

command
type: Property
comment: Can be used to link a resource with a SPARQL query or update request (sp:Command).
range: Command
range: Resource

Info
type: Constraint violation level
comment: Indicates that the associated constraint violation is a not a problem. This level can be used for diagnostic and debugging purposes.

arg4
var name: arg4
type: Variable

violation level
type: Property
comment: An optional attribute of ConstraintViolations to point at a violation level (such as Error and Warning). Defaults to spin:Error.
domain: Constraint violation
range: Constraint violation level
sub property of: system property
domain: Resource
range: Resource

column index
type: Property
comment: The index of a column (from left to right) starting at 0.
domain: Column
range: integer
sub property of: system property
domain: Resource
range: Resource
range: decimal

private
type: Property
comment: Can be set to true to indicate that a SPIN function or template is only meant to be used as a helper of other modules, but not directly. Among others, this allows user interfaces to filter out private modules. Furthermore, it tells potential users of this module that they should avoid using this module, as it may not be stable.
domain: Module
range: boolean
sub property of: system property
domain: Class
domain: Resource
range: Resource

http://lodlaundromat.org/.well-known/genid/9fb05f53ba0c66117a615cb1cd805aaa#4
max count: 1
min count: 0
predicate: body
value type: Update
type: Attribute
comment: The UPDATE command wrapped by this template.
type: Command
type: Query

construct
type: Magic property
comment: Evaluates a given sp:Construct or SPIN template call (first argument on the left hand side) and binds the resulting triples to the variables on the right hand side. Example: (?query "this" owl:Thing) spin:construct (?s ?p ?o) will execute the sp:Construct ?query using the binding of owl:Thing to ?this. The resulting triples will be bound to ?s, ?p and ?o. If any of ?s ?p ?o are bound, it will only return the matching triples.
subclass of: Magic properties
type: Property
type: Function
type: Class
type: Module

violation path
type: Property
comment: An optional attribute of ConstraintViolations to provide a path expression from the root resource to the value that is invalid. If this is a URI then the path represents the predicate of a subject/predicate combination. Otherwise it should be a blank node of type sp:Path.
domain: Constraint violation
range: Resource
sub property of: system property
domain: Resource

arg3
var name: arg3
type: Variable

Functions
abstract: true
type: Function
comment: An abstract base class for all defined functions. This class mainly serves as a shared root so that the various instances of the Function metaclass are grouped together.
subclass of: Modules
system property: true
type: Module
type: Class

rule property max iteration count
type: Property
comment: Can be attached to spin:rule (or subclasses thereof) to instruct a SPIN rules engine that it shall only execute the rules max times. If no value is specified, then the rules will be executed with no specific limit.
domain: Rule property
range: integer
sub property of: system property
domain: Resource
domain: Property
range: Resource
range: decimal

Select templates
abstract: true
type: Select template
comment: Suggested abstract base class for all SelectTemplates.
subclass of: Templates
system property: true
type: Module
type: Template
type: Table data provider
type: Class

http://lodlaundromat.org/.well-known/genid/9fb05f53ba0c66117a615cb1cd805aaa#3
max count: 1
min count: 0
predicate: body
value type: Ask
type: Attribute
comment: The ASK query wrapped by this template.
type: Command
type: Query

arg2
var name: arg2
type: Variable

Update templates
abstract: true
type: Update template
comment: Suggested abstract base class for all UpdateTemplates.
subclass of: Templates
system property: true
type: Module
type: Template
type: Class

next rule property
type: Property
comment: Can be used to link two sub-properties of spin:rule (or spin:rule itself) to instruct the SPIN engine to execute one set of rules before another one. The values of the subject property will be executed before those of the object property.
domain: Rule property
range: Rule property
sub property of: system property
domain: Resource
domain: Property
range: Resource
range: Property

Templates
abstract: true
type: Template
comment: Suggested abstract base class for all Templates.
subclass of: Modules
system property: true
type: Module
type: Class

this unbound
type: Property
comment: Can be set to true for SPIN rules and constraints that do not require pre-binding the variable ?this with all members of the associated class. This flag should only be set to true if the WHERE clause is sufficiently strong to only bind instances of the associated class, or its subclasses. In those cases, the engine can greatly improve performance of query execution, because it does not need to add clauses to narrow down the WHERE clause.
domain: Construct
range: boolean
sub property of: system property
domain: Resource
domain: Command
domain: Rule
range: Resource

http://lodlaundromat.org/.well-known/genid/9fb05f53ba0c66117a615cb1cd805aaa#2
max count: 1
min count: 0
predicate: body
value type: Construct
type: Attribute
comment: The CONSTRUCT query wrapped by this template.
type: Command
type: Query

Ask templates
abstract: true
type: Ask template
comment: Suggested abstract base class for all AskTemplates.
subclass of: Templates
system property: true
type: Module
type: Class
type: Template

_this
var name: this
type: Variable
comment: A system variable representing the current context instance in a rule or constraint.

arg1
var name: arg1
type: Variable

SPIN Modeling Vocabulary
type: Ontology
comment: An RDF Schema that can be used to attach constraints and rules to RDFS classes, and to encapsulate reusable SPARQL queries into functions and templates.
imports: sp
version info: 1.3.2

body
type: Property
comment: The body of a Function or Template. This points to a Query instance. For Functions, this is limited to either ASK or SELECT type queries. If the body is the ASK function then the return value is xsd:boolean. Otherwise, the SELECT query must have a single return variable. The first binding of this SELECT query will be returned as result of the function call.
range: Command
sub property of: system property
range: Resource

query
type: Property
comment: Can be used to point from any resource to a Query.
range: Query
sub property of: command
range: Command
range: Resource

column
type: Property
comment: Can link a TableDataProvider (esp. SelectTemplate) with one or more columns that provide metadata for rendering purposes. Columns can be sorted by their spin:columnIndex (which must align with the ordering of variables in the SELECT query starting with 0). Not all result variables of the underlying query need to have a matching spin:Column.
domain: Table data provider
range: Column
sub property of: system property
domain: Class
domain: Resource
range: Resource

violation root
type: Property
comment: The root resource of the violation (often ?this in the constraint body).
domain: Constraint violation
range: Resource
sub property of: system property
domain: Resource

Magic properties
abstract: true
type: Magic property
comment: An abstract superclass that can be used to group all spin:MagicProperty instances under a single parent class.
subclass of: Functions
sub property of: system property
system property: true
type: Module
type: Property
type: Function
type: Class

http://lodlaundromat.org/.well-known/genid/9fb05f53ba0c66117a615cb1cd805aaa#7
max count: 1
min count: 0
predicate: body
type: Attribute
comment: the body of the Template
type: Command
type: Query

Warning
type: Constraint violation level
comment: Indicates that the associated constraint violation is a problem that may not have to be fixed but may lead to issues in the future.

Construct templates
abstract: true
type: Construct template
comment: Suggested abstract base class for all ConstructTemplates.
subclass of: Templates
system property: true
type: Module
type: Template
type: Class

http://lodlaundromat.org/.well-known/genid/9fb05f53ba0c66117a615cb1cd805aaa#1
max count: 1
min count: 0
predicate: body
type: Attribute
comment: the body of the function
type: Command
type: Query

rule
type: Rule property
comment: An inferencing rule attached to a class. Rules are expressed as CONSTRUCT queries or INSERT/DELETE operations where the variable ?this will be bound to the current instance of the class. These inferences can be used to derive new values from existing values at the instance.
domain: Class
range: Rule
sub property of: command
type: Property
range: Command
range: Resource
domain: Resource

column width
type: Property
comment: The preferred width of the associated Column, for display purposes. Values in pixels (rendering engines may multiply the values depending on resolution).
domain: Column
range: integer
sub property of: system property
domain: Resource
range: Resource
range: decimal

Error
type: Constraint violation level
comment: Indicates that the associated constraint violation is an error that should be fixed.

http://lodlaundromat.org/.well-known/genid/9fb05f53ba0c66117a615cb1cd805aaa#6
max count: 1
min count: 0
predicate: body
value type: Select
type: Attribute
comment: The SELECT query wrapped by this template.
type: Command
type: Query

Fatal
type: Constraint violation level
comment: Indicates that the associated constraint violation is a severe error that must be fixed. Constraint checking engines may decide to stop further evaluation once a fatal error has been detected.

arg5
var name: arg5
type: Variable

abstract
type: Property
comment: Can be set to true to indicate that this module shall not be instantiated. Abstract modules are only there to organize other modules into hierarchies.
domain: Module
range: boolean
sub property of: system property
domain: Class
domain: Resource
range: Resource

column type
type: Property
comment: The datatype or resource type of a spin:Column. For example this is useful as metadata to inform a rendering engine that numeric columns (e.g. xsd:float) need to be right-aligned.
domain: Column
range: Class
sub property of: system property
domain: Resource
range: Resource

label template
type: Property
comment: A template string for displaying instantiations of a module in human-readable form. The template may contain the argument variable names in curly braces to support substitution. For example, "The number of values of the {?arg1} property."
domain: Template
range: string
sub property of: system property
domain: Class
domain: Resource
domain: Module
range: Resource

update
type: Property
comment: Can be used to point from any resource to an Update.
range: Update
sub property of: command
range: Command
range: Resource

select
type: Magic property
comment: Executes a given SELECT or ASK query (or a corresponding SPIN template call) and binds its result rows to the variables specified on the right hand side. May also pre-bind variables for the query execution, using name-value pairs on the left hand side. Example: (?query "this" owl:Thing) spin:select (?a ?b) will execute the sp:Select or sp:Ask that ?query points to and pre-bind ?this with the value of owl:Thing for the execution of the query. The first result variable of the query's result set will be bound to ?a, the second to ?b etc. If the nodes on the right are bound (or constants) then it will match with the values from the result set.
subclass of: Magic properties
type: Property
type: Function
type: Class
type: Module

cachable
type: Property
comment: Can be set to true to instruct the SPIN engine that it may cache the results of all calls to the associated function. Functions should only be marked as cachable if the same combination of input arguments always returns the same result. Functions that query a graph or other background data that may change over time should not be cached. Caching can significantly improve performance of frequently needed functions.
domain: Function
range: boolean
sub property of: system property
domain: Class
domain: Resource
domain: Module
range: Resource

constructor
type: Property
comment: Can be used to attach a "constructor" to a class. A constructor is a SPARQL CONSTRUCT query or INSERT/DELETE Update operation that can add initial values to the current instance. At execution time, the variable ?this is bound to the current instance. Tools can call constructors of a class and its superclasses when an instance of a class has been created. Constructors will also be used to initialize resources that have received a new rdf:type triple as a result of spin:rules firing.
domain: Class
range: Rule
sub property of: command
range: Command
range: Resource
domain: Resource