Company acquisition
disjoint with: Nothing
subclass of: Company Connection
subclass of: Agent Relationship
subclass of: Sourced Entity
subclass of: Thing
subclass of: Generic connection
type: Class
label: Adquisición de empresa @es

Other documentation
sub property of: Has documentation
sub property of: topObjectProperty
property disjoint with: bottomObjectProperty
type: ObjectProperty
type: Property
comment: Documentos misceláneos relacionadas con este agente @es
comment: Miscelaneous document related to this agent
label: Otra documentación @es

Spouse
sub property of: differentFrom
sub property of: Participant
sub property of: topObjectProperty
property disjoint with: bottomObjectProperty
type: ObjectProperty
type: Property
comment: Connection between two people that establishes a marriage, domestic partnership, civil union, sentimental relationship, etc.
comment: Connexión entre dos personas que establece un matrimonio, convivencia, unión civil, relación sentimental, etc. @es
domain: Marital Status
label: Cónyuge @es
range: Person

Generic connection
disjoint with: Nothing
subclass of: Agent Relationship
subclass of: Sourced Entity
subclass of: Thing
type: Class
comment: A generic connection between two or more entities during a certain period of time
comment: Una conexión genérica entre dos o más entidades durante un cierto período de tiempo @es
label: Conexión genérica @es

Has grandparent
sub property of: topObjectProperty
property disjoint with: bottomObjectProperty
inverse of: Has grandchild
type: ObjectProperty
type: Property
comment: Describe la relación donde una persona (objeto) es padre o madre del padre o madre de la persona @es
comment: Describes relation where a person (object) is the parent of the person's parent
domain: Person
label: Abuelo/a @es
range: Person

Political connection
disjoint with: Nothing
subclass of: Agent Relationship
subclass of: Association Connection
subclass of: Sourced Entity
subclass of: Thing
subclass of: Generic connection
type: Class
comment: Connection between a political organization and other entities
comment: Relación entre una organización política y otra entidad @es
label: Conexión política @es

CEO
type: Work role
type: Thing
label: Gerente General @es

Date of financial information
type: DatatypeProperty
type: Thing
sub property of: topDataProperty
property disjoint with: bottomDataProperty
property disjoint with: Relevant date
type: Property
domain: Financial Report
label: Fecha de la información financiera @es
range: gYear

Legal constitution
sub property of: topObjectProperty
property disjoint with: bottomObjectProperty
type: ObjectProperty
type: Property
domain: Company
label: Constitución legal @es
range: Document

Has URL
property disjoint with: bottomObjectProperty
subclass of: page
type: ObjectProperty
type: Class
disjoint with: Nothing
subclass of: Thing
sub property of: topObjectProperty
type: Property
comment: Any URL related to this organization or person (including social media, corporate sites, etc.)
comment: Cualquier URL relaciontada con esa organización o persona (incluyendo social media, sitios corporativos, etc) @es
domain: Agent
label: Página web @es
range: Document

Birth
disjoint with: Nothing
subclass of: Individual Event
subclass of: Event
subclass of: Sourced Entity
subclass of: Thing
type: Class
comment: The event of a person entering into life.

Organigram Documentation
sub property of: Has documentation
sub property of: topObjectProperty
property disjoint with: bottomObjectProperty
type: ObjectProperty
type: Property
comment: Documentos que describen el organigrama este agente @es
comment: Documents describing the organigram this agent
label: Documentación de organigrama @es

International Organization
disjoint with: Nothing
subclass of: Agent
subclass of: Organization
subclass of: Thing
type: Class
comment: An international organization, like UN, UNESCO, etc.
comment: Una organización internacional, como NU, UNESCO, etc. @es
label: Organización internacional @es

Initiating Event
sub property of: topObjectProperty
property disjoint with: bottomObjectProperty
type: ObjectProperty
type: Property
comment: An event that marks the start of an interval and/or relationship. The event contributes to and/or causes of the state of affairs that hold during the interval. For example a period of study may be initiated by an Enrolment event.
comment: Un evento que indica el comienzo de un intervalo o relación @es
label: Evento inicial @es
range: Event

Has Aunt or Uncle
sub property of: topObjectProperty
property disjoint with: bottomObjectProperty
inverse of: Has niece or nephew
type: ObjectProperty
type: Property
comment: Describe la relación donde una persona (objeto) es el/la hermano/a de uno de los padres de esta persona @es
comment: Describes relation where a person (object) is the sibling of one of the parents of this person
domain: Person
label: Tío/a @es
range: Person

Death Event
sub property of: differentFrom
sub property of: event
sub property of: topObjectProperty
property disjoint with: bottomObjectProperty
type: ObjectProperty
type: Property
comment: An death event associated with a person, group or organization.
comment: El evento de la muerte de una persona, grupo u organización @es
domain: Agent
range: Death
label: Muerte @es

Connection start date
sub property of: Initiating Event
sub property of: topObjectProperty
property disjoint with: bottomObjectProperty
type: ObjectProperty
type: Property
comment: Date when connection between entities started
comment: Fecha cuando comenzó la conexión entre entidades @es
domain: Generic connection
label: Fecha de inicio de connección @es

Classmate
disjoint with: Nothing
subclass of: Social connection
subclass of: Agent Relationship
subclass of: Sourced Entity
subclass of: Thing
subclass of: Generic connection
type: Class
label: Compañero de curso o clases @es

Individual Event
disjoint with: Nothing
subclass of: Event
subclass of: Sourced Entity
subclass of: Thing
type: Class
comment: A type of event that is principally about a single person, group or organization. Other agents may be involved but the event is most significant for the principal agent.
subclass of: http://lodlaundromat.org/.well-known/genid/95e87eabd9ed010f241651eb469cf96b#1

Other
disjoint with: Nothing
subclass of: Agent Relationship
subclass of: Association Connection
subclass of: Sourced Entity
subclass of: Thing
subclass of: Generic connection
type: Class
label: Otro @es

Given name
sub property of: topDataProperty
property disjoint with: bottomDataProperty
type: DatatypeProperty
type: Property
comment: El nombre dado a una persona @es
comment: The given name of some person.
label: Otro nombre @es

CTO
type: Work role
type: Thing
label: Gerente de Tecnología @es

Commercial representatives of
sub property of: topObjectProperty
property disjoint with: bottomObjectProperty
type: ObjectProperty
type: Property
comment: Relación entre empresas donde la primera es la filial de la segunda @es
comment: Relation between companies where one is the subsidiary of the second
domain: Company
label: Representatens comerciales de @es
range: Company

Marriage
disjoint with: Nothing
subclass of: Marital Status
subclass of: Agent Relationship
subclass of: Sourced Entity
subclass of: Thing
subclass of: Generic connection
type: Class
label: Matrimonio @es

Agent Relationship
disjoint with: Nothing
subclass of: Thing
type: Class
comment: A particular type of connection existing between people, groups or organizations related to or having dealings with each other.

Has Philantropy Sector
sub property of: topObjectProperty
property disjoint with: bottomObjectProperty
type: ObjectProperty
type: Property
comment: Sectores relationados a ONGs @es
comment: Sectors related to NGOs
domain: Non Governmental Organization
label: Tiene área de filantropía @es
range: PhilantropySector

Dating
disjoint with: Nothing
subclass of: Marital Status
subclass of: Agent Relationship
subclass of: Sourced Entity
subclass of: Thing
subclass of: Generic connection
type: Class
label: Noviazgo @es

Has sibling
sub property of: topObjectProperty
property disjoint with: bottomObjectProperty
type: SymmetricProperty
type: TransitiveProperty
type: ObjectProperty
domain: Person
comment: Describes relation where a person (object) is the sibling (i.e., they have at least one parent in common) of this person
comment: Describe la relación donde una persona (objeto) es el hermano o hermana (i.e, tienen al menos un padre en común) de esta persona @es
label: Hermano/a @es
type: Property
range: Person

Work role
sub property of: topObjectProperty
property disjoint with: bottomObjectProperty
type: ObjectProperty
type: Property
comment: Position or role of the person in this economic connection
comment: Puesto o rol de la persona en esta connexión económica @es
domain: Economic Connection
label: Relación laboral @es
range: Work role

Lugar
sub property of: topObjectProperty
property disjoint with: bottomObjectProperty
type: ObjectProperty
type: Property
comment: Lugar donde ocurre un evento @es
comment: The place at which an event occurred.
domain: Event
label: Place
range: SpatialThing

Related Data
disjoint with: Nothing
subclass of: Thing
type: Class
comment: Clase que describe datos relacionados con una organización, incluyendo su fecha relevante @es
comment: Class that describes any type of data related to an organization including a relevant date
label: Datos relacionados @es

Participant
sub property of: differentFrom
sub property of: topObjectProperty
property disjoint with: bottomObjectProperty
inverse of: Relationship
type: ObjectProperty
type: Property
comment: A person, group or organization that participates in a relationship for some time.
domain: Agent Relationship
range: Agent

Logo
sub property of: topObjectProperty
property disjoint with: bottomObjectProperty
type: ObjectProperty
type: Property
comment: Logo de la organización @es
comment: Logo of the organization
domain: Organization
range: Image

Short biography
disjoint with: Nothing
disjoint with: Long biography
subclass of: Generic biography
subclass of: Sourced Entity
subclass of: Thing
type: Class
comment: Descripción abreviada de una persona, organización, etc @es
comment: Short description of a person, organization, etc
label: Biografía corta @es

Birth Event
sub property of: differentFrom
sub property of: event
sub property of: topObjectProperty
property disjoint with: bottomObjectProperty
type: ObjectProperty
comment: An birth event associated with a person, group or organization.
domain: Agent
comment: El evento del nacimiento de una persona, grupo u organización @es
label: Nacimiento @es
type: Property
range: Birth

Work role
disjoint with: Nothing
subclass of: Thing
type: Class
label: Puesto de trabajo @es

Civil union
disjoint with: Nothing
subclass of: Marital Status
subclass of: Agent Relationship
subclass of: Sourced Entity
subclass of: Thing
subclass of: Generic connection
type: Class
label: Unión civil @es

Source
sub property of: topObjectProperty
property disjoint with: bottomObjectProperty
type: ObjectProperty
type: Property
comment: Fuente de donde se obtuvo la información acerca de una conexión @es
comment: Source where the information about a connection was obtained
domain: Sourced Entity
label: Fuente @es
range: Document
sub property of: Source

Academic Organization
disjoint with: Nothing
subclass of: Agent
subclass of: Organization
subclass of: Thing
type: Class
comment: An educational organization, such a school or university
comment: Una organización educational, como una escuela o una universidad @es
label: Organización académica @es

Ticker symbol
sub property of: topDataProperty
property disjoint with: bottomDataProperty
type: DatatypeProperty
type: Property
domain: Company
label: Ticket de bolsa @es
range: Literal

Person
disjoint with: Nothing
subclass of: Agent
subclass of: Thing
type: Class
comment: A person
comment: Una persona @es
label: Persona @es

Merge company
type: ObjectProperty
sub property of: Participant
sub property of: topObjectProperty
type: Thing
property disjoint with: bottomObjectProperty
sub property of: differentFrom
domain: Economic Connection
label: Compañía fusionada @es
range: Company

Numeric datum
disjoint with: Nothing
subclass of: Related Data
subclass of: Thing
type: Class
comment: Información numérica para una organización, para cierto año @es
comment: Numeric datum for an organization for a certain year
label: Dato numérico @es

Programmatic Organization
disjoint with: Nothing
subclass of: Agent
subclass of: Organization
subclass of: Thing
type: Class
comment: An programmatic organization, like think tanks.
comment: Una organización programática, como los think tanks, etc. @es
label: Organización programática @es

Has Parent
sub property of: topObjectProperty
property disjoint with: bottomObjectProperty
inverse of: Has Parent
type: ObjectProperty
type: Property
comment: Describe la relación donde una persona (objeto) es el padre o madre de esta persona @es
comment: Describes relation where a person (object) is a parent of this person
domain: Person
label: Padre/Madre @es
range: Person

Sympathizer
disjoint with: Nothing
subclass of: Agent Relationship
subclass of: Association Connection
subclass of: Sourced Entity
subclass of: Thing
subclass of: Generic connection
type: Class
label: Simpatizante @es

Educational connection
disjoint with: Nothing
subclass of: Agent Relationship
subclass of: Sourced Entity
subclass of: Thing
subclass of: Generic connection
type: Class
comment: Esta relación indica que una persona estudió (al menos por un tiempo) en una institución académica @es
comment: These connections reflects that a person studied (at least for some time) in an academic organization.
label: Conexión educacional (estudios) @es

Secondary sector
sub property of: topObjectProperty
property disjoint with: bottomObjectProperty
type: ObjectProperty
type: Property
comment: Other sector related to the organization
comment: Otros sectores relacionados con la organización @es
domain: Agent
label: Sector secundario @es
range: Sector

Source
sub property of: topDataProperty
property disjoint with: bottomDataProperty
type: DatatypeProperty
type: Property
comment: A related resource from which the described resource is derived.
comment: Un recurso relacionado de donde resource from which the described resource is derived. @es
label: Fuente @es

Sourced Entity
disjoint with: Nothing
subclass of: Thing
type: Class
comment: Abstract class of any entity that has a source where its information was taken from
comment: Clase abstracta de caulquier entidad cuya información tenga una fuente @es
label: Entidad con fuente @es

Has other main sector
sub property of: topDataProperty
property disjoint with: bottomDataProperty
type: DatatypeProperty
type: Property
comment: Main sector not listed in hasMainSector
comment: Sector principal no listado en hasMainSector @es
domain: Agent
label: Otro sector principal @es
range: Literal

Marital Status
disjoint with: Nothing
subclass of: Agent Relationship
subclass of: Sourced Entity
subclass of: Thing
subclass of: Generic connection
type: Class
comment: Clase de los estados civiles en los que puede estar una persona @es
comment: Class of possible marital status a person can be
label: Estado civil @es

Economic Connection
disjoint with: Nothing
subclass of: Company Connection
subclass of: Agent Relationship
subclass of: Sourced Entity
subclass of: Thing
subclass of: Generic connection
type: Class
comment: La relación entre una persona y una organización académica (colegio, universidad, etc) @es
comment: The connection between an entity and an Educational Organization (university, school, etc)
label: Conexión económica @es

Social connection
disjoint with: Nothing
subclass of: Agent Relationship
subclass of: Sourced Entity
subclass of: Thing
subclass of: Generic connection
type: Class
comment: Connection between a two people, like friendship, acquaintances, etc.
comment: Relación entre dos personas descritas con un contexto (amistad, conocidos, etc) @es
label: Conexión social @es

Academic organization participant
sub property of: differentFrom
sub property of: Participant
sub property of: topObjectProperty
property disjoint with: bottomObjectProperty
type: ObjectProperty
type: Property
comment: An academic organization (school, university) who is part of this connection
comment: Una organización académica (escuela, universidad) que participa de esta conexión @es
domain: Academic Connection
label: Organización académica participante @es
range: Academic Organization

PoderVocab: A vocabulary for Poderopedia
title: PoderVocab: Un vocabulario para Poderopedia @es
date: 2012-05-17
abstract: This document describes a vocabulary to express information about people and their relations with Organizations, Companies, etc.
abstract: Este documento describe un vocabulario para expresar información acerca de personas, y sus relaciones con organizaciones y empresas @es
type: Thing
type: Ontology
version info: 0.8

Has cousin
sub property of: topObjectProperty
property disjoint with: bottomObjectProperty
type: SymmetricProperty
type: ObjectProperty
type: Property
comment: Describe la relación donde una persona (objeto) es primo o prima de esta persona @es
comment: Describes relation where a person (object) is the cousin (their parents are siblings) of this person
domain: Person
label: Primo/a @es
range: Person

Has Parent
sub property of: topObjectProperty
property disjoint with: bottomObjectProperty
inverse of: Has Parent
type: ObjectProperty
type: Property
comment: Describe la relación donde una persona (objeto) es el padre o madre de esta persona @es
comment: Describes relation where a person (object) is a parent of this person
domain: Person
label: Padre/Madre @es
range: Person

Event
disjoint with: Nothing
subclass of: Sourced Entity
subclass of: Thing
type: Class
comment: An event is an occurrence that brings about a change in the state of affairs for one or more people and/or other agents. Events are assumed to occur over a period of time and may not have precise start and end points.
comment: Suceso importante en la vida de una persona, grupo u organización @es
label: Evento @es

Relevant date
sub property of: coverage
sub property of: topDataProperty
property disjoint with: bottomDataProperty
property disjoint with: Date of financial information
type: DatatypeProperty
type: Property
comment: Date related to this data (e.g., release date, last modification, etc.)
comment: Fecha relevante a este dato (ej., fecha de publicación, última modificación, etc) @es
domain: Related Data
label: Fecha relevante @es
range: date

Academic Connection
disjoint with: Nothing
subclass of: Agent Relationship
subclass of: Sourced Entity
subclass of: Thing
subclass of: Generic connection
type: Class
comment: La relación entre una persona y una organización académica (colegio, universidad, etc) @es
comment: The connection between a person and an Educational Organization (university, school, etc)
label: Conexión académica @es

Name
sub property of: topDataProperty
sub property of: title
property disjoint with: bottomDataProperty
type: DatatypeProperty
type: Property
comment: An alias for a person
comment: Un alias de una persona @es
domain: Organization
label: Razón social @es
range: Literal

Alias
sub property of: name
sub property of: altLabel
sub property of: topDataProperty
property disjoint with: bottomDataProperty
type: DatatypeProperty
type: Property
domain: Agent
comment: Un alias de una persona @es
range: Literal
comment: An alias for a person

Long biography
disjoint with: Nothing
disjoint with: Short biography
subclass of: Generic biography
subclass of: Sourced Entity
subclass of: Thing
type: Class
comment: Descripción extendida de una persona, organización, etc @es
comment: Long description of a person, organization, etc
label: Biografía larga @es

Short biography
type: Predicate
type: Thing
sub property of: topObjectProperty
property disjoint with: bottomObjectProperty
property disjoint with: Long biography
type: ObjectProperty
domain: Agent
label: Biografía corta @es
range: Short biography

Has another Non Government Organization Sector
sub property of: topDataProperty
property disjoint with: bottomDataProperty
type: DatatypeProperty
type: Property
comment: Sectores relationados a ONGs no listados @es
comment: Sectors related to NGOs not lister previously
domain: Non Governmental Organization
label: Tiene otro Sector Org No Gubernamentales] @es
range: Literal

Student
sub property of: differentFrom
sub property of: Participant
sub property of: topObjectProperty
property disjoint with: bottomObjectProperty
type: ObjectProperty
type: Property
comment: Person involved in an Education Connection
comment: Persona en una conexión educacional @es
domain: Educational connection
label: Estudiante @es
range: Person

Association Connection
disjoint with: Nothing
subclass of: Agent Relationship
subclass of: Sourced Entity
subclass of: Thing
subclass of: Generic connection
type: Class
comment: La relación entre una entidad y una organización (Opus Dei, un Think Tank) sin necesariamente estar afiliado @es
comment: The connection between an entity and a Organization (Opus Dei, a Think Tank) without been affiliated to it necessarily
label: Conexión de asociación @es

A news event participant in this connection
sub property of: differentFrom
sub property of: Participant
sub property of: topObjectProperty
property disjoint with: bottomObjectProperty
type: ObjectProperty
type: Property
comment: A news event which is part of this connection
comment: Un evento noticioso que participa de esta conexión @es
domain: News event connection
label: Evento noticioso participante @es
range: News event

Non Governmental Organization
disjoint with: Nothing
subclass of: Agent
subclass of: Organization
subclass of: Thing
type: Class
comment: An non-governmental organization (NGO)
comment: Una organización no gubernamental (ONG) @es
label: Organización no gubernamental @es

Subsidiary company of
sub property of: topObjectProperty
property disjoint with: bottomObjectProperty
type: ObjectProperty
type: Property
comment: Relación entre empresas donde la primera es la filial de la segunda @es
comment: Relation between companies where one is the subsidiary of the second
domain: Company
label: Empresa filial de @es
range: Company

Has numerical datum
sub property of: topObjectProperty
property disjoint with: bottomObjectProperty
type: ObjectProperty
type: Property
domain: Organization
label: Tiene dato numérico @es
range: Numeric datum

Domestic partnership
disjoint with: Nothing
subclass of: Marital Status
subclass of: Agent Relationship
subclass of: Sourced Entity
subclass of: Thing
subclass of: Generic connection
type: Class
label: Pareja de hecho @es

Fecha
sub property of: date
sub property of: topObjectProperty
property disjoint with: bottomObjectProperty
type: ObjectProperty
type: Property
comment: La fecha cuando un evento ocurrió @es
comment: The date at which an event occurred.
domain: Event
label: Date

Student
disjoint with: Nothing
subclass of: Agent Relationship
subclass of: Sourced Entity
subclass of: Thing
subclass of: Educational connection
subclass of: Generic connection
type: Class
label: Estudiante @es

Financial Report
disjoint with: Nothing
subclass of: Sourced Entity
subclass of: Thing
type: Class
comment: Any financial information related to an organization (e.g., anual profit)
comment: Cualquier información financiera relacionada con una organización (ej., utilidades anuales) @es
label: Información financiera @es

Relationship
sub property of: topObjectProperty
property disjoint with: bottomObjectProperty
inverse of: Participant
type: ObjectProperty
type: Property
comment: A relationship that a person, group or organization participates in for some time.
domain: Agent
range: Agent Relationship

Buyer
sub property of: differentFrom
sub property of: Participant
sub property of: topObjectProperty
property disjoint with: bottomObjectProperty
type: ObjectProperty
type: Property
domain: Company acquisition
label: Comprador @es
range: Company

Other last name
sub property of: familyName
sub property of: topDataProperty
property disjoint with: bottomDataProperty
type: DatatypeProperty
type: Property
comment: Other last name, different from the first one
comment: Otro apellido, que no es el primero @es
domain: Person
label: Otro apellido @es
range: Literal

Alumni
disjoint with: Nothing
subclass of: Agent Relationship
subclass of: Sourced Entity
subclass of: Thing
subclass of: Educational connection
subclass of: Generic connection
type: Class
label: Ex-alumno @es

Sector
disjoint with: Nothing
subclass of: Thing
type: Class
comment: Productive sector related to an agent
comment: Sector productivo relacionado con una persona @es

Organization/Company involved
sub property of: topObjectProperty
property disjoint with: bottomObjectProperty
type: ObjectProperty
type: Property
comment: Organización o empresa relacionada con esta connexión económica @es
comment: Organization or company associated with this economic connection
domain: Economic Connection
label: Organización/empresa relacionada @es
range: Organization

Value in a financial information
type: DatatypeProperty
type: Thing
sub property of: topDataProperty
property disjoint with: bottomDataProperty
type: Property
domain: Financial Report
label: Valor en un reporte financiero @es
range: Literal

Academic organization
sub property of: differentFrom
sub property of: Participant
sub property of: topObjectProperty
property disjoint with: bottomObjectProperty
type: ObjectProperty
type: Property
comment: Entidad por la cual 2 personas se conocen (colegio, universidad, iglesia, etc.) @es
comment: Entity from where two persons know each other (school, college, church, etc.)
domain: Educational connection
label: Organización académica @es
range: Academic Organization

Graduate
disjoint with: Nothing
subclass of: Agent Relationship
subclass of: Sourced Entity
subclass of: Thing
subclass of: Educational connection
subclass of: Generic connection
type: Class
label: Titulado @es

Friendship
disjoint with: Nothing
subclass of: Social connection
subclass of: Agent Relationship
subclass of: Sourced Entity
subclass of: Thing
subclass of: Generic connection
type: Class
label: Amistad @es

Country of residence
sub property of: based near
sub property of: topObjectProperty
property disjoint with: bottomObjectProperty
type: ObjectProperty
type: Property
comment: Country where the organization's headquarters are located
comment: Ubicación de los headquarters @es
domain: Agent
label: País de residencia @es
range: Country

depiction
sub property of: topObjectProperty
property disjoint with: bottomObjectProperty
type: ObjectProperty
type: Property
comment: A depiction of some organization or person.
comment: Una representación visual de una persona u organización @es
domain: Agent
label: imagen @es
range: Document

Member person
sub property of: differentFrom
sub property of: Participant
sub property of: topObjectProperty
property disjoint with: bottomObjectProperty
type: ObjectProperty
type: Property
comment: A a member of an organization
comment: Un miembro de una organización @es
domain: Association Connection
label: Persona miembro @es
range: Person

Number of Employees
sub property of: Has numerical datum
sub property of: topObjectProperty
property disjoint with: bottomObjectProperty
type: ObjectProperty
type: Property
label: Número de empleados @es

Political Organizacion participant
sub property of: differentFrom
sub property of: Participant organization
sub property of: Participant
sub property of: topObjectProperty
property disjoint with: bottomObjectProperty
type: ObjectProperty
type: Property
comment: A political organization who is part of this connection
comment: Una organización política que participa de esta conexión @es
domain: Political connection
label: Organización política participante @es
range: Political Organization

Map
sub property of: topObjectProperty
property disjoint with: bottomObjectProperty
type: ObjectProperty
type: Property
domain: Company
label: Mapa @es
range: Document

Agent
disjoint with: Nothing
subclass of: Thing
type: Class
comment: An agent (human or not)
comment: Un agente (humano o no) @es
label: Agente @es

Has main sector
sub property of: topObjectProperty
property disjoint with: bottomObjectProperty
type: ObjectProperty
type: Property
comment: Main sector related to the organization
comment: Sector principal relacionado con la organización @es
domain: Agent
label: Sector principal @es
range: Sector

Participant organization
sub property of: differentFrom
sub property of: Participant
sub property of: topObjectProperty
property disjoint with: bottomObjectProperty
type: ObjectProperty
type: Property
comment: An academic organization (school, university) who is part of this connection
comment: Una organización académica (escuela, universidad) que participa de esta conexión @es
domain: Association Connection
label: Organización participante @es
range: Organization

Tax ID
sub property of: identifier
sub property of: topDataProperty
property disjoint with: bottomDataProperty
type: DatatypeProperty
type: Property
comment: ID que identifica a una organización o persona para efecto de los impuestos @es
comment: ID that identifies an organization or person for tax purposes
domain: Agent
label: Rol Único Tributario (RUT) @es
range: Literal

Declaration of interests
sub property of: topObjectProperty
property disjoint with: bottomObjectProperty
type: ObjectProperty
type: Property
domain: Economic Connection
label: Declaración de intereses @es
range: Document

Has niece or nephew
sub property of: topObjectProperty
property disjoint with: bottomObjectProperty
inverse of: Has Aunt or Uncle
type: ObjectProperty
type: Property
comment: Describe la relación donde una persona (objeto) es el/la hijo/a de uno de los hermano/as de esta persona @es
comment: Describes relation where a person (object) is the child of one of the siblings of this person
domain: Person
label: Sobrino/a @es
range: Person

Company
disjoint with: Nothing
subclass of: Agent
subclass of: Organization
subclass of: Thing
type: Class
comment: A for profit organization
comment: Una organización con fines de lucro @es
label: Empresa @es

News event connection
disjoint with: Nothing
subclass of: Agent Relationship
subclass of: Sourced Entity
subclass of: Thing
subclass of: Generic connection
type: Class
comment: Describe la relación de una persona con un evento noticioso durante un período de tiempo @es
comment: Describes the relation of a person with a news event during a specific period of time
label: Conexión con evento noticioso @es

Gender
sub property of: topObjectProperty
property disjoint with: bottomObjectProperty
type: ObjectProperty
type: Property
comment: Gender of this person
comment: Sexo de esta persona @es
domain: Person
label: Sexo @es
range: Gender

Organization
disjoint with: Nothing
equivalent class: Organization
subclass of: Agent
subclass of: Thing
subclass of: Organization
type: Class
label: Organización @es

Has other main sector
sub property of: topDataProperty
property disjoint with: bottomDataProperty
type: DatatypeProperty
type: Property
comment: Other sector not listed in hasOtherSector
comment: Otro sector no listado en hasOtherSector @es
domain: Agent
label: Otro sector secundario @es
range: Literal

comment
sub property of: topDataProperty
property disjoint with: bottomDataProperty
type: DatatypeProperty
type: Property
comment: A description of the subject resource.
domain: Resource
range: Literal

Declaration of Patrimony
sub property of: topObjectProperty
property disjoint with: bottomObjectProperty
type: ObjectProperty
type: Property
domain: Economic Connection
label: Declaración de Patrimonio @es
range: Document

Document URL
sub property of: topObjectProperty
property disjoint with: bottomObjectProperty
type: ObjectProperty
type: Property
comment: URL donde se encuentra el documento @es
comment: URL where the document is located
domain: Documentation
label: URL de documento @es
range: Document

Gender
disjoint with: Nothing
subclass of: Thing
type: Class
comment: Gender of a person
comment: Sexo de una persona @es
label: Sexo @es

Has grandchild
sub property of: topObjectProperty
property disjoint with: bottomObjectProperty
inverse of: Has grandparent
type: ObjectProperty
type: Property
comment: Describe la relación donde una persona (objeto) es hijo/a del hijo/a de la persona @es
comment: Describes relation where a person (object) is the child of the person's child
domain: Person
label: Nieto/a @es
range: Person

Concluding Event
sub property of: topObjectProperty
property disjoint with: bottomObjectProperty
type: ObjectProperty
type: Property
comment: An event that marks the end of an interval and/or relationship. The event changes of the state of affairs that held during the interval. For example a period of study may be concluded by a Graduation event.
comment: Un evento que marca el final de un intervalo o relación @es
label: Evento final @es
range: Event

Has documentation
sub property of: topObjectProperty
property disjoint with: bottomObjectProperty
type: ObjectProperty
type: Property
comment: Asocia un agente con documentación relacionada @es
comment: Associates an agent with related documentation
domain: Agent
label: Tiene documentación @es
range: Documentation

Generic biography
disjoint with: Nothing
subclass of: Sourced Entity
subclass of: Thing
type: Class
label: Biografía genérica @es

based near
sub property of: topObjectProperty
property disjoint with: bottomObjectProperty
type: ObjectProperty
type: Property
comment: A location that something is based near, for some broadly human notion of near.
domain: SpatialThing
range: SpatialThing

Connection end date
sub property of: Concluding Event
sub property of: topObjectProperty
property disjoint with: bottomObjectProperty
type: ObjectProperty
type: Property
comment: Date when connection between entities ended
comment: Fecha cuando temrinó la conexión entre entidades @es
domain: Generic connection
label: Fecha de fin de connección @es

Connected via
sub property of: topObjectProperty
property disjoint with: bottomObjectProperty
type: ObjectProperty
type: Property
comment: Entidad por la cual 2 personas se conocen (colegio, universidad, iglesia, etc.) @es
comment: Entity from where two persons know each other (school, college, church, etc.)
domain: Social connection
label: Conectados via @es
range: Agent

Restricted access organization
disjoint with: Nothing
subclass of: Agent
subclass of: Organization
subclass of: Thing
type: Class
comment: A restricted access organization, like social clubs, golf clubs, etc.
comment: Una organización de acceso restringod, como clubes sociales, de golf, etc. @es
label: Organización de acceso restringido @es

Long biography
type: Predicate
type: Thing
sub property of: topObjectProperty
property disjoint with: bottomObjectProperty
property disjoint with: Short biography
type: ObjectProperty
domain: Agent
label: Biografía larga @es
range: Long biography

Target company
sub property of: differentFrom
sub property of: Participant
sub property of: topObjectProperty
property disjoint with: bottomObjectProperty
type: ObjectProperty
type: Property
domain: Company acquisition
label: Compañía target @es
range: Company

Documentation
disjoint with: Nothing
subclass of: Related Data
subclass of: Thing
type: Class
comment: Clase que describe documentos relacionados con una persona u organización, incluyendo su fecha de publicación @es
comment: Class that describes documents related to a person or organization, including its release date
label: Documentación @es

Country
disjoint with: Nothing
subclass of: SpatialThing
subclass of: Thing
type: Class
comment: A region legally defined as a distinct entity in political geography
comment: Área geográfica y una entidad políticamente independiente con su propio gobierno, administración, etc. @es
label: País @es

Documents about sanctions
sub property of: Has documentation
sub property of: topObjectProperty
property disjoint with: bottomObjectProperty
type: ObjectProperty
type: Property
comment: Documentos que describen sanciones legales relacionadas con este agente @es
comment: Documents describing legal sanctions related to this agent
label: Documentación acerca de sanciones @es

Member
disjoint with: Nothing
subclass of: Agent Relationship
subclass of: Association Connection
subclass of: Sourced Entity
subclass of: Thing
subclass of: Generic connection
type: Class
comment: Miembro oficial de una organización (club social, grupo religioso, etc.) @es
comment: Official member of an organization (social club, religious group, etc.)
label: Miembro @es

firstName
sub property of: topDataProperty
property disjoint with: bottomDataProperty
type: DatatypeProperty
type: Property
comment: El primer nombre de una persona @es
comment: The first name of a person.
domain: Person
label: Primer nombre @es
range: Literal

First last name
sub property of: familyName
sub property of: topDataProperty
property disjoint with: bottomDataProperty
type: DatatypeProperty
type: Property
domain: Person
label: Primer apellido @es
range: Literal

Religious Organization
disjoint with: Nothing
subclass of: Agent
subclass of: Organization
subclass of: Thing
type: Class
comment: An religious organization, like Opus Dei, Catholic church, etc.
comment: Una organización religiosa, como Opus Dei, Iglesia católica, etc. @es
label: Organización religiosa @es

Political Organization
disjoint with: Nothing
subclass of: Agent
subclass of: Organization
subclass of: Thing
type: Class
comment: An Political organization, like parties.
comment: Una organización política, como partidos políticos. @es
label: Organización política @es

Economic Connection
disjoint with: Nothing
subclass of: Agent Relationship
subclass of: Sourced Entity
subclass of: Thing
subclass of: Generic connection
type: Class
comment: La relación entre una persona y una organización académica (colegio, universidad, etc) @es
comment: The connection between an entity and an Educational Organization (university, school, etc)
label: Conexión económica @es

Acquaintance
disjoint with: Nothing
subclass of: Social connection
subclass of: Agent Relationship
subclass of: Sourced Entity
subclass of: Thing
subclass of: Generic connection
type: Class
label: Conocidos @es

Death
disjoint with: Nothing
subclass of: Individual Event
subclass of: Event
subclass of: Sourced Entity
subclass of: Thing
type: Class
comment: The event of a person's life ending.

Financier
disjoint with: Nothing
subclass of: Agent Relationship
subclass of: Association Connection
subclass of: Sourced Entity
subclass of: Thing
subclass of: Generic connection
type: Class
label: Financista @es

Company Connection
disjoint with: Nothing
subclass of: Agent Relationship
subclass of: Sourced Entity
subclass of: Thing
subclass of: Generic connection
type: Class
comment: La relación entre dos compañías @es
comment: The connection between two companies
label: Conexión entre compañías @es

News event
disjoint with: Nothing
subclass of: Event
subclass of: Sourced Entity
subclass of: Thing
type: Class
comment: An event relevant from the point of view of journalism
comment: Un evento de relevancia periodística @es
label: Evento noticioso @es

http://lodlaundromat.org/.well-known/genid/95e87eabd9ed010f241651eb469cf96b#1
type: Restriction
cardinality: 1
on property: principal