Profile Class
subclass of: Resource
type: Class
comment: The class for xAPI profiles.

xAPI Verb Class
subclass of: Resource
type: Class
comment: The class of all verb types.

xAPI Verb Tense
subclass of: Resource
type: Class
comment: The tense of the verb: past, present, future
subclass of: xAPI Verb Class

xAPI Term Disambiguation
type: Property
comment: A custom property used to provide an authoritative source of the term and definition for word-sense disambiguation (WSD).
range: xAPI Verb Class
range: Resource

xAPI Verb Term Ontology
version info: 0.1
issued: 2015-04-27
type: Ontology
publisher: www.adlnet.gov
license: http://creativecommons.org/licenses/by/3.0/
preferred namespace uri: http://purl.org/xapi/ontology#
type: Vocabulary
description: This example ontology contains all classes and properties required for creating and publishing a verb term list or dataset for xAPI CoPs.
preferred namespace prefix: xapi
modified: 2015-05-13
contributor: jasonhaag