Generic Classification Class.
subclass of: Thing
subclass of: Resource
type: Class
comment: Generic Classification Class. Vocabulary instances would be of this type.
term status: testing

Generic Classifiable Class
subclass of: Thing
subclass of: Resource
type: Class
comment: Generic Classifiable Class - inheriting from this makes the descendant Classifiable by a Classification
term status: testing

Property that associates Classifications with Classifiables. A subPropertyOf dcterms:subject
range: Thing
domain: Thing
transitive over: Parent-child transitive relationship between Classifications.
type: ObjectProperty
comment: Property that associates Classifications with Classifiables. e.g. <MyAsset> isClassifiedBy <SomeClassification>
domain: Generic Classifiable Class
range: Generic Classification Class.
sub property of: subject
term status: testing
type: Property
domain: Resource
range: Resource

Paul Harman
type: Person

Jarred McGinnis
type: Person

Paul Wilton
type: Person

SNaP Classification Ontology
modified: 2012-09-25
comment: The Classification Ontology allows assets to be holistically classified using a controlled vocabulary or taxonomy.
maker: Paul Wilton
license: http://creativecommons.org/licenses/by-nd/3.0/
maker: Paul Harman
type: Ontology
version info: 0.2.2
created: 2011-07-28
maker: Jarred McGinnis

Parent-child transitive relationship between Classifications.
type: TransitiveProperty
comment: Transitive property that allows classifications to be related to parent classifications
domain: Generic Classification Class.
range: Generic Classification Class.
term status: testing
type: Property
type: ObjectProperty
domain: Thing
domain: Resource
range: Resource
range: Thing