:genid139.d54af2326094fb16
subclass of: Resource
type: Class
subclass of: Thing
description: http://lodlaundromat.org/.well-known/genid/5fff1571eef2b6b1992bf850a3b19000#1
union of: :genid140.d54af2326094fb1

http://void.rkbexplorer.com/id/dataset/3ef699a325e165fe9ad1c58c26ec9441
title: http://cci.mit.edu/
label: http://cci.mit.edu/
type: Dataset
type: :genid139.d54af2326094fb1
uri regex pattern: http://cci.mit.edu/.+

http://lodlaundromat.org/5fff1571eef2b6b1992bf850a3b19000
created: 2015-02-19T00:04:37
creator: org-ecs
type: Ontology