book title
sub property of: hasBooktitle
sub property of: booktitle
type: DatatypeProperty
comment: An alternative Book Title or the Book Title where an article appears, such as title of proceedings.
domain: Publication
range: string
equivalent property: hasBooktitle
equivalent property: booktitle
type: Property
domain: Thing
domain: Resource
domain: Document
range: Resource

Masters Thesis
subclass of: Mastersthesis
subclass of: MasterThesis
subclass of: Resource
subclass of: Master Thesis
subclass of: Thesis
subclass of: Thing
type: Class
comment: A thesis written to receive a Master's degree.
equivalent class: Master Thesis
equivalent class: Mastersthesis
equivalent class: MasterThesis
subclass of: Publication
subclass of: Document

Publication
subclass of: Thing
subclass of: Publication
subclass of: Resource
type: Class
comment: Individual documents and collections of documents such as series, journals, etc.
subclass of: Document
equivalent class: Publication

Cites
range: Thing
domain: Thing
sub property of: cite
type: ObjectProperty
comment: Indicates that a publication cites another publication.
domain: Publication
equivalent property: cite
type: Property
domain: Resource
domain: Document
range: Resource

chapter
sub property of: Chapter
sub property of: chapter
type: DatatypeProperty
comment: The chapter number of a publication
domain: Book Chapter
range: string
equivalent property: Chapter
equivalent property: chapter
type: Property
domain: Publication
domain: Article in Book
domain: Thing
domain: Inbook
domain: Resource
domain: Document
range: Resource

coeditor
range: Thing
domain: Thing
type: ObjectProperty
comment: Indicates that a person is co-editor with another person
domain: Person
range: Person
type: Property
range: Resource
domain: Resource

at university
range: Thing
domain: Thing
type: ObjectProperty
comment: Indicates that a publication originates or is related to a specific University.
domain: Publication
range: University
type: Property
range: Resource
range: School
range: Organization
domain: Resource
domain: Document

Edited Book
subclass of: Book
subclass of: Resource
subclass of: Thing
type: Class
subclass of: Edited-Book
comment: An edited book with an explicit publisher.
subclass of: Edited Publication
equivalent class: Edited-Book
subclass of: Publication
subclass of: Document

pages
sub property of: hasPages
sub property of: pages
sub property of: has-page-numbers
type: DatatypeProperty
comment: The Pages part of citation of a publication.
domain: Publication
range: string
equivalent property: hasPages
equivalent property: pages
equivalent property: has-page-numbers
type: Property
domain: Thing
domain: Resource
domain: Document
range: Resource

Serial Publication
subclass of: Resource
type: Class
subclass of: Thing
subclass of: Publication
comment: A periodical that appears at scheduled times.
subclass of: Document

Publisher
subclass of: Resource
type: Class
subclass of: Thing
subclass of: Publishing-House
comment: An organization that, among other things, creates publishing periodicals, books or music.
subclass of: Organization
equivalent class: Publishing-House

Proceedings
subclass of: Proceedings
subclass of: Publication
type: Class
subclass of: Resource
subclass of: Thing
comment: A written account of what transpired at a meeting.
equivalent class: Proceedings
subclass of: Document

Book
subclass of: Publication
subclass of: Resource
subclass of: Book
subclass of: Thing
type: Class
comment: A book with an explicit publisher.
equivalent class: Book
subclass of: Document

Chapter Of
range: Thing
domain: Thing
type: ObjectProperty
comment: Indicates that a book chapter belongs to a specific book. It is debateable whether this should be subclass of Collection.
domain: Book Chapter
range: Edited Book
type: Property
range: Resource
range: Book
range: Edited-Book
range: Publication
range: Document
range: Edited Publication
domain: Resource
domain: Publication
domain: Document
domain: Article in Book
domain: Inbook

Author
range: Thing
domain: Thing
type: ObjectProperty
comment: Indicates that a publication is authored by a specific person(s).
domain: Publication
range: Seq
type: Property
range: Resource
range: Container
domain: Resource
domain: Document

School
subclass of: Resource
type: Class
subclass of: Thing
comment: An organization where individuals receive education.
subclass of: Organization

isbn
sub property of: hasISBN
sub property of: isbn
type: DatatypeProperty
comment: The ISBN of a publication.
domain: Publication
range: string
equivalent property: hasISBN
equivalent property: isbn
type: Property
domain: Thing
domain: Resource
domain: Document
range: Resource

Article
subclass of: Resource
subclass of: Thing
subclass of: Publication
subclass of: Article in Journal
type: Class
subclass of: Article
comment: An article from a journal or magazine.
equivalent class: Article in Journal
equivalent class: Article
subclass of: Document

volume
sub property of: volume
type: DatatypeProperty
comment: The Volume part of citation of a publication.
domain: Publication
range: string
equivalent property: volume
type: Property
domain: Thing
domain: Resource
domain: Document
range: Resource

University
subclass of: Thing
subclass of: University
subclass of: Resource
type: Class
comment: An institution for higher learning with teaching and research facilities constituting a graduate school and professional schools that award master's degrees and doctorates and an undergraduate division that awards bachelor's degrees.
subclass of: School
equivalent class: University
subclass of: Organization

Journal
subclass of: Thing
subclass of: Journal
subclass of: Resource
type: Class
comment: A periodical presenting articles on a particular subject.
subclass of: Serial Publication
equivalent class: Journal
subclass of: Publication
subclass of: Document

In Series
range: Thing
domain: Thing
type: ObjectProperty
comment: Indicates that a Publication is part of a Publication Series.
domain: Publication
range: Series
type: Property
range: Resource
domain: Resource
domain: Document

Webpage
subclass of: Resource
type: Class
subclass of: Thing
comment: A webpage, it is subclass of Document because we want to emphasize that the URL of the webpage is used the URI.
subclass of: Document

journal name
sub property of: hasJournal
type: DatatypeProperty
comment: The name of a Journal, such as where an article appears
domain: Journal
range: string
equivalent property: hasJournal
type: Property
domain: Thing
domain: Resource
domain: Serial Publication
domain: Publication
domain: Document
range: Resource

sameAffiliation
range: Thing
domain: Thing
type: ObjectProperty
comment: Indicates that a person has same affiliation than another person (this is not necessarily transitive)
domain: Person
range: Person
type: Property
range: Resource
domain: Resource

is Included in Proceedings
range: Thing
domain: Thing
sub property of: containedInProceedings
type: ObjectProperty
comment: Indicates that a publication is included in a specific proceedings publication.
domain: Article in Proceedings
range: Proceedings
equivalent property: containedInProceedings
type: Property
domain: Resource
domain: Inproceedings
domain: Publication
domain: Document
range: Resource
range: Publication
range: Document

Doctoral Dissertation
subclass of: PhDThesis
subclass of: PhD Thesis
subclass of: Thesis
subclass of: Thing
subclass of: Resource
type: Class
subclass of: Phdthesis
comment: A dissertation written to receive a PhD.
equivalent class: PhD Thesis
equivalent class: Phdthesis
equivalent class: PhDThesis
subclass of: Publication
subclass of: Document

Thesis
subclass of: Publication
subclass of: Thesis
type: Class
subclass of: Thing
subclass of: Resource
comment: A treatise advancing a new point of view resulting from research; usually a requirement for an advanced academic degree.
equivalent class: Thesis
subclass of: Document

Affiliation
range: Thing
domain: Thing
sub property of: affiliation
sub property of: has-affiliation
type: ObjectProperty
comment: Indicates that a person is affiliated to a specific organization.
domain: Person
range: Organization
equivalent property: affiliation
equivalent property: has-affiliation
type: Property
domain: Resource
range: Resource

Series
subclass of: Resource
type: Class
subclass of: Thing
comment: Publication Series, such as LNCS, WEUR Workshops, etc. (at this time debatable whether this should be subclassof Publication)

number
sub property of: hasNumber
type: DatatypeProperty
comment: The Number part of citation of a publication.
domain: Publication
range: string
equivalent property: hasNumber
type: Property
domain: Thing
domain: Resource
domain: Document
range: Resource

coauthor
range: Thing
domain: Thing
type: ObjectProperty
comment: Indicates that a person is co-author with another person
domain: Person
range: Person
type: Property
range: Resource
domain: Resource

at organization
range: Thing
domain: Thing
type: ObjectProperty
comment: Indicates that a publication originates or is related to a specific Organization.
domain: Publication
range: Organization
type: Property
range: Resource
domain: Resource
domain: Document

Article in Proceedings
subclass of: Resource
subclass of: Inproceedings
subclass of: Publication
subclass of: Thing
type: Class
comment: An article in the proceedings of a meeting, such as a conference, workhshop and symposium.
equivalent class: Inproceedings
subclass of: Document

year
sub property of: year
type: DatatypeProperty
comment: The year part of the date of a foaf:Document.
domain: Document
range: gYear
equivalent property: year
type: Property
domain: Resource
range: Resource

Book Chapter
subclass of: Publication
subclass of: Article in Book
subclass of: Thing
type: Class
subclass of: Inbook
subclass of: Resource
comment: A part of a book, such as a chapter (or section/preface) and/or a range of pages.
equivalent class: Article in Book
equivalent class: Inbook
subclass of: Document

Edited Publication
subclass of: Thing
subclass of: Publication
subclass of: Resource
type: Class
comment: An edited publication, that is, it has one or more editors (edited books, etc)
subclass of: Document

Editor
range: Thing
domain: Thing
type: ObjectProperty
comment: Indicates that a publication has a specific editor(s).
domain: Edited Publication
range: Seq
type: Property
range: Resource
range: Container
domain: Resource
domain: Publication
domain: Document

month
sub property of: hasMonth
sub property of: month
type: DatatypeProperty
comment: The month part of the date of a foaf:Document.
domain: Document
range: string
equivalent property: hasMonth
equivalent property: month
type: Property
domain: Resource
range: Resource

gMonth
type: DatatypeProperty
comment: The month part of the date of a foaf:Document represented as xsd:gMonth value
domain: Document
range: gMonth
type: Property
range: Resource
domain: Resource

SwetoDblp Ontology
creator: Boanerges Aleman-Meza
type: Ontology
comment: This file specifies in RDF Schema format the classes and properties for SwetoDblp. These classes and properties are based on the internal LSDIS Library portal engine. Contact Person is Boanerges Aleman-Meza (baleman at uga dot edu).
version info: 2007-05-01

last modified date
type: DatatypeProperty
comment: The last modified date of a document.
domain: Document
range: string
type: Property
range: Resource
domain: Resource

presentation
type: DatatypeProperty
comment: The Electronic Edition of a Presentation of a publication
domain: Publication
range: string
type: Property
range: Resource
domain: Resource
domain: Thing
domain: Document

cdrom
type: DatatypeProperty
comment: The CDROM location of a Publication, as used by the ACM SIGMOD Anthology.
domain: Publication
range: string
type: Property
range: Resource
domain: Resource
domain: Thing
domain: Document

ee
type: DatatypeProperty
comment: The Electronic Edition of a publication
domain: Publication
range: string
type: Property
range: Resource
domain: Resource
domain: Thing
domain: Document

abstract
type: DatatypeProperty
comment: The abstract of a document
domain: Document
range: string
type: Property
range: Resource
domain: Resource