magyar irodalom
broader: http://nektar.oszk.hu/resource/auth/finnugor_n
narrower: http://nektar.oszk.hu/resource/auth/hat
definition: A nem szomszédos államok magyar irodalma (az "amerikai magyar irodalom" kivételével) a "határon túli magyar irodalom" és az adott állam, terület deszkriptorával osztályozandó
related: http://nektar.oszk.hu/resource/auth/magyarorsz
broader: http://nektar.oszk.hu/resource/auth/eur
related: http://nektar.oszk.hu/resource/auth/hat
narrower: hungarikum
type: Concept
definition: A szomszédos államok magyar irodalmának önálló deszkriptorai vannak
related: http://nektar.oszk.hu/resource/auth/cig
related: magyar nyelv
type: term
source: OSZK tezaurusz
narrower: http://nektar.oszk.hu/resource/auth/r
related: http://nektar.oszk.hu/resource/auth/magyar_irodalom_t
in scheme: term
broader: irodalom