:genid139.d54af2326094fb16
subclass of: Resource
type: Class
subclass of: Thing
description: http://lodlaundromat.org/.well-known/genid/504ed1999b4ead4e5618445c70d5a4ec#1
union of: :genid140.d54af2326094fb1

http://void.rkbexplorer.com/id/dataset/2105bad0e336044009ad250646bee664
title: http://www.leforem.be/
uri regex pattern: http://www.leforem.be/.+
type: :genid139.d54af2326094fb1
type: Dataset
label: http://www.leforem.be/

http://lodlaundromat.org/504ed1999b4ead4e5618445c70d5a4ec
created: 2015-02-19T00:04:31
creator: org-ecs
type: Ontology