editable model
range: Thing
domain: Thing
type: ObjectProperty
comment: Model Based Access Control: Which Models are allowed to edit (and read)
domain: http://lodlaundromat.org/.well-known/genid/49974c46c5c3677816a596cc3abfb040#1
range: Model
sub property of: readable model
type: Property
range: Resource
domain: Resource

comment
type: Property
type: AnnotationProperty
range: String
range: Resource

mbox
domain: Thing
type: ObjectProperty
comment: A personal mailbox, ie. an Internet mailbox associated with exactly one owner, the first owner of this mailbox.
domain: User
range: Thing
type: Property
domain: Resource
domain: http://lodlaundromat.org/.well-known/genid/49974c46c5c3677816a596cc3abfb040#1
range: Resource

possible datatype
range: Thing
domain: Thing
type: ObjectProperty
comment: Since it is not allowed to state more than one possible datatypes of a datatype property in OWL, you can use this relation. (not implemented yet)
domain: DatatypeProperty
range: Datatype
type: Property
domain: Resource
domain: Property
range: Class
range: Resource

Boolean
subclass of: Resource
type: Class
type: Datatype
disjoint with: long
disjoint with: byte
disjoint with: unsignedShort
disjoint with: time
disjoint with: unsignedLong
disjoint with: float
disjoint with: dateTime
disjoint with: int
disjoint with: String
disjoint with: unsignedInt
disjoint with: short
disjoint with: nonNegativeInteger
disjoint with: duration
disjoint with: unsignedByte
disjoint with: date
disjoint with: integer
disjoint with: decimal
disjoint with: nonPositiveInteger

not readable model
range: Thing
domain: Thing
type: ObjectProperty
comment: Model Based Access Control: Which Models are NOT allowed to read
domain: http://lodlaundromat.org/.well-known/genid/49974c46c5c3677816a596cc3abfb040#1
range: Model
sub property of: not editable model
type: Property
range: Resource
domain: Resource

User
subclass of: Thing
subclass of: http://lodlaundromat.org/.well-known/genid/49974c46c5c3677816a596cc3abfb040#1
subclass of: Resource
type: Class
comment: Users are able to log into the wiki.

label
type: Property
type: AnnotationProperty
range: String
range: Resource

Action
subclass of: Thing
subclass of: Resource
type: Class
comment: Actions represent specific GUI or API actions which can be activated or used by an Agent.

readable model
range: Thing
domain: Thing
type: ObjectProperty
comment: Model Based Access Control: Which Models are allowed to read
domain: http://lodlaundromat.org/.well-known/genid/49974c46c5c3677816a596cc3abfb040#1
range: Model
type: Property
domain: Resource
range: Resource

member
range: Thing
domain: Thing
type: ObjectProperty
comment: The sioc:member property relates a sioc:Usergroup to a sioc:User that is a member of that group.
domain: Usergroup
range: User
type: Property
domain: Resource
domain: http://lodlaundromat.org/.well-known/genid/49974c46c5c3677816a596cc3abfb040#1
range: Resource
range: http://lodlaundromat.org/.well-known/genid/49974c46c5c3677816a596cc3abfb040#1

Model
subclass of: Thing
subclass of: Resource
type: Class
comment: A model is a knowledge base.

deny access
range: Thing
domain: Thing
type: ObjectProperty
comment: Action Based Access Control: Which Actions are NOT to be accessed?
domain: http://lodlaundromat.org/.well-known/genid/49974c46c5c3677816a596cc3abfb040#1
range: Action
type: Property
domain: Resource
range: Resource

grant access
range: Thing
domain: Thing
type: ObjectProperty
comment: Access Control: Which Actions are allowed to accessed?
domain: http://lodlaundromat.org/.well-known/genid/49974c46c5c3677816a596cc3abfb040#1
range: Action
type: Property
domain: Resource
range: Resource

Any URI
type: Datatype
type: Class

hidden imports
range: Thing
domain: Thing
type: ObjectProperty
comment: Acts like owl:imports but is not part of the model itself.
domain: Model
range: Model
type: Property
domain: Resource
range: Resource

not editable model
range: Thing
domain: Thing
type: ObjectProperty
comment: Model Based Access Control: Which Models are NOT allowed to edit (and read)
domain: http://lodlaundromat.org/.well-known/genid/49974c46c5c3677816a596cc3abfb040#1
range: Model
type: Property
domain: Resource
range: Resource

Usergroup
subclass of: http://lodlaundromat.org/.well-known/genid/49974c46c5c3677816a596cc3abfb040#1
subclass of: Resource
subclass of: Thing
type: Class
comment: A Group of User Accounts ...

String
subclass of: Resource
type: Class
type: Datatype
disjoint with: long
disjoint with: byte
disjoint with: unsignedShort
disjoint with: time
disjoint with: unsignedLong
disjoint with: float
disjoint with: dateTime
disjoint with: int
disjoint with: unsignedInt
disjoint with: short
disjoint with: nonNegativeInteger
disjoint with: duration
disjoint with: unsignedByte
disjoint with: date
disjoint with: integer
disjoint with: decimal
disjoint with: Boolean
disjoint with: nonPositiveInteger

Rollback
type: Action
comment: Rollback changes on statements to a past version (needs Versioning)
type: Thing

Model Management
type: Action
comment: Create and remove models from the store
type: Thing

Extension Configuration
comment: Enable, disable as well as configure extensions

Anonymous
type: User
comment: This special account identifies the anonymous user.
type: http://lodlaundromat.org/.well-known/genid/49974c46c5c3677816a596cc3abfb040#1
type: Thing

SuperAdmin
type: User
comment: This special account is the SuperAdministrator. He has hard coded access to all models and actions and uses the user nick and pass from the database configuration. All access control statements of this user are ignored by the system.
type: http://lodlaundromat.org/.well-known/genid/49974c46c5c3677816a596cc3abfb040#1
type: Thing

AnyAction
type: Action
comment: This special action identifies any action.
type: Thing

config
type: DatatypeProperty
comment: This property holds action configuration values beyond the rdf schema.
domain: Action
range: String
type: Property
domain: Thing
domain: Resource
range: Resource

used prefix
type: DatatypeProperty
comment: This property describes namespace prefix configurations.
domain: Model
range: String
type: Property
domain: Thing
domain: Resource
range: Resource

Debug
comment: Allow access to debug information via the user interface

Model Export
type: Action
comment: Allow to export complete knowledge bases
comment: Export complete models (disallow this on models bigger than 40k distinct resources to avoid virtuoso errors)
type: Thing

Login
type: Action
comment: Login to the application
type: Thing

Register new User
type: Action
comment: Register new users with application/register
type: Thing

uid
type: DatatypeProperty
type: FunctionalProperty
comment: This is the user identifier of an account which is used for login
domain: User
range: String
type: Property
domain: Thing
domain: Resource
domain: http://lodlaundromat.org/.well-known/genid/49974c46c5c3677816a596cc3abfb040#1
range: Resource

hidden
type: DatatypeProperty
type: FunctionalProperty
comment: All resources (especially Models, Classes and Properties) can be hidden.
domain: Thing
range: Boolean
type: Property
domain: Resource
range: Resource

Markdown formated string
type: Datatype
comment: A string literal formated using markdown syntax.
type: Class

is facet
type: DatatypeProperty
comment: This property is a good candidate for beeing a facet in a instance list.
domain: Property
range: Boolean
type: Property
domain: Resource
range: Resource

AnyModel
type: Model
comment: This special model identifies any model.
type: Thing

is large
type: DatatypeProperty
type: FunctionalProperty
comment: When models are too big counting can be disabled and limits are added
domain: Ontology
range: Boolean
type: Property
domain: Resource
range: Resource

password
type: DatatypeProperty
type: FunctionalProperty
comment: The password of an account.
domain: User
range: String
type: Property
domain: Thing
domain: Resource
domain: http://lodlaundromat.org/.well-known/genid/49974c46c5c3677816a596cc3abfb040#1
range: Resource

System Ontology
type: Ontology
comment: This schema model provides the vocabulary to configure the installation (e.g. terms for access control). Some terms are copied from FOAF.
version info: SysOnt.ttl