gMonth
property disjoint with: cdrom
property disjoint with: Chapter
property disjoint with: isbn
property disjoint with: month
property disjoint with: ee
property disjoint with: hasISBN
property disjoint with: hasMonth
property disjoint with: booktitle
property disjoint with: year
property disjoint with: has-page-numbers
property disjoint with: journal name
property disjoint with: pages
property disjoint with: last modified date
property disjoint with: volume
property disjoint with: book title
property disjoint with: abstract
property disjoint with: chapter
property disjoint with: hasBooktitle
property disjoint with: number
sub property of: topDataProperty
property disjoint with: bottomDataProperty
property disjoint with: hasPages
property disjoint with: hasNumber
type: DatatypeProperty
property disjoint with: hasJournal
property disjoint with: presentation
comment: The month part of the date of a foaf:Document represented as xsd:gMonth value
domain: Document
range: gMonth

Journal
type: Class
subclass of: Publication
subclass of: Thing
subclass of: Journal
disjoint with: Nothing
subclass of: Serial Publication
subclass of: Document
equivalent class: Journal
comment: A periodical presenting articles on a particular subject.

Serial Publication
subclass of: Publication
subclass of: Document
subclass of: Thing
type: Class
disjoint with: Nothing
comment: A periodical that appears at scheduled times.

In Series
sub property of: topObjectProperty
property disjoint with: bottomObjectProperty
type: ObjectProperty
comment: Indicates that a Publication is part of a Publication Series.
domain: Publication
range: Series

Chapter Of
sub property of: topObjectProperty
property disjoint with: bottomObjectProperty
type: ObjectProperty
comment: Indicates that a book chapter belongs to a specific book. It is debateable whether this should be subclass of Collection.
domain: Book Chapter
range: Edited Book

isbn
property disjoint with: year
equivalent property: isbn
equivalent property: hasISBN
sub property of: topDataProperty
sub property of: hasISBN
property disjoint with: gMonth
sub property of: isbn
type: DatatypeProperty
property disjoint with: bottomDataProperty
comment: The ISBN of a publication.
domain: Publication
range: string

Webpage
disjoint with: Nothing
subclass of: Document
subclass of: Thing
type: Class
comment: A webpage, it is subclass of Document because we want to emphasize that the URL of the webpage is used the URI.

Affiliation
sub property of: topObjectProperty
property disjoint with: bottomObjectProperty
sub property of: affiliation
equivalent property: affiliation
sub property of: has-affiliation
equivalent property: has-affiliation
type: ObjectProperty
comment: Indicates that a person is affiliated to a specific organization.
domain: Person
range: Organization

Article in Proceedings
subclass of: Document
type: Class
disjoint with: Nothing
subclass of: Inproceedings
equivalent class: Inproceedings
subclass of: Publication
subclass of: Thing
comment: An article in the proceedings of a meeting, such as a conference, workhshop and symposium.

coeditor
sub property of: topObjectProperty
property disjoint with: bottomObjectProperty
type: ObjectProperty
comment: Indicates that a person is co-editor with another person
domain: Person
range: Person

Series
disjoint with: Nothing
subclass of: Thing
type: Class
comment: Publication Series, such as LNCS, WEUR Workshops, etc. (at this time debatable whether this should be subclassof Publication)

Edited Publication
subclass of: Publication
subclass of: Thing
type: Class
subclass of: Document
disjoint with: Nothing
comment: An edited publication, that is, it has one or more editors (edited books, etc)

number
property disjoint with: gMonth
type: DatatypeProperty
equivalent property: hasNumber
property disjoint with: year
property disjoint with: bottomDataProperty
sub property of: topDataProperty
sub property of: hasNumber
comment: The Number part of citation of a publication.
domain: Publication
range: string

sameAffiliation
sub property of: topObjectProperty
property disjoint with: bottomObjectProperty
type: ObjectProperty
comment: Indicates that a person has same affiliation than another person (this is not necessarily transitive)
domain: Person
range: Person

University
type: Class
equivalent class: University
subclass of: Thing
subclass of: University
subclass of: Organization
subclass of: School
disjoint with: Nothing
comment: An institution for higher learning with teaching and research facilities constituting a graduate school and professional schools that award master's degrees and doctorates and an undergraduate division that awards bachelor's degrees.

Book Chapter
subclass of: Publication
type: Class
equivalent class: Article in Book
subclass of: Article in Book
subclass of: Thing
disjoint with: Nothing
equivalent class: Inbook
subclass of: Document
subclass of: Inbook
comment: A part of a book, such as a chapter (or section/preface) and/or a range of pages.

SwetoDblp Ontology
creator: Boanerges Aleman-Meza
type: Thing
type: Ontology
comment: This file specifies in RDF Schema format the classes and properties for SwetoDblp. These classes and properties are based on the internal LSDIS Library portal engine. Contact Person is Boanerges Aleman-Meza (baleman at uga dot edu).
version info: 2007-05-01

Thesis
subclass of: Document
subclass of: Publication
equivalent class: Thesis
subclass of: Thesis
disjoint with: Nothing
type: Class
subclass of: Thing
comment: A treatise advancing a new point of view resulting from research; usually a requirement for an advanced academic degree.

journal name
sub property of: hasJournal
type: DatatypeProperty
property disjoint with: year
property disjoint with: gMonth
property disjoint with: bottomDataProperty
equivalent property: hasJournal
sub property of: topDataProperty
comment: The name of a Journal, such as where an article appears
domain: Journal
range: string

last modified date
sub property of: topDataProperty
property disjoint with: bottomDataProperty
property disjoint with: gMonth
property disjoint with: year
type: DatatypeProperty
comment: The last modified date of a document.
domain: Document
range: string

coauthor
sub property of: topObjectProperty
property disjoint with: bottomObjectProperty
type: ObjectProperty
comment: Indicates that a person is co-author with another person
domain: Person
range: Person

chapter
sub property of: topDataProperty
property disjoint with: year
property disjoint with: gMonth
property disjoint with: bottomDataProperty
equivalent property: chapter
sub property of: Chapter
sub property of: chapter
equivalent property: Chapter
type: DatatypeProperty
comment: The chapter number of a publication
domain: Book Chapter
range: string

month
property disjoint with: year
sub property of: topDataProperty
equivalent property: month
sub property of: hasMonth
equivalent property: hasMonth
type: DatatypeProperty
property disjoint with: bottomDataProperty
property disjoint with: gMonth
sub property of: month
comment: The month part of the date of a foaf:Document.
domain: Document
range: string

Article
subclass of: Publication
subclass of: Thing
disjoint with: Nothing
subclass of: Article in Journal
equivalent class: Article in Journal
subclass of: Document
equivalent class: Article
subclass of: Article
type: Class
comment: An article from a journal or magazine.

Editor
sub property of: topObjectProperty
property disjoint with: bottomObjectProperty
type: ObjectProperty
comment: Indicates that a publication has a specific editor(s).
domain: Edited Publication
range: Seq

Edited Book
subclass of: Publication
subclass of: Book
disjoint with: Nothing
subclass of: Thing
type: Class
subclass of: Document
subclass of: Edited Publication
equivalent class: Edited-Book
subclass of: Edited-Book
comment: An edited book with an explicit publisher.

book title
sub property of: booktitle
property disjoint with: bottomDataProperty
sub property of: hasBooktitle
sub property of: topDataProperty
equivalent property: booktitle
type: DatatypeProperty
property disjoint with: gMonth
property disjoint with: year
equivalent property: hasBooktitle
comment: An alternative Book Title or the Book Title where an article appears, such as title of proceedings.
domain: Publication
range: string

School
disjoint with: Nothing
subclass of: Organization
subclass of: Thing
type: Class
comment: An organization where individuals receive education.

at organization
sub property of: topObjectProperty
property disjoint with: bottomObjectProperty
type: ObjectProperty
comment: Indicates that a publication originates or is related to a specific Organization.
domain: Publication
range: Organization

presentation
sub property of: topDataProperty
property disjoint with: bottomDataProperty
property disjoint with: gMonth
property disjoint with: year
type: DatatypeProperty
comment: The Electronic Edition of a Presentation of a publication
domain: Publication
range: string

Doctoral Dissertation
equivalent class: PhDThesis
subclass of: Publication
subclass of: Document
equivalent class: PhD Thesis
subclass of: PhDThesis
subclass of: PhD Thesis
subclass of: Thesis
subclass of: Thing
equivalent class: Phdthesis
disjoint with: Nothing
type: Class
subclass of: Phdthesis
comment: A dissertation written to receive a PhD.

cdrom
sub property of: topDataProperty
property disjoint with: bottomDataProperty
property disjoint with: gMonth
property disjoint with: year
type: DatatypeProperty
comment: The CDROM location of a Publication, as used by the ACM SIGMOD Anthology.
domain: Publication
range: string

Book
subclass of: Publication
equivalent class: Book
subclass of: Book
type: Class
subclass of: Thing
disjoint with: Nothing
subclass of: Document
comment: A book with an explicit publisher.

is Included in Proceedings
sub property of: topObjectProperty
property disjoint with: bottomObjectProperty
sub property of: containedInProceedings
equivalent property: containedInProceedings
type: ObjectProperty
comment: Indicates that a publication is included in a specific proceedings publication.
domain: Article in Proceedings
range: Proceedings

Publisher
disjoint with: Nothing
equivalent class: Publishing-House
subclass of: Organization
subclass of: Thing
subclass of: Publishing-House
type: Class
comment: An organization that, among other things, creates publishing periodicals, books or music.

volume
property disjoint with: year
sub property of: volume
property disjoint with: gMonth
equivalent property: volume
sub property of: topDataProperty
property disjoint with: bottomDataProperty
type: DatatypeProperty
comment: The Volume part of citation of a publication.
domain: Publication
range: string

Cites
sub property of: topObjectProperty
property disjoint with: bottomObjectProperty
sub property of: cite
equivalent property: cite
type: ObjectProperty
comment: Indicates that a publication cites another publication.
domain: Publication

Author
sub property of: topObjectProperty
property disjoint with: bottomObjectProperty
type: ObjectProperty
comment: Indicates that a publication is authored by a specific person(s).
domain: Publication
range: Seq

Publication
equivalent class: Publication
subclass of: Publication
disjoint with: Nothing
subclass of: Document
subclass of: Thing
type: Class
comment: Individual documents and collections of documents such as series, journals, etc.

year
property disjoint with: month
property disjoint with: ee
property disjoint with: volume
property disjoint with: chapter
property disjoint with: has-page-numbers
property disjoint with: abstract
property disjoint with: book title
property disjoint with: cdrom
property disjoint with: hasJournal
property disjoint with: hasMonth
property disjoint with: hasBooktitle
property disjoint with: booktitle
property disjoint with: pages
property disjoint with: isbn
equivalent property: year
property disjoint with: hasNumber
property disjoint with: gMonth
property disjoint with: presentation
property disjoint with: hasPages
sub property of: year
sub property of: topDataProperty
property disjoint with: bottomDataProperty
property disjoint with: Chapter
property disjoint with: number
property disjoint with: hasISBN
type: DatatypeProperty
property disjoint with: journal name
property disjoint with: last modified date
comment: The year part of the date of a foaf:Document.
domain: Document
range: gYear

ee
sub property of: topDataProperty
property disjoint with: bottomDataProperty
property disjoint with: gMonth
property disjoint with: year
type: DatatypeProperty
comment: The Electronic Edition of a publication
domain: Publication
range: string

Masters Thesis
equivalent class: Mastersthesis
subclass of: Mastersthesis
subclass of: MasterThesis
equivalent class: MasterThesis
subclass of: Publication
subclass of: Document
subclass of: Master Thesis
subclass of: Thesis
subclass of: Thing
disjoint with: Nothing
equivalent class: Master Thesis
type: Class
comment: A thesis written to receive a Master's degree.

Proceedings
subclass of: Document
type: Class
subclass of: Proceedings
subclass of: Publication
equivalent class: Proceedings
disjoint with: Nothing
subclass of: Thing
comment: A written account of what transpired at a meeting.

abstract
sub property of: topDataProperty
property disjoint with: bottomDataProperty
property disjoint with: gMonth
property disjoint with: year
type: DatatypeProperty
comment: The abstract of a document
domain: Document
range: string

pages
property disjoint with: year
type: DatatypeProperty
sub property of: has-page-numbers
equivalent property: pages
sub property of: pages
equivalent property: hasPages
equivalent property: has-page-numbers
sub property of: hasPages
property disjoint with: gMonth
sub property of: topDataProperty
property disjoint with: bottomDataProperty
comment: The Pages part of citation of a publication.
domain: Publication
range: string

at university
sub property of: topObjectProperty
property disjoint with: bottomObjectProperty
type: ObjectProperty
comment: Indicates that a publication originates or is related to a specific University.
domain: Publication
range: University