secApr
sub property of: topObjectProperty
property disjoint with: bottomObjectProperty
type: ObjectProperty
comment: The property that determines crop coefficient of second half month of April.
domain: CropCoefficient

has
sub property of: topObjectProperty
property disjoint with: bottomObjectProperty
type: ObjectProperty
comment: The property defines the has relationship between two classes.

Fish
disjoint with: Nothing
subclass of: Thing
type: Class
comment: The Class of paraphyletic group of organisms that consist of all gill-bearing aquatic craniate animals that lack limbs with digits.
label: माछा @np
subclass of: http://lodlaundromat.org/.well-known/genid/365359d12c3cfb7e29cb41867fe21bda#6

firstAug
sub property of: topObjectProperty
property disjoint with: bottomObjectProperty
type: ObjectProperty
comment: The property that determines crop coefficient of first half month of August.
domain: CropCoefficient

Evapotranspiration
disjoint with: Nothing
subclass of: Thing
type: Class
comment: The amount of evaporation and plant transpiration from the Earth's land surface to atmosphere. Evaporation accounts for the movement of water to the air from sources such as the soil, canopy interception, and water bodies.

Geography
disjoint with: Nothing
subclass of: Thing
type: Class
comment: Geography is the branch of knowledge that studies the lands, the features, the inhabitants, and the phenomena of the Earth.
subclass of: http://lodlaundromat.org/.well-known/genid/365359d12c3cfb7e29cb41867fe21bda#8

CropProduction
disjoint with: Nothing
subclass of: Thing
subclass of: Production
type: Class
comment: The Class of crop production.
label: बालीउत्पादन @np

Fruit
disjoint with: Nothing
subclass of: Thing
type: Class
comment: The Class of fleshy seed-associated structures of a plant that are sweet or sour and edible in the raw state, such as apples, oranges, grapes, strawberries, bananas, lemons etc.
label: फलफुल @np
subclass of: http://lodlaundromat.org/.well-known/genid/365359d12c3cfb7e29cb41867fe21bda#7

elev_min
sub property of: topObjectProperty
property disjoint with: bottomObjectProperty
type: ObjectProperty
comment: The property that determines the elev_min.
domain: Soil

Crop
disjoint with: Nothing
subclass of: Thing
type: Class
comment: The Class of agriculture crop whose product is harvested at some point of its growth stage.
comment: कृषि बाली सम्बन्धि जसको उत्पादन एक निस्चीत अबधिमा कात्न सकिन्छ @np

pig
sub property of: topObjectProperty
property disjoint with: bottomObjectProperty
type: ObjectProperty
comment: The property that determines pig.
domain: Livestock

Ward
disjoint with: Nothing
subclass of: Thing
type: Class
comment: Electoral wards/divisions are the base unit of Nepal administrative geography such that all higher units are built up from them. @np
label: वडा @np
subclass of: http://lodlaundromat.org/.well-known/genid/365359d12c3cfb7e29cb41867fe21bda#19

The property that determines rainfall in particular place.
sub property of: topObjectProperty
property disjoint with: bottomObjectProperty
type: ObjectProperty
domain: Rainfall
label: rainfall

buffalowMeat
sub property of: topObjectProperty
property disjoint with: bottomObjectProperty
type: ObjectProperty
comment: The property that determines the buffalow meat.
domain: MeatProduction

inWard
sub property of: topObjectProperty
property disjoint with: bottomObjectProperty
type: ObjectProperty
comment: The property that determines the geographical ward.

Station
disjoint with: Nothing
subclass of: Thing
type: Class
comment: An establishment equipped for observation and study. A place or position where a person or thing stands or is assigned to stand.
label: स्टेशन @np
subclass of: http://lodlaundromat.org/.well-known/genid/365359d12c3cfb7e29cb41867fe21bda#17

solarRediation
sub property of: topObjectProperty
property disjoint with: bottomObjectProperty
type: ObjectProperty
comment: The property that determines the portion of the electromagnetic radiation given off by the Sun, in particular infrared, visible, and ultraviolet light.
domain: Weather

Eto
disjoint with: Nothing
subclass of: Thing
type: Class
label: he evapotranspiration rate from a reference surface is called the reference crop evapotranspiration or reference evapotranspiration and is denoted as ETo. The reference surface is a hypothetical grass reference crop with specific characteristics.
subclass of: http://lodlaundromat.org/.well-known/genid/365359d12c3cfb7e29cb41867fe21bda#5

Meteorology
disjoint with: Nothing
subclass of: Thing
type: Class
label: The science that deals with the phenomena of the atmosphere, especially weather and weather conditions.
subclass of: http://lodlaundromat.org/.well-known/genid/365359d12c3cfb7e29cb41867fe21bda#12

MilkProduction
disjoint with: Nothing
subclass of: Thing
subclass of: Production
type: Class
comment: The Class of meat production.
label: दूधउत्पादन @np

Physiography
disjoint with: Nothing
subclass of: Geography
subclass of: Thing
type: Class
comment: The study of the natural features of the earth's surface, especially in its current aspects, including land formation, climate, currents, and distribution of flora and fauna.

developmentSatgeDays
sub property of: topObjectProperty
property disjoint with: bottomObjectProperty
type: ObjectProperty
comment: The property that determines development growing stage days of crop.
domain: CropGrowingDate

firstJul
sub property of: topObjectProperty
property disjoint with: bottomObjectProperty
type: ObjectProperty
comment: The property that determines crop coefficient of first half month of July.
domain: CropCoefficient

secFeb
sub property of: topObjectProperty
property disjoint with: bottomObjectProperty
type: ObjectProperty
comment: The property that determines crop coefficient of second half month of February.
domain: CropCoefficient

The property that determines crop coefficient of second half month of March.
sub property of: topObjectProperty
property disjoint with: bottomObjectProperty
type: ObjectProperty
label: secMar

yieldUnit
sub property of: topObjectProperty
property disjoint with: bottomObjectProperty
type: ObjectProperty
comment: The property that determines the unit of yield measure.

The property that determines the total fruit production.
sub property of: topObjectProperty
property disjoint with: bottomObjectProperty
type: ObjectProperty
domain: FruitProduction
label: fruitProduction

lateSeasonStageDays
sub property of: topObjectProperty
property disjoint with: bottomObjectProperty
type: ObjectProperty
comment: The property that determines late season growing stage days of crop.
domain: CropGrowingDate

firstNov
sub property of: topObjectProperty
property disjoint with: bottomObjectProperty
type: ObjectProperty
comment: The property that determines crop coefficient of first half month of November.
domain: CropCoefficient

The property that determines crop coefficient for initial stage.
sub property of: topObjectProperty
property disjoint with: bottomObjectProperty
type: ObjectProperty
domain: CropCoefficient
label: kcForInitialStage

firstApr
sub property of: topObjectProperty
property disjoint with: bottomObjectProperty
type: ObjectProperty
comment: The property that determines crop coefficient of first half month of April.
domain: CropCoefficient

vapor
sub property of: topObjectProperty
property disjoint with: bottomObjectProperty
type: ObjectProperty
comment: The property that determines the water present in air in the form of gas.

The property that determines measurement angle.
sub property of: topObjectProperty
property disjoint with: bottomObjectProperty
type: ObjectProperty
label: angle

zonaldd_id
sub property of: topObjectProperty
property disjoint with: bottomObjectProperty
type: ObjectProperty
comment: The property that determines the zonaldd_id identification.

The property that determines cattle.
sub property of: topObjectProperty
property disjoint with: bottomObjectProperty
type: ObjectProperty
domain: Livestock
label: cattle

CerealCropProduction
disjoint with: Nothing
subclass of: CropProduction
subclass of: Thing
subclass of: Production
type: Class
comment: The Class of cereal crop production.
label: अनाजउत्पादन @np

egg
sub property of: topObjectProperty
property disjoint with: bottomObjectProperty
type: ObjectProperty
comment: The property that determines the Egg.
domain: Egg

buffalow
sub property of: topObjectProperty
property disjoint with: bottomObjectProperty
type: ObjectProperty
comment: The property that determines buffalow.
domain: Livestock

noOfLivestock
sub property of: topObjectProperty
property disjoint with: bottomObjectProperty
type: ObjectProperty
comment: The property that determines the total number of livestock.
domain: LivestockProduction

elev_min
sub property of: topObjectProperty
property disjoint with: bottomObjectProperty
type: ObjectProperty
comment: The property that determines the elevation Zone.
domain: Soil

etoOfNepalInJune
sub property of: topObjectProperty
property disjoint with: bottomObjectProperty
type: ObjectProperty
comment: The property that determines the mean eto value of Nepal in June month.
domain: Evapotranspiration

etoOfNepalInJuly
sub property of: topObjectProperty
property disjoint with: bottomObjectProperty
type: ObjectProperty
comment: The property that determines the mean eto value of Nepal in July month.
domain: Evapotranspiration

precipitat
sub property of: topObjectProperty
property disjoint with: bottomObjectProperty
type: ObjectProperty
comment: The property that determines the any product of the condensation of atmospheric water vapour that falls under gravity.
domain: EtoStation

windSpeed
sub property of: topObjectProperty
property disjoint with: bottomObjectProperty
type: ObjectProperty
comment: The property that determines the fundamental atmospheric rate.
domain: Weather

dcode
sub property of: topObjectProperty
property disjoint with: bottomObjectProperty
type: ObjectProperty
comment: The property that determines district identificaiton number.

REC_NUM_1
sub property of: topObjectProperty
property disjoint with: bottomObjectProperty
type: ObjectProperty
comment: The property that determines the REC_NUM_1.
domain: Soil

inDevelopmentRegion
sub property of: topObjectProperty
property disjoint with: bottomObjectProperty
type: ObjectProperty
comment: The property that determines the geographical region. For particular Nepal has 5 development regions.
domain: DevelopmentRegion

meandaily
sub property of: topObjectProperty
property disjoint with: bottomObjectProperty
type: ObjectProperty
comment: The property that determines the mean values of a day.
domain: EtoStation

airport
sub property of: topObjectProperty
property disjoint with: bottomObjectProperty
type: ObjectProperty
comment: The property that determines the airport number.

Cereal
disjoint with: Nothing
subclass of: Crop
subclass of: Thing
type: Class
comment: The Class of agriculture cereal crop.
comment: अनाज सम्बन्धि कृषि बाली @np
label: अनाज @np
subclass of: http://lodlaundromat.org/.well-known/genid/365359d12c3cfb7e29cb41867fe21bda#1

The property that determines total minimum growing days of crop.
sub property of: topObjectProperty
property disjoint with: bottomObjectProperty
type: ObjectProperty
domain: CropGrowingDate
label: totalMinGrowingDays

MeatProduction
disjoint with: Nothing
subclass of: Thing
subclass of: Production
type: Class
comment: The Class of meat production.
label: मासुउत्पादन @np

Production
disjoint with: Nothing
subclass of: Thing
type: Class
comment: The Class of agriculture production related to things like crop, livestock, fish etc.
comment: बाली, पशुपालन, माछा आदि जस्ता कृषि सम्बन्धित कुराहरु को उत्पादन @np
label: उत्पादन @np
subclass of: http://lodlaundromat.org/.well-known/genid/365359d12c3cfb7e29cb41867fe21bda#14

firstFeb
sub property of: topObjectProperty
property disjoint with: bottomObjectProperty
type: ObjectProperty
comment: The property that determines crop coefficient of first half month of February.
domain: CropCoefficient

femalePopulation
sub property of: topObjectProperty
property disjoint with: bottomObjectProperty
type: ObjectProperty
comment: The property that determines total population of female.

District
disjoint with: Nothing
subclass of: Thing
type: Class
comment: Nepal is divided into 75 districts.
label: जिल्ला @np
subclass of: http://lodlaundromat.org/.well-known/genid/365359d12c3cfb7e29cb41867fe21bda#3

firstMar
sub property of: topObjectProperty
property disjoint with: bottomObjectProperty
type: ObjectProperty
comment: The property that determines crop coefficient of first half month of March.
domain: CropCoefficient

toBasin
sub property of: topObjectProperty
property disjoint with: bottomObjectProperty
type: ObjectProperty
comment: The property that determines another basin.
domain: DevelopmentRegion

minimumGrowingDays
sub property of: topObjectProperty
property disjoint with: bottomObjectProperty
type: ObjectProperty
comment: The property that determines minimum total growing days of crop.
domain: CropGrowingDate

LCODE_GEN
sub property of: topObjectProperty
property disjoint with: bottomObjectProperty
type: ObjectProperty
comment: The property that determines the LCODE_GEN.
domain: Soil

numberOfHenEgg
sub property of: topObjectProperty
property disjoint with: bottomObjectProperty
type: ObjectProperty
comment: The property that determines the total number of hen egg.
domain: EggProduction

zonaldd
sub property of: topObjectProperty
property disjoint with: bottomObjectProperty
type: ObjectProperty
comment: The property that determines the zonaldd.

FruitProduction
disjoint with: Nothing
subclass of: Thing
subclass of: Production
type: Class
comment: The Class of fruit production.
label: फलफुलउत्पादन @np

milkingCow
sub property of: topObjectProperty
property disjoint with: bottomObjectProperty
type: ObjectProperty
comment: The property that determines number of cow which gives milk.
domain: MilkProduction

x
sub property of: topObjectProperty
property disjoint with: bottomObjectProperty
type: ObjectProperty
comment: The property that determines the coordinates of x.

slope_med
sub property of: topObjectProperty
property disjoint with: bottomObjectProperty
type: ObjectProperty
comment: The property that determines the slope_med.
domain: Soil

produce
sub property of: topObjectProperty
property disjoint with: bottomObjectProperty
type: ObjectProperty
comment: The property that determines produce like fish, meat, fruit production.

numberOfDuck
sub property of: topObjectProperty
property disjoint with: bottomObjectProperty
type: ObjectProperty
comment: The property that determines the total number of duck.
domain: EggProduction

collect
sub property of: topObjectProperty
property disjoint with: bottomObjectProperty
type: ObjectProperty
comment: The property that deterfines the collection of data like rainfall, weather etc.

The property that determines production of fish.
sub property of: topObjectProperty
property disjoint with: bottomObjectProperty
type: ObjectProperty
domain: FishProduction
label: fishProduction

ElevationRegion
disjoint with: Nothing
subclass of: Thing
type: Class
label: The Class of ElevationRegion

Rainfall
disjoint with: Nothing
subclass of: Thing
type: Class
label: वर्षा @np
subclass of: http://lodlaundromat.org/.well-known/genid/365359d12c3cfb7e29cb41867fe21bda#15
deprecated: Rain is a form of droplets that have condensed from atmospheric water vapor and then precipitated—that is, become heavy enough to fall under gravity.

woolProduction
sub property of: topObjectProperty
property disjoint with: bottomObjectProperty
type: ObjectProperty
comment: The property that determines the total number of sheep.
domain: WoolProduction

parent_mat
sub property of: topObjectProperty
property disjoint with: bottomObjectProperty
type: ObjectProperty
comment: The property that determines the parent_mat.
domain: Soil

elev_max
sub property of: topObjectProperty
property disjoint with: bottomObjectProperty
type: ObjectProperty
comment: The property that determines the elev_max.
domain: Soil

yield
sub property of: topObjectProperty
property disjoint with: bottomObjectProperty
type: ObjectProperty
comment: The property that determines the yield production.
domain: CropProduction
domain: FruitProduction

objectid
sub property of: topObjectProperty
property disjoint with: bottomObjectProperty
type: ObjectProperty
comment: The property that determines the identification number of object.

The property that determines production of milk from cow.
sub property of: topObjectProperty
property disjoint with: bottomObjectProperty
type: ObjectProperty
domain: MilkProduction
label: cowMilk

The property that determines the mean eto value of Nepal in September month.
sub property of: topObjectProperty
property disjoint with: bottomObjectProperty
type: ObjectProperty
domain: Evapotranspiration
label: etoOfNepalInSeptember

etoOfNepalInMay
sub property of: topObjectProperty
property disjoint with: bottomObjectProperty
type: ObjectProperty
comment: The property that determines the mean eto value of Nepal in May month.

inVdc
sub property of: topObjectProperty
property disjoint with: bottomObjectProperty
type: ObjectProperty
comment: The property that determines vdc (villege development commettee) area.
domain: Vdc

etoOfNepalInApril
sub property of: topObjectProperty
property disjoint with: bottomObjectProperty
type: ObjectProperty
comment: The property that determines the mean eto value of Nepal in April month.
domain: Evapotranspiration

Country
disjoint with: Nothing
subclass of: Thing
type: Class
comment: A region considered to be the territory of a recognised political state.
label: देश @np

LivestockProduction
disjoint with: Nothing
subclass of: Thing
subclass of: Production
type: Class
comment: The Class of livestock production.
label: पशुपालनउत्पादन @np

productionUnit
sub property of: topObjectProperty
property disjoint with: bottomObjectProperty
type: ObjectProperty
comment: The property that determines the unit of production measure.

Zone
disjoint with: Nothing
subclass of: Thing
type: Class
comment: Nepal is divided into 14 administrative zones.
label: अञ्चल @np

Precipitation
disjoint with: Nothing
subclass of: Thing
type: Class
comment: The Class of product of the condensation of atmospheric water vapour that falls under gravity.The main forms of precipitation include drizzle, rain, sleet, snow, graupel and hail.
label: सापेक्षीतआद्रता @np

secDec
sub property of: topObjectProperty
property disjoint with: bottomObjectProperty
type: ObjectProperty
comment: The property that determines crop coefficient of second half month of December.
domain: CropCoefficient

inDistrict
sub property of: topObjectProperty
property disjoint with: bottomObjectProperty
type: ObjectProperty
comment: The property that determines the things is in district.

CropGrowingDate
disjoint with: Nothing
subclass of: Thing
type: Class
comment: The class which define the growing date of crops in each stage.

rcode
sub property of: topObjectProperty
property disjoint with: bottomObjectProperty
type: ObjectProperty
comment: The property that determines region identificaiton number.

meatProduction
sub property of: topObjectProperty
property disjoint with: bottomObjectProperty
type: ObjectProperty
comment: The property that determines the production of meat.

rpoly
sub property of: topObjectProperty
property disjoint with: bottomObjectProperty
type: ObjectProperty
comment: The property that determines the geogrphical rpoly.

Milk
disjoint with: Nothing
subclass of: Thing
type: Class
label: The Class of white liquid produced by the mammary glands of mammals like cow, buffalow, goat, yak, sheep etc.
label: दूध @np
subclass of: http://lodlaundromat.org/.well-known/genid/365359d12c3cfb7e29cb41867fe21bda#13

Soil
disjoint with: Nothing
subclass of: Thing
type: Class
comment: Soil
comment: The Class of Soil.
comment: माटो आदि सम्बन्धि @np
comment: माटो @np

lpoly
sub property of: topObjectProperty
property disjoint with: bottomObjectProperty
type: ObjectProperty
comment: The property that determines the geogrphical lpoly.

Egg
disjoint with: Nothing
subclass of: Thing
type: Class
comment: The Class of egg which is laid by hen, duck, bird etc.
comment: अण्डा जुन कुखुरा, हास, चरा आदीले दिने गर्छ @np
label: अन्डा @np
subclass of: http://lodlaundromat.org/.well-known/genid/365359d12c3cfb7e29cb41867fe21bda#4

numberOfSheep
sub property of: topObjectProperty
property disjoint with: bottomObjectProperty
type: ObjectProperty
comment: The property that determines the total number of sheep.
domain: LivestockProduction

initialStageDays
sub property of: topObjectProperty
property disjoint with: bottomObjectProperty
type: ObjectProperty
comment: The property that determines initial growing stage days of crop.
domain: CropGrowingDate

The property that determines crop coefficient of second half month of January.
sub property of: topObjectProperty
property disjoint with: bottomObjectProperty
type: ObjectProperty
domain: CropCoefficient
label: secJan

Ecology
disjoint with: Nothing
subclass of: Thing
type: Class
comment: Ecology is the scientific study of the relationships that living organisms have with each other and with their abiotic environment.

secOct
sub property of: topObjectProperty
property disjoint with: bottomObjectProperty
type: ObjectProperty
comment: The property that determines crop coefficient of second half month of October.
domain: CropCoefficient

Settlement
disjoint with: Nothing
subclass of: Thing
type: Class
comment: The act or state of settling or being settled. The act of making stable or putting on a permanent basis.
subclass of: http://lodlaundromat.org/.well-known/genid/365359d12c3cfb7e29cb41867fe21bda#16

productionArea
sub property of: topObjectProperty
property disjoint with: bottomObjectProperty
type: ObjectProperty
comment: The property that determines area effective for agriculture production.
domain: CropProduction
domain: FruitProduction

The property that determines the linkfield.
sub property of: topObjectProperty
property disjoint with: bottomObjectProperty
type: ObjectProperty
domain: Soil
label: linkfield

buffalowMilk
sub property of: topObjectProperty
property disjoint with: bottomObjectProperty
type: ObjectProperty
comment: The property that determines production of milk from buffalow.
domain: MilkProduction

rowid
sub property of: topObjectProperty
property disjoint with: bottomObjectProperty
type: ObjectProperty
comment: The property that determines row identification number for references.

lut
sub property of: topObjectProperty
property disjoint with: bottomObjectProperty
type: ObjectProperty
comment: The property that determines the lut.

station
sub property of: topObjectProperty
property disjoint with: bottomObjectProperty
type: ObjectProperty
comment: The property that determines the place or position where a person or thing stands or is assigned to stand.
domain: Station

MeteorologyStation
disjoint with: Nothing
subclass of: Station
subclass of: Thing
type: Class
comment: he Class of station where data related to meteorology is collected.

goat
sub property of: topObjectProperty
property disjoint with: bottomObjectProperty
type: ObjectProperty
comment: The property that determines goat.
domain: Livestock

vcode
sub property of: topObjectProperty
property disjoint with: bottomObjectProperty
type: ObjectProperty
comment: The property that determines vdc identificaiton number.
domain: Vdc

firstDec
sub property of: topObjectProperty
property disjoint with: bottomObjectProperty
type: ObjectProperty
comment: The property that determines crop coefficient of first half month of December.
domain: CropCoefficient

kcForDevelopmentStage
sub property of: topObjectProperty
property disjoint with: bottomObjectProperty
type: ObjectProperty
comment: The property that determines crop coefficient for development stage.
domain: CropCoefficient

region
sub property of: topObjectProperty
property disjoint with: bottomObjectProperty
type: ObjectProperty
comment: The property that determines region.
domain: Region

population
sub property of: topObjectProperty
property disjoint with: bottomObjectProperty
type: ObjectProperty
comment: The property that determines total population.

areaUnit
sub property of: topObjectProperty
property disjoint with: bottomObjectProperty
type: ObjectProperty
comment: The property that determines the unit of area measure.

DevelopmentRegion
disjoint with: Nothing
subclass of: Thing
type: Class
comment: A country is divided into different Development Region. Nepal is divided into 5 Development Regions.
label: विकासक्षेत्र @np
subclass of: http://lodlaundromat.org/.well-known/genid/365359d12c3cfb7e29cb41867fe21bda#2

kcForMidSeasonStage
sub property of: topObjectProperty
property disjoint with: bottomObjectProperty
type: ObjectProperty
comment: The property that determines crop coefficient for mid season stage.
domain: CropCoefficient

fruit
sub property of: topObjectProperty
property disjoint with: bottomObjectProperty
type: ObjectProperty
comment: The property that determines the name of fruit.
domain: Fruit

relief_med
sub property of: topObjectProperty
property disjoint with: bottomObjectProperty
type: ObjectProperty
comment: The property that determines the relief_med.
domain: Soil

fruitType
sub property of: topObjectProperty
property disjoint with: bottomObjectProperty
type: ObjectProperty
comment: The property that determines the type of fruit.
domain: FruitProduction

The property that determines total maximum growing days of crop.
sub property of: topObjectProperty
property disjoint with: bottomObjectProperty
type: ObjectProperty
domain: CropGrowingDate
label: totalMaxGrowingDays

landform
sub property of: topObjectProperty
property disjoint with: bottomObjectProperty
type: ObjectProperty
comment: The property that determines the landform.
domain: Soil

EggProduction
disjoint with: Nothing
subclass of: Thing
subclass of: Production
type: Class
comment: The Class of egg production. @np
label: अन्डाउत्पादन @np

fowl
sub property of: topObjectProperty
property disjoint with: bottomObjectProperty
type: ObjectProperty
comment: The property that determines fowl.
domain: Livestock

etoOfNepalInDecember
sub property of: topObjectProperty
property disjoint with: bottomObjectProperty
type: ObjectProperty
comment: The property that determines the mean eto value of Nepal in December month.
domain: Evapotranspiration

sheep
sub property of: topObjectProperty
property disjoint with: bottomObjectProperty
type: ObjectProperty
comment: The property that determines sheep.
domain: Livestock

totalGrowingDays
sub property of: topObjectProperty
property disjoint with: bottomObjectProperty
type: ObjectProperty
comment: The property that determines total growing days of crop.
domain: CropGrowingDate

secJun
sub property of: topObjectProperty
property disjoint with: bottomObjectProperty
type: ObjectProperty
comment: The property that determines crop coefficient of second half month of June.
domain: CropCoefficient

fid
sub property of: topObjectProperty
property disjoint with: bottomObjectProperty
type: ObjectProperty
comment: The property that determines the field identification number.

FishProduction
disjoint with: Nothing
subclass of: Thing
subclass of: Production
type: Class
comment: The Class of fish production. @np
label: माछाउत्पादन @np

The property that determines the mean eto value of Nepal in January month.
sub property of: topObjectProperty
property disjoint with: bottomObjectProperty
type: ObjectProperty
domain: Evapotranspiration
label: etoOfNepalInJanuary

numberOfDuckEgg
sub property of: topObjectProperty
property disjoint with: bottomObjectProperty
type: ObjectProperty
comment: The property that determines the total number of duck egg.
domain: EggProduction

fnode
sub property of: topObjectProperty
property disjoint with: bottomObjectProperty
type: ObjectProperty
comment: The property that determines the geogrphical fnode.

etoOfNepalInNovember
sub property of: topObjectProperty
property disjoint with: bottomObjectProperty
type: ObjectProperty
comment: The property that determines the mean eto value of Nepal in November month.
domain: Evapotranspiration

WoolProduction
disjoint with: Nothing
subclass of: Thing
subclass of: Production
type: Class
comment: The Class of wool production.
label: ऊनउत्पादन @np

CropCoefficient
disjoint with: Nothing
subclass of: Thing
type: Class
comment: The Class of CropCoefficient.

firstJan
sub property of: topObjectProperty
property disjoint with: bottomObjectProperty
type: ObjectProperty
comment: The property that determines crop coefficient of first half month of January.
domain: CropCoefficient

firstOct
sub property of: topObjectProperty
property disjoint with: bottomObjectProperty
type: ObjectProperty
comment: The property that determines crop coefficient of first half month of October.
domain: CropCoefficient

numberOfEgg
sub property of: topObjectProperty
property disjoint with: bottomObjectProperty
type: ObjectProperty
comment: The property that determines the total number of Egg.
domain: EggProduction

secSep
sub property of: topObjectProperty
property disjoint with: bottomObjectProperty
type: ObjectProperty
comment: The property that determines crop coefficient of second half month of September.
domain: CropCoefficient

etoOfNepalInFebruary
sub property of: topObjectProperty
property disjoint with: bottomObjectProperty
type: ObjectProperty
comment: The property that determines the mean eto value of Nepal in February month.
domain: Evapotranspiration

y
sub property of: topObjectProperty
property disjoint with: bottomObjectProperty
type: ObjectProperty
comment: The property that determines the coordinates of y.

totalNumberOfEgg
sub property of: topObjectProperty
property disjoint with: bottomObjectProperty
type: ObjectProperty
comment: The property that determines the total number of egg production in a year.

RainfallStation
disjoint with: Nothing
subclass of: Station
subclass of: Thing
type: Class
comment: The Class of station where rainfall data are collected.
label: वर्षास्टेशन @np

EtoStation
disjoint with: Nothing
subclass of: Station
subclass of: Thing
type: Class
comment: The Class of station where data of evapotranspiration are collected.

Headquarter
disjoint with: Nothing
subclass of: Thing
type: Class
comment: This is the place for administrative work. Every district has headquarter in Nepal.
label: सदरमुकाम @np
subclass of: http://lodlaundromat.org/.well-known/genid/365359d12c3cfb7e29cb41867fe21bda#9

zcode
sub property of: topObjectProperty
property disjoint with: bottomObjectProperty
type: ObjectProperty
comment: The property that determines zone identificaiton number.

etoOfNepalInMarch
sub property of: topObjectProperty
property disjoint with: bottomObjectProperty
type: ObjectProperty
comment: The property that determines the mean eto value of Nepal in March month.
domain: Evapotranspiration

humidity
sub property of: topObjectProperty
property disjoint with: bottomObjectProperty
type: ObjectProperty
comment: The property that determines the amount of water vapor in the air.
domain: Weather

wcode
sub property of: topObjectProperty
property disjoint with: bottomObjectProperty
type: ObjectProperty
comment: The property that determines ward identificaiton number.
domain: Ward

wool
sub property of: topObjectProperty
property disjoint with: bottomObjectProperty
type: ObjectProperty
comment: The property that determines wool.
domain: Wool

waterSurfaceArea
sub property of: topObjectProperty
property disjoint with: bottomObjectProperty
type: ObjectProperty
comment: The property that determines surface area covered by water.
domain: FishProduction

scale
sub property of: topObjectProperty
property disjoint with: bottomObjectProperty
type: ObjectProperty
comment: The property that determines scale of measurement.
domain: Vdc

fish
sub property of: topObjectProperty
property disjoint with: bottomObjectProperty
type: ObjectProperty
comment: The property that determines fish.
domain: Fish

secMay
sub property of: topObjectProperty
property disjoint with: bottomObjectProperty
type: ObjectProperty
comment: The property that determines crop coefficient of second half month of May.
domain: CropCoefficient

airportID
sub property of: topObjectProperty
property disjoint with: bottomObjectProperty
type: ObjectProperty
comment: The property that determines the airport ID.

milkingBuffalow
sub property of: topObjectProperty
property disjoint with: bottomObjectProperty
type: ObjectProperty
comment: The property that determines number of buffalow which gives milk.
domain: MilkProduction

Weather
disjoint with: Nothing
subclass of: Thing
type: Class
comment: The Class Weather is the state of the atmosphere, to the degree that it is hot or cold, wet or dry, calm or stormy, clear or cloudy.
comment: हावापनी आदि सम्बन्धि @np
label: हावापनी @np

kcForLateSeasonStage
sub property of: topObjectProperty
property disjoint with: bottomObjectProperty
type: ObjectProperty
comment: The property that determines crop coefficient for late season stage.
domain: CropCoefficient

mutton
sub property of: topObjectProperty
property disjoint with: bottomObjectProperty
type: ObjectProperty
comment: The property that determines the mutton (meat).
domain: MeatProduction

The property that determines crop coefficient of second half month of August.
sub property of: topObjectProperty
property disjoint with: bottomObjectProperty
type: ObjectProperty
domain: CropCoefficient
label: secAug

etoOfNepalInOctober
sub property of: topObjectProperty
property disjoint with: bottomObjectProperty
type: ObjectProperty
comment: The property that determines the mean eto value of Nepal in October month.
domain: Evapotranspiration

numberOfHen
sub property of: topObjectProperty
property disjoint with: bottomObjectProperty
type: ObjectProperty
comment: The property that determines the total number of hen.
domain: EggProduction

noOfFishPond
sub property of: topObjectProperty
property disjoint with: bottomObjectProperty
type: ObjectProperty
comment: The property that determines number of fish pond.

maximumGrowingDays
sub property of: topObjectProperty
property disjoint with: bottomObjectProperty
type: ObjectProperty
comment: he property that determines maximum total growing days of crop.
domain: CropGrowingDate

milk
sub property of: topObjectProperty
property disjoint with: bottomObjectProperty
type: ObjectProperty
comment: The property that determines milk of Cows, Buffalows, etc.
domain: Milk

dominant_s
sub property of: topObjectProperty
property disjoint with: bottomObjectProperty
type: ObjectProperty
comment: The property that determines the dominant_s.
domain: Soil

Region
disjoint with: Nothing
subclass of: Thing
type: Class
comment: The Class of areas broadly divided by physical characteristics (physical geography), human-impact characteristics (human geography), and the interaction of humanity and the environment (environmental geography).
label: क्षेत्र @np

firstJun
sub property of: topObjectProperty
property disjoint with: bottomObjectProperty
type: ObjectProperty
comment: The property that determines crop coefficient of first half month of June.
domain: CropCoefficient

hasPart
sub property of: topObjectProperty
property disjoint with: bottomObjectProperty
type: ObjectProperty
comment: The property that defines the a geographical region is a part of another a another geopraphical region.

The property that determines the total amount of meat produced.
sub property of: topObjectProperty
property disjoint with: bottomObjectProperty
type: ObjectProperty
domain: MeatProduction
label: totalMeat

locatedIn
sub property of: topObjectProperty
property disjoint with: bottomObjectProperty
type: ObjectProperty
comment: The property that determine location of one thing to a place.

house
sub property of: topObjectProperty
property disjoint with: bottomObjectProperty
type: ObjectProperty
comment: The property that determines house where family livehouse.

midSeasonStageDays
sub property of: topObjectProperty
property disjoint with: bottomObjectProperty
type: ObjectProperty
comment: The property that determines mid season growing stage days of crop.
domain: CropGrowingDate

firstSep
sub property of: topObjectProperty
property disjoint with: bottomObjectProperty
type: ObjectProperty
comment: The property that determines crop coefficient of first half month of September.
domain: CropCoefficient

production
sub property of: topObjectProperty
property disjoint with: bottomObjectProperty
type: ObjectProperty
domain: WoolProduction
domain: FishProduction
domain: EggProduction
domain: MilkProduction
domain: LivestockProduction
comment: The property that determines the production.
domain: MeatProduction
domain: CropProduction
domain: FruitProduction

inZone
sub property of: topObjectProperty
property disjoint with: bottomObjectProperty
type: ObjectProperty
comment: The property that determines zone area.
domain: Zone

etoOfNepalYearMean
sub property of: topObjectProperty
property disjoint with: bottomObjectProperty
type: ObjectProperty
comment: The property that determines the mean eto value of Nepal throughout the year.
domain: CropGrowingDate

secJul
sub property of: topObjectProperty
property disjoint with: bottomObjectProperty
type: ObjectProperty
comment: The property that determines crop coefficient of second half month of July.
domain: CropCoefficient

Vdc
disjoint with: Nothing
subclass of: Thing
type: Class
comment: It is division of district into different area.
label: गाविस @np
subclass of: http://lodlaundromat.org/.well-known/genid/365359d12c3cfb7e29cb41867fe21bda#18

malePopulation
sub property of: topObjectProperty
property disjoint with: bottomObjectProperty
type: ObjectProperty
comment: The property that determines total population of male.

tnode
sub property of: topObjectProperty
property disjoint with: bottomObjectProperty
type: ObjectProperty
comment: The property that determines the geogrphical tnode.

duck
sub property of: topObjectProperty
property disjoint with: bottomObjectProperty
type: ObjectProperty
comment: The property that determines duck.

Livestock
disjoint with: Nothing
subclass of: Thing
type: Class
comment: The class which determines the livestock.
subclass of: http://lodlaundromat.org/.well-known/genid/365359d12c3cfb7e29cb41867fe21bda#10

Wool
disjoint with: Nothing
subclass of: Thing
type: Class
comment: The Class of textile fiber obtained from sheep and certain other animals, including cashmere from goats, mohair from goats, qiviut from muskoxen, angora from rabbits, and other types of wool from camelids.
label: ऊन @np
subclass of: http://lodlaundromat.org/.well-known/genid/365359d12c3cfb7e29cb41867fe21bda#20

firstMay
sub property of: topObjectProperty
property disjoint with: bottomObjectProperty
type: ObjectProperty
comment: The property that determines crop coefficient of first half month of May.
domain: CropCoefficient

Meat
disjoint with: Nothing
subclass of: Thing
type: Class
comment: The Class of Meat is animal flesh that is eaten as food.
label: मासु @np
subclass of: http://lodlaundromat.org/.well-known/genid/365359d12c3cfb7e29cb41867fe21bda#11

secNov
sub property of: topObjectProperty
property disjoint with: bottomObjectProperty
type: ObjectProperty
comment: The property that determines crop coefficient of second half month of November.
domain: CropCoefficient

etoOfNepalInAugust
sub property of: topObjectProperty
property disjoint with: bottomObjectProperty
type: ObjectProperty
comment: The property that determines the mean eto value of Nepal in August month.
domain: Evapotranspiration