ComisionDeBiblioteca
subclass of: Resource
subclass of: Thing
type: Class
comment: La comision del congreso encargada de la biblioteca, formada por el presidente de la camara de diputados, el presidente del senado y la directora de la biblioteca.

areaDe
range: Thing
domain: Thing
range: SubJefatura
inverse of: tieneArea
type: Property
type: ObjectProperty
comment: Permite definir que un area es parte de otra unidad organizacional de mayor jerarquia.
domain: Area
range: Departamento
sub property of: esUnidadDe
range: Resource
domain: Resource
domain: UnidadOrganizacional
domain: SubOrganismo
domain: Organizacion
range: SubOrganismo
range: UnidadOrganizacional
range: Organizacion

UnidadOrganizacional
subclass of: Resource
subclass of: Thing
type: Class
comment: Unidad organica que depende de otra.
subclass of: Organizacion

Instante
subclass of: Resource
subclass of: Thing
type: Class
comment: Determina un instante de tiempo

SubJefatura
subclass of: Resource
subclass of: Thing
type: Class
comment: Corresponde a una unidad organica intermedia entre un departamento y un area.
subclass of: SubOrganismo
subclass of: UnidadOrganizacional
subclass of: Organizacion

Sueldo
subclass of: Resource
subclass of: Thing
type: Class
comment: El sueldo recibido por un periodo trabajado.

PeriodoDelCargo
subclass of: Resource
subclass of: Thing
type: Class
comment: Define el periodo temporal que un funcionario puede ocupar un cargo.
subclass of: Instante

esParteDeUnidadOrganica
range: Thing
domain: Thing
inverse of: tieneCargoAsociado
type: Property
type: ObjectProperty
comment: Relaciona un cargo con una unidad organizativa.
domain: Cargo
range: SubOrganismo
domain: Resource
range: UnidadOrganizacional
range: Resource
range: Organizacion

Funcionario
subclass of: Resource
subclass of: Thing
type: Class
comment: Una persona que ademas es funcionario de la BCN.
subclass of: Persona

perteneceARegion
range: Thing
domain: Thing
type: Property
type: ObjectProperty
comment: Permite definir que una entidad geografica de menor jerarquia pertenece a una region.
domain: Funcionario
range: Region
domain: Persona
domain: Resource
range: Resource
range: GeographicalPlace

tieneDireccion
range: Thing
domain: Thing
type: Property
type: ObjectProperty
comment: Indica que la comision de biblioteca se relaciona con la direccion.
domain: ComisionDeBiblioteca
range: Direccion
sub property of: tieneUnidadesDependientes
range: SubOrganismo
range: Resource
range: UnidadOrganizacional
range: Organizacion
domain: SubOrganismo
domain: Resource
domain: UnidadOrganizacional
domain: Organizacion

Area
subclass of: Resource
subclass of: Thing
type: Class
comment: Describe un area (unidad organica) de la BCN, es de menor jerarquia que un departamento.
subclass of: SubOrganismo
subclass of: Organizacion
subclass of: UnidadOrganizacional

Unidad
subclass of: Thing
subclass of: Resource
type: Class
comment: Representa una unidad organizativa de menor jerarqu�a respecto a un �rea.
subclass of: SubOrganismo
subclass of: UnidadOrganizacional
subclass of: Organizacion

tieneSuperiorDirecto
range: Thing
domain: Thing
type: Property
type: ObjectProperty
comment: Indica el superior directo de un cargo especifico.
domain: Cargo
range: Cargo
domain: Resource
range: Resource

PeriodoPorHonorarios
subclass of: Resource
type: Class
comment: Describe un periodo de trabajo por honorarios.

tieneUnidadesDependientes
range: Thing
domain: Thing
type: Property
type: ObjectProperty
comment: Indica que una unidad organizativa tiene unidades dependientes.
domain: SubOrganismo
range: SubOrganismo
inverse of: dependeDe
domain: UnidadOrganizacional
domain: Organizacion
domain: Resource
range: UnidadOrganizacional
range: Resource
range: Organizacion

tieneArea
range: Thing
domain: Thing
type: Property
type: ObjectProperty
comment: Indica que una unidad organizativa tiene un area.
domain: Departamento
domain: SubJefatura
range: Area
sub property of: tieneUnidad
inverse of: areaDe
domain: Organizacion
domain: SubOrganismo
domain: UnidadOrganizacional
domain: Resource
range: Resource
range: UnidadOrganizacional
range: Organizacion
range: SubOrganismo

Region
subclass of: Resource
subclass of: Thing
type: Class
comment: Una region geografica del pais.
subclass of: GeographicalPlace

PresidenteDelSenado
subclass of: Resource
subclass of: Thing
type: Class
comment: Un semador qeu ademas es presidente del senado.

tieneJefe
range: Thing
domain: Thing
type: Property
type: ObjectProperty
comment: Indica que una unidad organizativa tiene un jefe.
domain: SubOrganismo
range: Funcionario
domain: UnidadOrganizacional
domain: Organizacion
domain: Resource
range: Resource
range: Persona

tieneUnidad
range: Thing
domain: Thing
type: ObjectProperty
comment: relaciona una unidad con el area al que pertenece.
domain: Area
range: Unidad
sub property of: tieneUnidad
type: Property
domain: UnidadOrganizacional
domain: SubOrganismo
domain: Organizacion
domain: Resource
range: UnidadOrganizacional
range: Resource
range: SubOrganismo
range: Organizacion

Organizacion
subclass of: Resource
subclass of: Thing
type: Class
comment: Una unidad organica de mas alto nivel.

Cargo
subclass of: Resource
subclass of: Thing
type: Class
comment: Define el cargo que un funcionario puede tener por un periodo de tiempo.

tienePeriodoPorCargo
range: Thing
domain: Thing
type: Property
type: ObjectProperty
comment: Indica el periodo que cumple un cargo particular.
domain: Cargo
range: PeriodoDelCargo
inverse of: tieneCargo
domain: Resource
range: Resource
range: Instante

tieneCargoAsociado
range: Thing
domain: Thing
type: Property
type: ObjectProperty
comment: Indica los cargos asociados a un suborganismo.
domain: SubOrganismo
range: Cargo
inverse of: esParteDeUnidadOrganica
domain: UnidadOrganizacional
domain: Organizacion
domain: Resource
range: Resource

tieneDepartamento
range: Thing
domain: Thing
type: Property
type: ObjectProperty
comment: Indica que una unidad organizativa tiene departamentos.
domain: Direccion
range: Departamento
sub property of: tieneUnidad
inverse of: departamentoDe
domain: Organizacion
domain: UnidadOrganizacional
domain: Resource
domain: SubOrganismo
range: SubOrganismo
range: Resource
range: UnidadOrganizacional
range: Organizacion

departamentoDe
range: Thing
domain: Thing
type: Property
type: ObjectProperty
comment: Indica que una unidad de tipo departamento pertenece a una unidad organizativa superior.
domain: Departamento
range: Direccion
sub property of: esUnidadDe
inverse of: tieneDepartamento
range: Resource
domain: Resource
domain: Organizacion
domain: SubOrganismo
domain: UnidadOrganizacional
range: SubOrganismo
range: UnidadOrganizacional
range: Organizacion

dependeDe
range: Thing
domain: Thing
type: Property
type: ObjectProperty
comment: Indica que un organismo depende de otro.
domain: SubOrganismo
range: SubOrganismo
inverse of: tieneUnidadesDependientes
domain: UnidadOrganizacional
domain: Organizacion
domain: Resource
range: UnidadOrganizacional
range: Resource
range: Organizacion

Departamento
subclass of: Resource
subclass of: Thing
type: Class
comment: Define un departamento (unidad organica) dentro de la BCN, es de mayor jerarquia que un area y depende de la direccion.
subclass of: SubOrganismo
subclass of: Organizacion
subclass of: UnidadOrganizacional

constituidaPor
range: Thing
domain: Thing
type: Property
type: ObjectProperty
comment: Permite definir los elementos que componen a la comision de biblioteca.
domain: ComisionDeBiblioteca
range: PresidenteDeLaCamaraDeDiputados
range: PresidenteDelSenado
range: Funcionario
domain: Resource
range: Resource
range: Persona

tieneSubJefatura
range: Thing
domain: Thing
type: ObjectProperty
comment: Indica que una suborganizacion tiene subjefatura.
domain: Departamento
range: SubJefatura
sub property of: tieneUnidad
type: Property
domain: Organizacion
domain: SubOrganismo
domain: UnidadOrganizacional
domain: Resource
range: SubOrganismo
range: UnidadOrganizacional
range: Resource
range: Organizacion

SubOrganismo
subclass of: Resource
subclass of: Thing
type: Class
comment: Corresponde a una super clase que determina la estructura de una unidad organica.
subclass of: UnidadOrganizacional
subclass of: Organizacion

tieneCargoEnPeriodo
range: Thing
domain: Thing
type: Property
type: ObjectProperty
comment: Indica el o los periodos en determinados cargos que puede tener un funcionario.
domain: Funcionario
range: PeriodoPorHonorarios
range: PeriodoDelCargo
inverse of: tieneFuncionario
domain: Persona
domain: Resource
range: Resource
range: Instante

Rol
subclass of: Resource
subclass of: Thing
type: Class
comment: El rol que puede tomar una persona.

unidadRelacionada
range: Thing
domain: Thing
type: Property
type: ObjectProperty
comment: Indica las unidades relacionadas a un organismo.
domain: SubOrganismo
range: SubOrganismo
domain: UnidadOrganizacional
domain: Organizacion
domain: Resource
range: UnidadOrganizacional
range: Resource
range: Organizacion

Persona
subclass of: Resource
subclass of: Thing
type: Class
comment: Describe la estructura basica de una persona.

tieneClientes
range: Thing
domain: Thing
type: Property
type: ObjectProperty
comment: Indica que una unidad organizativa tiene clientes.
domain: SubOrganismo
range: Organizacion
domain: UnidadOrganizacional
domain: Organizacion
domain: Resource
range: Resource

PresidenteDeLaCamaraDeDiputados
subclass of: Resource
subclass of: Thing
type: Class
comment: Un diputado que ademas es presidente de la camara.

esUnidadDe
range: Thing
domain: Thing
type: Property
type: ObjectProperty
comment: Indica que una unidad es parte de otra.
domain: Resource
range: Resource

Direccion
subclass of: Resource
subclass of: Thing
type: Class
comment: Define la unidad organica interna de mayor jerarquia de la BCN
subclass of: SubOrganismo
subclass of: UnidadOrganizacional
subclass of: Organizacion

tieneRol
range: Thing
domain: Thing
type: Property
type: ObjectProperty
comment: Permite vincular a una persona con un rol.
domain: Funcionario
range: Rol
domain: Persona
domain: Resource
range: Resource

tieneFuncionario
domain: PeriodoPorHonorarios
range: Thing
domain: Thing
type: Property
type: ObjectProperty
comment: Indica que un periodo en un cargo est� asociado a un funcionario.
domain: PeriodoDelCargo
range: Funcionario
inverse of: tieneCargoEnPeriodo
domain: Resource
domain: Instante
range: Resource
range: Persona

tieneCargo
range: Thing
domain: Thing
type: Property
type: ObjectProperty
comment: Indica el cargo que tiene un funcionario en un periodo de tiempo.
domain: PeriodoDelCargo
range: Cargo
inverse of: tienePeriodoPorCargo
domain: Resource
domain: Instante
range: Resource

tieneCodigo
type: Property
type: DatatypeProperty
comment: Indica que un cargo tiene un codigo.
domain: Cargo
range: string
domain: Thing
domain: Resource
range: Resource

tieneEstamento
type: Property
type: DatatypeProperty
comment: Indica el estamento que tiene un funcionario.
domain: PeriodoDelCargo
range: string
domain: Resource
domain: Instante
domain: Thing
range: Resource

nombre
type: Property
type: DatatypeProperty
comment: name of a person @en
comment: nombre de una persona
domain: Persona
label: name @en
range: string
domain: Thing
domain: Resource
range: Resource

tieneInicio
type: Property
type: DatatypeProperty
comment: Indica la fecha de inicio.
domain: PeriodoDelCargo
range: date
domain: Resource
domain: Instante
domain: Thing
range: Resource

tieneGrado
type: Property
type: DatatypeProperty
comment: Indica que un funcionario que tiene un cargo en un periodo, tiene un grado definido por una letra.
domain: PeriodoDelCargo
range: string
domain: Resource
domain: Instante
domain: Thing
range: Resource

tieneTipoDeCargo
type: Property
type: DatatypeProperty
comment: Indica el tipo de cargo.
domain: Cargo
range: string
domain: Thing
domain: Resource
range: Resource

Apellido Materno
type: Property
type: DatatypeProperty
comment: Apellido heredado desde la madre.
comment: Mother's inherited surname. @en
domain: Persona
label: Surname of mother @en
range: string
domain: Thing
domain: Resource
range: Resource

tieneCalidadContractual
type: Property
type: DatatypeProperty
comment: Indica que un funcionario tiene calidad contractual.
domain: Funcionario
range: string
domain: Thing
domain: Persona
domain: Resource
range: Resource

tieneCalificacionProfesional
type: Property
type: DatatypeProperty
comment: Indica la calificacion profesional de un funcionario.
domain: Funcionario
range: string
domain: Thing
domain: Persona
domain: Resource
range: Resource

tieneOferta
type: Property
type: DatatypeProperty
comment: Indica la oferta de productos o servicios que da un organismo.
domain: SubOrganismo
range: string
domain: UnidadOrganizacional
domain: Organizacion
domain: Thing
domain: Resource
range: Resource

tieneNombre
type: Property
type: DatatypeProperty
comment: Indica el nombre de una persona.
domain: Cargo
domain: SubOrganismo
range: string
domain: Thing
domain: Resource
domain: UnidadOrganizacional
domain: Organizacion
range: Resource

tieneFin
type: Property
type: DatatypeProperty
comment: Indica la fecha de finalizacion.
domain: PeriodoDelCargo
range: date
domain: Resource
domain: Instante
domain: Thing
range: Resource

modalidadContractual
type: Property
type: DatatypeProperty
comment: Indica la modalidad contractual, es decir, si es personal de planta, a contrata u a honorarios.
domain: PeriodoDelCargo
range: string
domain: Resource
domain: Instante
domain: Thing
range: Resource

Apellido Paterno
type: Property
type: DatatypeProperty
comment: Apellido heredado desde el padre.
comment: Father's inherited surname. @en
domain: Persona
label: Surname of father @en
range: string
domain: Thing
domain: Resource
range: Resource

tieneObjetivo
type: Property
type: DatatypeProperty
comment: Indica el objetivo o prop�sito de algo.
domain: SubOrganismo
range: string
domain: UnidadOrganizacional
domain: Organizacion
domain: Thing
domain: Resource
range: Resource

profesion
type: Property
type: DatatypeProperty
comment: La profesion de una persona
comment: The profession of a person @en
domain: Persona
label: profession @en
range: string
domain: Thing
domain: Resource
range: Resource

tieneSueldomensual
type: Property
type: DatatypeProperty
comment: Indica el salario relacionado a un cargo.
domain: PeriodoDelCargo
range: string
domain: Resource
domain: Instante
domain: Thing
range: Resource

tieneFechaDeIngresoAlaBCN
type: Property
type: DatatypeProperty
comment: Indica la fecha de ingreso como funcionario.
domain: Funcionario
range: date
domain: Thing
domain: Persona
domain: Resource
range: Resource

Transparencia
type: Ontology
comment: Modelo estructural de la BCN orientado a divulgar la transparencia.
version info: 1.1

tieneObjetivo
type: DatatypeProperty
comment: Indica el objetivo que tiene un cargo.
domain: Cargo
range: string
type: Property
domain: Thing
domain: Resource
range: Resource

tieneUnidad
type: Property
type: DatatypeProperty
comment: Indica que algo tiene una unidad.