Post
range: Thing
domain: Thing
type: DimensionProperty
type: Property
type: ObjectProperty
comment: The post whose subordinates this statistic relates to.
domain: Observation
range: Post
range: Resource
domain: Resource

Date
range: Thing
domain: Thing
type: DimensionProperty
type: Property
type: ObjectProperty
comment: The date that the observation relates to.
domain: Observation
range: CalendarDay
range: Resource
domain: Resource

Unit
range: Thing
domain: Thing
type: DimensionProperty
type: Property
type: ObjectProperty
comment: The unit to which the junior posts belong.
domain: Observation
range: OrganizationalUnit
range: Resource
domain: Resource

Job
range: Thing
domain: Thing
type: DimensionProperty
type: Property
type: ObjectProperty
comment: The job performed by the junior posts.
domain: Observation
range: Job
range: Resource
domain: Resource

Grade
range: Thing
domain: Thing
type: DimensionProperty
type: Property
type: ObjectProperty
comment: The grade of the junior posts.
domain: Observation
range: Grade
range: Resource
domain: Resource

Tenure
range: Thing
domain: Thing
type: DimensionProperty
type: Property
type: ObjectProperty
comment: The tenure through which pay was given.
domain: Observation
range: Tenure
range: Resource
domain: Resource

Profession
range: Thing
domain: Thing
type: DimensionProperty
type: Property
type: ObjectProperty
comment: The profession of the junior posts.
domain: Observation
range: Profession
range: Resource
domain: Resource

Reporting To
range: Thing
domain: Thing
type: DimensionProperty
type: Property
type: ObjectProperty
comment: The post to which the junior posts report.
domain: Observation
range: Post
range: Resource
domain: Resource

Number of Posts
type: MeasureProperty
type: Property
type: DatatypeProperty
comment: The number of posts with this grade that report to the given post, as a full-time equivalent.
domain: Observation
range: decimal
range: Resource
domain: Resource

Organogram Data Vocabulary
type: Ontology
vocabulary: cube#
created: 2010-10-17
vocabulary: rdf-schema#
vocabulary: central-government
vocabulary: core#
vocabulary: http://xmlns.com/foaf/0.1/
contributor: Jeni Tennison
type: Dataset
license: http://www.opendatacommons.org/licenses/pddl/1.0/
vocabulary: org#
vocabulary: ns#
vocabulary: owl#
vocabulary: time#
vocabulary: organogram
modified: 2011-06-11

Salary Costs Data Structure
component: http://lodlaundromat.org/.well-known/genid/30c5bc8cc722b5d7f8ffe4dabef0fa33#13
component: http://lodlaundromat.org/.well-known/genid/30c5bc8cc722b5d7f8ffe4dabef0fa33#14
component: http://lodlaundromat.org/.well-known/genid/30c5bc8cc722b5d7f8ffe4dabef0fa33#15
component: http://lodlaundromat.org/.well-known/genid/30c5bc8cc722b5d7f8ffe4dabef0fa33#16
type: DataStructureDefinition
comment: The structure of a cube containing data about the salary costs of the reports to a particular post on a particular day.

Total Pay Data Structure
component: http://lodlaundromat.org/.well-known/genid/30c5bc8cc722b5d7f8ffe4dabef0fa33#17
component: http://lodlaundromat.org/.well-known/genid/30c5bc8cc722b5d7f8ffe4dabef0fa33#18
component: http://lodlaundromat.org/.well-known/genid/30c5bc8cc722b5d7f8ffe4dabef0fa33#19
component: http://lodlaundromat.org/.well-known/genid/30c5bc8cc722b5d7f8ffe4dabef0fa33#20
type: DataStructureDefinition
comment: The structure of a cube containing data about the total pay received for a particular tenure (a person in a post) on a particular day.

currency
concept: currency
type: AttributeProperty
comment: Currency in which the salary is paid, typically attached to the dataset for single currency datasets.

Junior Posts Data Structure
type: DataStructureDefinition
component: http://lodlaundromat.org/.well-known/genid/30c5bc8cc722b5d7f8ffe4dabef0fa33#2
component: http://lodlaundromat.org/.well-known/genid/30c5bc8cc722b5d7f8ffe4dabef0fa33#8
component: http://lodlaundromat.org/.well-known/genid/30c5bc8cc722b5d7f8ffe4dabef0fa33#7
component: http://lodlaundromat.org/.well-known/genid/30c5bc8cc722b5d7f8ffe4dabef0fa33#6
component: http://lodlaundromat.org/.well-known/genid/30c5bc8cc722b5d7f8ffe4dabef0fa33#5
comment: The structure of a cube containing data about the number of junior staff of different grades that report to a particular post from within a particular unit, with a particular job and a particular profession, on a particular day.
component: http://lodlaundromat.org/.well-known/genid/30c5bc8cc722b5d7f8ffe4dabef0fa33#4
component: http://lodlaundromat.org/.well-known/genid/30c5bc8cc722b5d7f8ffe4dabef0fa33#3

Number of Posts Data Structure
component: http://lodlaundromat.org/.well-known/genid/30c5bc8cc722b5d7f8ffe4dabef0fa33#10
component: http://lodlaundromat.org/.well-known/genid/30c5bc8cc722b5d7f8ffe4dabef0fa33#11
component: http://lodlaundromat.org/.well-known/genid/30c5bc8cc722b5d7f8ffe4dabef0fa33#12
component: http://lodlaundromat.org/.well-known/genid/30c5bc8cc722b5d7f8ffe4dabef0fa33#9
type: DataStructureDefinition
comment: The structure of a cube containing data about the number of posts of different grades that report to a particular post on a particular day.

Total Pay
type: MeasureProperty
type: Property
type: DatatypeProperty
comment: The total pay received.
domain: Observation
range: decimal
range: Resource
domain: Resource

Salary Cost of Reports
type: MeasureProperty
type: Property
type: DatatypeProperty
comment: The total salary cost of each Deputy Director/SCS Pay Band 1 and 1A member and the non-SCS staff that report to this post. Salary costs are base pay (excluding bonuses and allowances) as at the date of the observation. To ensure that individual salaries cannot be identified from this information (for Deputy Director/SCS Pay Band 1 and 1A level and non-SCS grades), where the team is less than five people, the cost is rounded to the nearest £100,000. Where the team is one person only, the salary cost may be rounded to the nearest £100,000 or merged with the costs of another team.
domain: Observation
range: integer
range: Resource
range: decimal
domain: Resource