:genid139.d54af2326094fb16
subclass of: Resource
type: Class
subclass of: Thing
description: http://lodlaundromat.org/.well-known/genid/274dbb756580788d98c3d89d21523306#1
union of: :genid140.d54af2326094fb1

http://lodlaundromat.org/274dbb756580788d98c3d89d21523306
created: 2015-02-12T15:58:54
creator: org-ecs
type: Ontology

http://void.rkbexplorer.com/id/dataset/7b1fd9450a920a85ac770ddd604b2708
title: http://www.uni.lu/
uri regex pattern: http://www.uni.lu/.+
type: :genid139.d54af2326094fb1
type: Dataset
label: http://www.uni.lu/