uom
sub property of: unit
sub property of: topObjectProperty
property disjoint with: bottomObjectProperty
type: ObjectProperty
comment: Unit of Measurement in use on a specific device or sensor or sensing device
range: Unit

Quantity
disjoint with: Nothing
subclass of: Property
subclass of: Thing
subclass of: QuantityKind
type: Class
comment: Observed property (Quantity).

linkActivityValue
property disjoint with: tStart
property disjoint with: message
property disjoint with: activityStart
property disjoint with: bottomDataProperty
sub property of: topDataProperty
property disjoint with: linkQualityValue
property disjoint with: activityEnd
property disjoint with: tEnd
type: DatatypeProperty
property disjoint with: confidence
comment: Relationship among a LinkActivity and the amount of packets received in the time range specified by the predicates :startDateTime and :endDateTime
domain: LinkActivity
range: integer

activityStart
property disjoint with: confidence
property disjoint with: priorityLevel
property disjoint with: linkQualityValue
property disjoint with: bottomDataProperty
type: DatatypeProperty
property disjoint with: linkActivityValue
sub property of: topDataProperty
property disjoint with: message
comment: Relationship among an Activity and the start datetime of the time range which it refers to.
domain: LinkActivity
range: dateTime

TSMap
disjoint with: Nothing
subclass of: Thing
type: Class
comment: Versions of a same observed Property (Quantity) which vary across time and space, as captured by the sensor's observed values.

OV
disjoint with: Nothing
subclass of: ObservationValue
subclass of: QuantityValue
subclass of: Thing
type: Class
comment: Observation Value.

activityEnd
type: DatatypeProperty
property disjoint with: linkQualityValue
property disjoint with: message
property disjoint with: bottomDataProperty
property disjoint with: priorityLevel
property disjoint with: linkActivityValue
sub property of: topDataProperty
property disjoint with: confidence
comment: Relationship among a LinkActivity and the end datetime of the time range which it refers to.
domain: LinkActivity
range: dateTime

tStart
sub property of: topDataProperty
property disjoint with: linkActivityValue
property disjoint with: linkQualityValue
property disjoint with: confidence
property disjoint with: bottomDataProperty
type: DatatypeProperty
property disjoint with: message
property disjoint with: priorityLevel
comment: Datetime at which a given entity and all the triples referred to it, start to be valid.
range: dateTime

tEnd
property disjoint with: priorityLevel
type: DatatypeProperty
property disjoint with: bottomDataProperty
sub property of: topDataProperty
property disjoint with: message
property disjoint with: confidence
property disjoint with: linkQualityValue
property disjoint with: linkActivityValue
comment: Datetime after which a given entity and all the triples referred to it, are not valid anymore.
range: dateTime

SPITFIRE Ontology
license: copyright-software-20021231.html
type: Thing
comment: Please report any error to myriam.leggieri_at_deri.org
rights: Copyright 2010 - 2012 SPITFIRE.
creator: me
comment: This ontology describes sensors, observations, and related concepts. It also describes events and their correlations. The final aim is to support a better description of sensor context.
comment: This ontology is developed by DERI ( http://www.deri.ie ) for the SPITFIRE project ( http://spitfire-project.eu ) . It is based on the alignment among the W3C Semantic Sensor Networks Incubator Group (SSN-XG) ontology, the Dolce-DnS Ultralite ontology and the Event Model F ontology.
type: Ontology
creator: Alexandre Passant

DataLink
disjoint with: Nothing
subclass of: Thing
subclass of: LikeableAssociation
type: Class
comment: Link Association.

LinkReview
disjoint with: Nothing
subclass of: Thing
subclass of: LikeableAssociation
type: Class
comment: Link Review.