inline element
disjoint with: table element
disjoint with: http://lodlaundromat.org/.well-known/genid/1035a7c7a9b194dabf1cc21a3fd99a64#103
disjoint with: http://lodlaundromat.org/.well-known/genid/1035a7c7a9b194dabf1cc21a3fd99a64#38
disjoint with: Nothing
disjoint with: http://lodlaundromat.org/.well-known/genid/1035a7c7a9b194dabf1cc21a3fd99a64#42
disjoint with: http://lodlaundromat.org/.well-known/genid/1035a7c7a9b194dabf1cc21a3fd99a64#109
disjoint with: non-textual element
disjoint with: field element
disjoint with: atom element
subclass of: pattern-based element
disjoint with: non-structured element
disjoint with: http://lodlaundromat.org/.well-known/genid/1035a7c7a9b194dabf1cc21a3fd99a64#73
subclass of: http://lodlaundromat.org/.well-known/genid/1035a7c7a9b194dabf1cc21a3fd99a64#20
disjoint with: http://lodlaundromat.org/.well-known/genid/1035a7c7a9b194dabf1cc21a3fd99a64#33
disjoint with: http://lodlaundromat.org/.well-known/genid/1035a7c7a9b194dabf1cc21a3fd99a64#12
disjoint with: popup element
disjoint with: http://lodlaundromat.org/.well-known/genid/1035a7c7a9b194dabf1cc21a3fd99a64#16
subclass of: http://lodlaundromat.org/.well-known/genid/1035a7c7a9b194dabf1cc21a3fd99a64#81
subclass of: http://lodlaundromat.org/.well-known/genid/1035a7c7a9b194dabf1cc21a3fd99a64#94
disjoint with: container element
disjoint with: meta element
disjoint with: http://lodlaundromat.org/.well-known/genid/1035a7c7a9b194dabf1cc21a3fd99a64#45
disjoint with: http://lodlaundromat.org/.well-known/genid/1035a7c7a9b194dabf1cc21a3fd99a64#25
subclass of: http://lodlaundromat.org/.well-known/genid/1035a7c7a9b194dabf1cc21a3fd99a64#61
subclass of: http://lodlaundromat.org/.well-known/genid/1035a7c7a9b194dabf1cc21a3fd99a64#49
disjoint with: http://lodlaundromat.org/.well-known/genid/1035a7c7a9b194dabf1cc21a3fd99a64#29
disjoint with: headed-container element
subclass of: http://lodlaundromat.org/.well-known/genid/1035a7c7a9b194dabf1cc21a3fd99a64#77
disjoint with: milestone element
subclass of: http://lodlaundromat.org/.well-known/genid/1035a7c7a9b194dabf1cc21a3fd99a64#9
subclass of: http://lodlaundromat.org/.well-known/genid/1035a7c7a9b194dabf1cc21a3fd99a64#5
equivalent class: http://lodlaundromat.org/.well-known/genid/1035a7c7a9b194dabf1cc21a3fd99a64#49
disjoint with: record element
subclass of: http://lodlaundromat.org/.well-known/genid/1035a7c7a9b194dabf1cc21a3fd99a64#57
disjoint with: http://lodlaundromat.org/.well-known/genid/1035a7c7a9b194dabf1cc21a3fd99a64#98
disjoint with: http://lodlaundromat.org/.well-known/genid/1035a7c7a9b194dabf1cc21a3fd99a64#85
subclass of: http://lodlaundromat.org/.well-known/genid/1035a7c7a9b194dabf1cc21a3fd99a64#53
disjoint with: block element
subclass of: mixed element
subclass of: textual element
subclass of: http://lodlaundromat.org/.well-known/genid/1035a7c7a9b194dabf1cc21a3fd99a64#90
disjoint with: http://lodlaundromat.org/.well-known/genid/1035a7c7a9b194dabf1cc21a3fd99a64#70
subclass of: structured element
disjoint with: http://lodlaundromat.org/.well-known/genid/1035a7c7a9b194dabf1cc21a3fd99a64#1
type: Class
subclass of: Thing
disjoint with: http://lodlaundromat.org/.well-known/genid/1035a7c7a9b194dabf1cc21a3fd99a64#86
disjoint with: http://lodlaundromat.org/.well-known/genid/1035a7c7a9b194dabf1cc21a3fd99a64#66
disjoint with: marker element
disjoint with: bucket element
disjoint with: flat element
disjoint with: http://lodlaundromat.org/.well-known/genid/1035a7c7a9b194dabf1cc21a3fd99a64#84
comment: This class has the same use and content model of the pattern Block, but differing primarily because a) inline elements can contain other elements compliant with the same pattern while block elements cannot, and b) inline elements must always be contained by other block or inline elements and by no other type of element. These constraints also imply that inline elements cannot be used as root elements of documents and that the class Block is disjoint with the class Inline (i.e., a markup element cannot be a block and an inline at the same time).
subclass of: http://lodlaundromat.org/.well-known/genid/1035a7c7a9b194dabf1cc21a3fd99a64#56
subclass of: http://lodlaundromat.org/.well-known/genid/1035a7c7a9b194dabf1cc21a3fd99a64#60

mixed element
disjoint with: flat element
subclass of: structured element
disjoint with: http://lodlaundromat.org/.well-known/genid/1035a7c7a9b194dabf1cc21a3fd99a64#73
disjoint with: http://lodlaundromat.org/.well-known/genid/1035a7c7a9b194dabf1cc21a3fd99a64#70
subclass of: pattern-based element
disjoint with: meta element
subclass of: Thing
type: Class
disjoint with: http://lodlaundromat.org/.well-known/genid/1035a7c7a9b194dabf1cc21a3fd99a64#109
disjoint with: record element
disjoint with: http://lodlaundromat.org/.well-known/genid/1035a7c7a9b194dabf1cc21a3fd99a64#29
disjoint with: http://lodlaundromat.org/.well-known/genid/1035a7c7a9b194dabf1cc21a3fd99a64#84
disjoint with: non-textual element
disjoint with: http://lodlaundromat.org/.well-known/genid/1035a7c7a9b194dabf1cc21a3fd99a64#1
disjoint with: field element
disjoint with: non-structured element
disjoint with: headed-container element
disjoint with: http://lodlaundromat.org/.well-known/genid/1035a7c7a9b194dabf1cc21a3fd99a64#45
disjoint with: http://lodlaundromat.org/.well-known/genid/1035a7c7a9b194dabf1cc21a3fd99a64#16
disjoint with: Nothing
disjoint with: http://lodlaundromat.org/.well-known/genid/1035a7c7a9b194dabf1cc21a3fd99a64#38
disjoint with: http://lodlaundromat.org/.well-known/genid/1035a7c7a9b194dabf1cc21a3fd99a64#66
disjoint with: table element
disjoint with: http://lodlaundromat.org/.well-known/genid/1035a7c7a9b194dabf1cc21a3fd99a64#85
disjoint with: popup element
subclass of: textual element
disjoint with: container element
disjoint with: http://lodlaundromat.org/.well-known/genid/1035a7c7a9b194dabf1cc21a3fd99a64#103
disjoint with: http://lodlaundromat.org/.well-known/genid/1035a7c7a9b194dabf1cc21a3fd99a64#42
disjoint with: bucket element
disjoint with: atom element
disjoint with: marker element
disjoint with: http://lodlaundromat.org/.well-known/genid/1035a7c7a9b194dabf1cc21a3fd99a64#25
disjoint with: http://lodlaundromat.org/.well-known/genid/1035a7c7a9b194dabf1cc21a3fd99a64#86
disjoint with: milestone element
comment: The class of elements that can contain other elements and text nodes.

non-structured element
disjoint with: http://lodlaundromat.org/.well-known/genid/1035a7c7a9b194dabf1cc21a3fd99a64#12
disjoint with: http://lodlaundromat.org/.well-known/genid/1035a7c7a9b194dabf1cc21a3fd99a64#86
disjoint with: inline element
disjoint with: bucket element
disjoint with: http://lodlaundromat.org/.well-known/genid/1035a7c7a9b194dabf1cc21a3fd99a64#9
disjoint with: http://lodlaundromat.org/.well-known/genid/1035a7c7a9b194dabf1cc21a3fd99a64#49
equivalent class: http://lodlaundromat.org/.well-known/genid/1035a7c7a9b194dabf1cc21a3fd99a64#84
disjoint with: http://lodlaundromat.org/.well-known/genid/1035a7c7a9b194dabf1cc21a3fd99a64#109
disjoint with: http://lodlaundromat.org/.well-known/genid/1035a7c7a9b194dabf1cc21a3fd99a64#53
disjoint with: structured element
subclass of: http://lodlaundromat.org/.well-known/genid/1035a7c7a9b194dabf1cc21a3fd99a64#84
subclass of: Thing
disjoint with: http://lodlaundromat.org/.well-known/genid/1035a7c7a9b194dabf1cc21a3fd99a64#5
disjoint with: http://lodlaundromat.org/.well-known/genid/1035a7c7a9b194dabf1cc21a3fd99a64#57
disjoint with: http://lodlaundromat.org/.well-known/genid/1035a7c7a9b194dabf1cc21a3fd99a64#77
disjoint with: http://lodlaundromat.org/.well-known/genid/1035a7c7a9b194dabf1cc21a3fd99a64#103
disjoint with: record element
disjoint with: http://lodlaundromat.org/.well-known/genid/1035a7c7a9b194dabf1cc21a3fd99a64#81
disjoint with: http://lodlaundromat.org/.well-known/genid/1035a7c7a9b194dabf1cc21a3fd99a64#29
disjoint with: http://lodlaundromat.org/.well-known/genid/1035a7c7a9b194dabf1cc21a3fd99a64#16
type: Class
disjoint with: http://lodlaundromat.org/.well-known/genid/1035a7c7a9b194dabf1cc21a3fd99a64#90
disjoint with: block element
disjoint with: Nothing
disjoint with: table element
disjoint with: mixed element
disjoint with: container element
disjoint with: http://lodlaundromat.org/.well-known/genid/1035a7c7a9b194dabf1cc21a3fd99a64#70
subclass of: pattern-based element
disjoint with: http://lodlaundromat.org/.well-known/genid/1035a7c7a9b194dabf1cc21a3fd99a64#42
complement of: structured element
disjoint with: http://lodlaundromat.org/.well-known/genid/1035a7c7a9b194dabf1cc21a3fd99a64#45
disjoint with: popup element
disjoint with: http://lodlaundromat.org/.well-known/genid/1035a7c7a9b194dabf1cc21a3fd99a64#94
disjoint with: headed-container element
disjoint with: http://lodlaundromat.org/.well-known/genid/1035a7c7a9b194dabf1cc21a3fd99a64#25
comment: The class of elements that cannot contain other elements.

pattern-based element
complement of: Nothing
disjoint with: Nothing
equivalent class: Thing
subclass of: Thing
type: Class
comment: A structural pattern is an atomic component of a document, that is able to capture a recurrent and well knwon structure of a document. Any entity belonging to this class is compliant with exactly one structural pattern.

can contain homonymous elements
sub property of: topDataProperty
property disjoint with: bottomDataProperty
property disjoint with: has name
type: FunctionalProperty
type: DatatypeProperty
comment: A hierarchical-based entity contains al least two entities that share the same name.
domain: structured element
range: boolean

milestone element
disjoint with: http://lodlaundromat.org/.well-known/genid/1035a7c7a9b194dabf1cc21a3fd99a64#33
disjoint with: Nothing
disjoint with: textual element
subclass of: http://lodlaundromat.org/.well-known/genid/1035a7c7a9b194dabf1cc21a3fd99a64#73
disjoint with: http://lodlaundromat.org/.well-known/genid/1035a7c7a9b194dabf1cc21a3fd99a64#77
type: Class
disjoint with: http://lodlaundromat.org/.well-known/genid/1035a7c7a9b194dabf1cc21a3fd99a64#9
disjoint with: structured element
disjoint with: http://lodlaundromat.org/.well-known/genid/1035a7c7a9b194dabf1cc21a3fd99a64#90
disjoint with: http://lodlaundromat.org/.well-known/genid/1035a7c7a9b194dabf1cc21a3fd99a64#70
subclass of: pattern-based element
disjoint with: http://lodlaundromat.org/.well-known/genid/1035a7c7a9b194dabf1cc21a3fd99a64#16
disjoint with: meta element
subclass of: marker element
subclass of: non-structured element
disjoint with: popup element
disjoint with: mixed element
disjoint with: http://lodlaundromat.org/.well-known/genid/1035a7c7a9b194dabf1cc21a3fd99a64#53
disjoint with: http://lodlaundromat.org/.well-known/genid/1035a7c7a9b194dabf1cc21a3fd99a64#5
disjoint with: http://lodlaundromat.org/.well-known/genid/1035a7c7a9b194dabf1cc21a3fd99a64#57
subclass of: http://lodlaundromat.org/.well-known/genid/1035a7c7a9b194dabf1cc21a3fd99a64#84
subclass of: Thing
disjoint with: http://lodlaundromat.org/.well-known/genid/1035a7c7a9b194dabf1cc21a3fd99a64#12
subclass of: non-textual element
disjoint with: http://lodlaundromat.org/.well-known/genid/1035a7c7a9b194dabf1cc21a3fd99a64#103
disjoint with: http://lodlaundromat.org/.well-known/genid/1035a7c7a9b194dabf1cc21a3fd99a64#38
subclass of: http://lodlaundromat.org/.well-known/genid/1035a7c7a9b194dabf1cc21a3fd99a64#61
disjoint with: http://lodlaundromat.org/.well-known/genid/1035a7c7a9b194dabf1cc21a3fd99a64#81
disjoint with: block element
disjoint with: atom element
disjoint with: http://lodlaundromat.org/.well-known/genid/1035a7c7a9b194dabf1cc21a3fd99a64#109
disjoint with: http://lodlaundromat.org/.well-known/genid/1035a7c7a9b194dabf1cc21a3fd99a64#1
disjoint with: headed-container element
disjoint with: http://lodlaundromat.org/.well-known/genid/1035a7c7a9b194dabf1cc21a3fd99a64#42
disjoint with: table element
disjoint with: container element
subclass of: http://lodlaundromat.org/.well-known/genid/1035a7c7a9b194dabf1cc21a3fd99a64#20
equivalent class: http://lodlaundromat.org/.well-known/genid/1035a7c7a9b194dabf1cc21a3fd99a64#73
disjoint with: http://lodlaundromat.org/.well-known/genid/1035a7c7a9b194dabf1cc21a3fd99a64#98
disjoint with: inline element
disjoint with: http://lodlaundromat.org/.well-known/genid/1035a7c7a9b194dabf1cc21a3fd99a64#49
disjoint with: field element
disjoint with: http://lodlaundromat.org/.well-known/genid/1035a7c7a9b194dabf1cc21a3fd99a64#29
disjoint with: flat element
disjoint with: record element
disjoint with: bucket element
disjoint with: http://lodlaundromat.org/.well-known/genid/1035a7c7a9b194dabf1cc21a3fd99a64#86
disjoint with: http://lodlaundromat.org/.well-known/genid/1035a7c7a9b194dabf1cc21a3fd99a64#66
disjoint with: http://lodlaundromat.org/.well-known/genid/1035a7c7a9b194dabf1cc21a3fd99a64#94
disjoint with: http://lodlaundromat.org/.well-known/genid/1035a7c7a9b194dabf1cc21a3fd99a64#45
disjoint with: http://lodlaundromat.org/.well-known/genid/1035a7c7a9b194dabf1cc21a3fd99a64#25
subclass of: http://lodlaundromat.org/.well-known/genid/1035a7c7a9b194dabf1cc21a3fd99a64#85
comment: This class describe elements that contain neither other elements nor textual content. Moreover, similarly to Inline, elements following the Milestone pattern can only be contained within block or inline elements (and consequently they also cannot be used as root elements of documents). The distinctive characteristic of the pattern Milestone is the location it assumes within the document.
subclass of: http://lodlaundromat.org/.well-known/genid/1035a7c7a9b194dabf1cc21a3fd99a64#80

container element
type: Class
disjoint with: http://lodlaundromat.org/.well-known/genid/1035a7c7a9b194dabf1cc21a3fd99a64#94
disjoint with: http://lodlaundromat.org/.well-known/genid/1035a7c7a9b194dabf1cc21a3fd99a64#77
disjoint with: http://lodlaundromat.org/.well-known/genid/1035a7c7a9b194dabf1cc21a3fd99a64#90
disjoint with: field element
disjoint with: Nothing
subclass of: structured element
subclass of: http://lodlaundromat.org/.well-known/genid/1035a7c7a9b194dabf1cc21a3fd99a64#85
disjoint with: http://lodlaundromat.org/.well-known/genid/1035a7c7a9b194dabf1cc21a3fd99a64#38
subclass of: http://lodlaundromat.org/.well-known/genid/1035a7c7a9b194dabf1cc21a3fd99a64#16
subclass of: bucket element
disjoint with: http://lodlaundromat.org/.well-known/genid/1035a7c7a9b194dabf1cc21a3fd99a64#57
subclass of: http://lodlaundromat.org/.well-known/genid/1035a7c7a9b194dabf1cc21a3fd99a64#98
disjoint with: http://lodlaundromat.org/.well-known/genid/1035a7c7a9b194dabf1cc21a3fd99a64#53
equivalent class: http://lodlaundromat.org/.well-known/genid/1035a7c7a9b194dabf1cc21a3fd99a64#25
subclass of: http://lodlaundromat.org/.well-known/genid/1035a7c7a9b194dabf1cc21a3fd99a64#29
subclass of: Thing
disjoint with: marker element
disjoint with: block element
disjoint with: non-structured element
disjoint with: http://lodlaundromat.org/.well-known/genid/1035a7c7a9b194dabf1cc21a3fd99a64#12
disjoint with: http://lodlaundromat.org/.well-known/genid/1035a7c7a9b194dabf1cc21a3fd99a64#66
disjoint with: http://lodlaundromat.org/.well-known/genid/1035a7c7a9b194dabf1cc21a3fd99a64#61
subclass of: pattern-based element
subclass of: http://lodlaundromat.org/.well-known/genid/1035a7c7a9b194dabf1cc21a3fd99a64#25
subclass of: http://lodlaundromat.org/.well-known/genid/1035a7c7a9b194dabf1cc21a3fd99a64#70
disjoint with: meta element
disjoint with: flat element
disjoint with: inline element
disjoint with: http://lodlaundromat.org/.well-known/genid/1035a7c7a9b194dabf1cc21a3fd99a64#84
disjoint with: popup element
disjoint with: http://lodlaundromat.org/.well-known/genid/1035a7c7a9b194dabf1cc21a3fd99a64#86
disjoint with: http://lodlaundromat.org/.well-known/genid/1035a7c7a9b194dabf1cc21a3fd99a64#1
disjoint with: http://lodlaundromat.org/.well-known/genid/1035a7c7a9b194dabf1cc21a3fd99a64#81
disjoint with: textual element
disjoint with: atom element
subclass of: non-textual element
disjoint with: mixed element
disjoint with: http://lodlaundromat.org/.well-known/genid/1035a7c7a9b194dabf1cc21a3fd99a64#20
disjoint with: http://lodlaundromat.org/.well-known/genid/1035a7c7a9b194dabf1cc21a3fd99a64#49
disjoint with: http://lodlaundromat.org/.well-known/genid/1035a7c7a9b194dabf1cc21a3fd99a64#9
disjoint with: http://lodlaundromat.org/.well-known/genid/1035a7c7a9b194dabf1cc21a3fd99a64#73
disjoint with: http://lodlaundromat.org/.well-known/genid/1035a7c7a9b194dabf1cc21a3fd99a64#5
subclass of: http://lodlaundromat.org/.well-known/genid/1035a7c7a9b194dabf1cc21a3fd99a64#42
disjoint with: milestone element
subclass of: http://lodlaundromat.org/.well-known/genid/1035a7c7a9b194dabf1cc21a3fd99a64#33
comment: This class concerns the structural organization of a document. Elements following this pattern contain no textual content and contain only elements compliant with the patterns: Meta, Field, Block and any subtype of Container. It is disjointed with the pattern Popup, although they share the same content model.
subclass of: http://lodlaundromat.org/.well-known/genid/1035a7c7a9b194dabf1cc21a3fd99a64#32

is contained by as header
sub property of: is contained by
sub property of: topObjectProperty
property disjoint with: bottomObjectProperty
inverse of: contains as header
type: ObjectProperty
comment: An element is contained by another structured element as part of its header.

table element
disjoint with: headed-container element
disjoint with: http://lodlaundromat.org/.well-known/genid/1035a7c7a9b194dabf1cc21a3fd99a64#66
disjoint with: mixed element
disjoint with: inline element
disjoint with: http://lodlaundromat.org/.well-known/genid/1035a7c7a9b194dabf1cc21a3fd99a64#20
disjoint with: Nothing
disjoint with: marker element
equivalent class: http://lodlaundromat.org/.well-known/genid/1035a7c7a9b194dabf1cc21a3fd99a64#109
disjoint with: field element
disjoint with: record element
disjoint with: http://lodlaundromat.org/.well-known/genid/1035a7c7a9b194dabf1cc21a3fd99a64#53
disjoint with: http://lodlaundromat.org/.well-known/genid/1035a7c7a9b194dabf1cc21a3fd99a64#81
disjoint with: http://lodlaundromat.org/.well-known/genid/1035a7c7a9b194dabf1cc21a3fd99a64#90
subclass of: non-textual element
disjoint with: http://lodlaundromat.org/.well-known/genid/1035a7c7a9b194dabf1cc21a3fd99a64#77
subclass of: http://lodlaundromat.org/.well-known/genid/1035a7c7a9b194dabf1cc21a3fd99a64#29
subclass of: http://lodlaundromat.org/.well-known/genid/1035a7c7a9b194dabf1cc21a3fd99a64#33
disjoint with: textual element
subclass of: http://lodlaundromat.org/.well-known/genid/1035a7c7a9b194dabf1cc21a3fd99a64#98
disjoint with: http://lodlaundromat.org/.well-known/genid/1035a7c7a9b194dabf1cc21a3fd99a64#12
subclass of: structured element
subclass of: http://lodlaundromat.org/.well-known/genid/1035a7c7a9b194dabf1cc21a3fd99a64#16
disjoint with: non-structured element
subclass of: container element
subclass of: http://lodlaundromat.org/.well-known/genid/1035a7c7a9b194dabf1cc21a3fd99a64#85
disjoint with: http://lodlaundromat.org/.well-known/genid/1035a7c7a9b194dabf1cc21a3fd99a64#57
disjoint with: http://lodlaundromat.org/.well-known/genid/1035a7c7a9b194dabf1cc21a3fd99a64#73
disjoint with: http://lodlaundromat.org/.well-known/genid/1035a7c7a9b194dabf1cc21a3fd99a64#103
disjoint with: http://lodlaundromat.org/.well-known/genid/1035a7c7a9b194dabf1cc21a3fd99a64#5
disjoint with: atom element
disjoint with: block element
disjoint with: milestone element
disjoint with: http://lodlaundromat.org/.well-known/genid/1035a7c7a9b194dabf1cc21a3fd99a64#38
type: Class
disjoint with: http://lodlaundromat.org/.well-known/genid/1035a7c7a9b194dabf1cc21a3fd99a64#9
subclass of: http://lodlaundromat.org/.well-known/genid/1035a7c7a9b194dabf1cc21a3fd99a64#70
subclass of: http://lodlaundromat.org/.well-known/genid/1035a7c7a9b194dabf1cc21a3fd99a64#109
subclass of: pattern-based element
disjoint with: http://lodlaundromat.org/.well-known/genid/1035a7c7a9b194dabf1cc21a3fd99a64#94
disjoint with: flat element
subclass of: http://lodlaundromat.org/.well-known/genid/1035a7c7a9b194dabf1cc21a3fd99a64#25
subclass of: http://lodlaundromat.org/.well-known/genid/1035a7c7a9b194dabf1cc21a3fd99a64#42
disjoint with: http://lodlaundromat.org/.well-known/genid/1035a7c7a9b194dabf1cc21a3fd99a64#86
disjoint with: http://lodlaundromat.org/.well-known/genid/1035a7c7a9b194dabf1cc21a3fd99a64#1
disjoint with: http://lodlaundromat.org/.well-known/genid/1035a7c7a9b194dabf1cc21a3fd99a64#84
subclass of: Thing
disjoint with: popup element
disjoint with: meta element
subclass of: bucket element
disjoint with: http://lodlaundromat.org/.well-known/genid/1035a7c7a9b194dabf1cc21a3fd99a64#61
disjoint with: http://lodlaundromat.org/.well-known/genid/1035a7c7a9b194dabf1cc21a3fd99a64#49
comment: This class describes container elements that must contain only homogeneous elements (but they can be repeated).

textual element
disjoint with: http://lodlaundromat.org/.well-known/genid/1035a7c7a9b194dabf1cc21a3fd99a64#103
disjoint with: http://lodlaundromat.org/.well-known/genid/1035a7c7a9b194dabf1cc21a3fd99a64#73
disjoint with: milestone element
disjoint with: popup element
type: Class
disjoint with: http://lodlaundromat.org/.well-known/genid/1035a7c7a9b194dabf1cc21a3fd99a64#109
disjoint with: http://lodlaundromat.org/.well-known/genid/1035a7c7a9b194dabf1cc21a3fd99a64#86
disjoint with: http://lodlaundromat.org/.well-known/genid/1035a7c7a9b194dabf1cc21a3fd99a64#42
disjoint with: table element
disjoint with: marker element
disjoint with: headed-container element
disjoint with: http://lodlaundromat.org/.well-known/genid/1035a7c7a9b194dabf1cc21a3fd99a64#25
disjoint with: non-textual element
subclass of: pattern-based element
disjoint with: container element
disjoint with: record element
complement of: non-textual element
disjoint with: http://lodlaundromat.org/.well-known/genid/1035a7c7a9b194dabf1cc21a3fd99a64#45
disjoint with: http://lodlaundromat.org/.well-known/genid/1035a7c7a9b194dabf1cc21a3fd99a64#70
subclass of: Thing
complement of: http://lodlaundromat.org/.well-known/genid/1035a7c7a9b194dabf1cc21a3fd99a64#85
disjoint with: Nothing
disjoint with: meta element
disjoint with: http://lodlaundromat.org/.well-known/genid/1035a7c7a9b194dabf1cc21a3fd99a64#66
disjoint with: http://lodlaundromat.org/.well-known/genid/1035a7c7a9b194dabf1cc21a3fd99a64#16
disjoint with: http://lodlaundromat.org/.well-known/genid/1035a7c7a9b194dabf1cc21a3fd99a64#85
disjoint with: http://lodlaundromat.org/.well-known/genid/1035a7c7a9b194dabf1cc21a3fd99a64#29
disjoint with: bucket element
comment: The class of elements that can have textual content in their content models.

marker element
disjoint with: inline element
disjoint with: http://lodlaundromat.org/.well-known/genid/1035a7c7a9b194dabf1cc21a3fd99a64#103
disjoint with: Nothing
subclass of: Thing
disjoint with: http://lodlaundromat.org/.well-known/genid/1035a7c7a9b194dabf1cc21a3fd99a64#86
subclass of: non-textual element
disjoint with: block element
disjoint with: container element
disjoint with: headed-container element
disjoint with: atom element
subclass of: http://lodlaundromat.org/.well-known/genid/1035a7c7a9b194dabf1cc21a3fd99a64#84
disjoint with: mixed element
disjoint with: http://lodlaundromat.org/.well-known/genid/1035a7c7a9b194dabf1cc21a3fd99a64#38
disjoint with: http://lodlaundromat.org/.well-known/genid/1035a7c7a9b194dabf1cc21a3fd99a64#1
disjoint with: flat element
disjoint with: http://lodlaundromat.org/.well-known/genid/1035a7c7a9b194dabf1cc21a3fd99a64#42
disjoint with: structured element
disjoint with: record element
disjoint with: popup element
disjoint with: http://lodlaundromat.org/.well-known/genid/1035a7c7a9b194dabf1cc21a3fd99a64#81
disjoint with: http://lodlaundromat.org/.well-known/genid/1035a7c7a9b194dabf1cc21a3fd99a64#12
disjoint with: http://lodlaundromat.org/.well-known/genid/1035a7c7a9b194dabf1cc21a3fd99a64#9
disjoint with: http://lodlaundromat.org/.well-known/genid/1035a7c7a9b194dabf1cc21a3fd99a64#57
disjoint with: http://lodlaundromat.org/.well-known/genid/1035a7c7a9b194dabf1cc21a3fd99a64#25
disjoint with: http://lodlaundromat.org/.well-known/genid/1035a7c7a9b194dabf1cc21a3fd99a64#5
disjoint with: http://lodlaundromat.org/.well-known/genid/1035a7c7a9b194dabf1cc21a3fd99a64#77
subclass of: pattern-based element
disjoint with: http://lodlaundromat.org/.well-known/genid/1035a7c7a9b194dabf1cc21a3fd99a64#16
disjoint with: http://lodlaundromat.org/.well-known/genid/1035a7c7a9b194dabf1cc21a3fd99a64#45
disjoint with: http://lodlaundromat.org/.well-known/genid/1035a7c7a9b194dabf1cc21a3fd99a64#29
disjoint with: http://lodlaundromat.org/.well-known/genid/1035a7c7a9b194dabf1cc21a3fd99a64#53
disjoint with: field element
disjoint with: http://lodlaundromat.org/.well-known/genid/1035a7c7a9b194dabf1cc21a3fd99a64#70
disjoint with: table element
disjoint with: http://lodlaundromat.org/.well-known/genid/1035a7c7a9b194dabf1cc21a3fd99a64#94
disjoint with: http://lodlaundromat.org/.well-known/genid/1035a7c7a9b194dabf1cc21a3fd99a64#90
subclass of: non-structured element
disjoint with: textual element
disjoint with: http://lodlaundromat.org/.well-known/genid/1035a7c7a9b194dabf1cc21a3fd99a64#109
type: Class
disjoint with: http://lodlaundromat.org/.well-known/genid/1035a7c7a9b194dabf1cc21a3fd99a64#49
disjoint with: bucket element
subclass of: http://lodlaundromat.org/.well-known/genid/1035a7c7a9b194dabf1cc21a3fd99a64#85
comment: The class of elements that can contain neither text nodes nor elements.

contains as header
sub property of: contains
sub property of: topObjectProperty
property disjoint with: bottomObjectProperty
inverse of: is contained by as header
type: ObjectProperty
comment: A structured element contains another generic element as part of its header.

is contained by
sub property of: topObjectProperty
property disjoint with: bottomObjectProperty
inverse of: contains
type: ObjectProperty
comment: An element that is contained by another structured element.

field element
disjoint with: http://lodlaundromat.org/.well-known/genid/1035a7c7a9b194dabf1cc21a3fd99a64#45
subclass of: textual element
disjoint with: atom element
disjoint with: http://lodlaundromat.org/.well-known/genid/1035a7c7a9b194dabf1cc21a3fd99a64#103
type: Class
subclass of: pattern-based element
subclass of: http://lodlaundromat.org/.well-known/genid/1035a7c7a9b194dabf1cc21a3fd99a64#33
disjoint with: http://lodlaundromat.org/.well-known/genid/1035a7c7a9b194dabf1cc21a3fd99a64#109
disjoint with: http://lodlaundromat.org/.well-known/genid/1035a7c7a9b194dabf1cc21a3fd99a64#90
disjoint with: container element
disjoint with: http://lodlaundromat.org/.well-known/genid/1035a7c7a9b194dabf1cc21a3fd99a64#25
disjoint with: http://lodlaundromat.org/.well-known/genid/1035a7c7a9b194dabf1cc21a3fd99a64#29
disjoint with: http://lodlaundromat.org/.well-known/genid/1035a7c7a9b194dabf1cc21a3fd99a64#12
disjoint with: http://lodlaundromat.org/.well-known/genid/1035a7c7a9b194dabf1cc21a3fd99a64#16
subclass of: Thing
disjoint with: Nothing
disjoint with: http://lodlaundromat.org/.well-known/genid/1035a7c7a9b194dabf1cc21a3fd99a64#86
disjoint with: http://lodlaundromat.org/.well-known/genid/1035a7c7a9b194dabf1cc21a3fd99a64#70
disjoint with: http://lodlaundromat.org/.well-known/genid/1035a7c7a9b194dabf1cc21a3fd99a64#1
subclass of: non-structured element
disjoint with: meta element
disjoint with: http://lodlaundromat.org/.well-known/genid/1035a7c7a9b194dabf1cc21a3fd99a64#49
disjoint with: structured element
disjoint with: http://lodlaundromat.org/.well-known/genid/1035a7c7a9b194dabf1cc21a3fd99a64#57
disjoint with: http://lodlaundromat.org/.well-known/genid/1035a7c7a9b194dabf1cc21a3fd99a64#73
subclass of: http://lodlaundromat.org/.well-known/genid/1035a7c7a9b194dabf1cc21a3fd99a64#98
disjoint with: http://lodlaundromat.org/.well-known/genid/1035a7c7a9b194dabf1cc21a3fd99a64#61
disjoint with: table element
disjoint with: http://lodlaundromat.org/.well-known/genid/1035a7c7a9b194dabf1cc21a3fd99a64#66
equivalent class: http://lodlaundromat.org/.well-known/genid/1035a7c7a9b194dabf1cc21a3fd99a64#38
disjoint with: http://lodlaundromat.org/.well-known/genid/1035a7c7a9b194dabf1cc21a3fd99a64#94
disjoint with: bucket element
disjoint with: http://lodlaundromat.org/.well-known/genid/1035a7c7a9b194dabf1cc21a3fd99a64#53
disjoint with: inline element
subclass of: http://lodlaundromat.org/.well-known/genid/1035a7c7a9b194dabf1cc21a3fd99a64#84
subclass of: flat element
disjoint with: http://lodlaundromat.org/.well-known/genid/1035a7c7a9b194dabf1cc21a3fd99a64#81
disjoint with: http://lodlaundromat.org/.well-known/genid/1035a7c7a9b194dabf1cc21a3fd99a64#85
disjoint with: mixed element
subclass of: http://lodlaundromat.org/.well-known/genid/1035a7c7a9b194dabf1cc21a3fd99a64#38
disjoint with: popup element
disjoint with: record element
disjoint with: milestone element
disjoint with: http://lodlaundromat.org/.well-known/genid/1035a7c7a9b194dabf1cc21a3fd99a64#20
disjoint with: http://lodlaundromat.org/.well-known/genid/1035a7c7a9b194dabf1cc21a3fd99a64#5
disjoint with: marker element
disjoint with: http://lodlaundromat.org/.well-known/genid/1035a7c7a9b194dabf1cc21a3fd99a64#42
disjoint with: http://lodlaundromat.org/.well-known/genid/1035a7c7a9b194dabf1cc21a3fd99a64#9
disjoint with: http://lodlaundromat.org/.well-known/genid/1035a7c7a9b194dabf1cc21a3fd99a64#77
disjoint with: block element
disjoint with: non-textual element
disjoint with: headed-container element
comment: This class is defined to describe literal metadata or text that is not really part of the document body, contrarily to its disjointed sibling Atom. Its main difference with Meta is that Field can contain textual content.

headed-container element
subclass of: pattern-based element
disjoint with: flat element
disjoint with: http://lodlaundromat.org/.well-known/genid/1035a7c7a9b194dabf1cc21a3fd99a64#81
subclass of: bucket element
disjoint with: http://lodlaundromat.org/.well-known/genid/1035a7c7a9b194dabf1cc21a3fd99a64#109
disjoint with: http://lodlaundromat.org/.well-known/genid/1035a7c7a9b194dabf1cc21a3fd99a64#61
disjoint with: milestone element
subclass of: Thing
disjoint with: http://lodlaundromat.org/.well-known/genid/1035a7c7a9b194dabf1cc21a3fd99a64#94
disjoint with: inline element
disjoint with: http://lodlaundromat.org/.well-known/genid/1035a7c7a9b194dabf1cc21a3fd99a64#38
disjoint with: meta element
subclass of: non-textual element
disjoint with: textual element
disjoint with: http://lodlaundromat.org/.well-known/genid/1035a7c7a9b194dabf1cc21a3fd99a64#86
disjoint with: popup element
disjoint with: non-structured element
disjoint with: http://lodlaundromat.org/.well-known/genid/1035a7c7a9b194dabf1cc21a3fd99a64#84
subclass of: http://lodlaundromat.org/.well-known/genid/1035a7c7a9b194dabf1cc21a3fd99a64#42
disjoint with: http://lodlaundromat.org/.well-known/genid/1035a7c7a9b194dabf1cc21a3fd99a64#12
subclass of: http://lodlaundromat.org/.well-known/genid/1035a7c7a9b194dabf1cc21a3fd99a64#98
disjoint with: http://lodlaundromat.org/.well-known/genid/1035a7c7a9b194dabf1cc21a3fd99a64#103
disjoint with: marker element
disjoint with: mixed element
disjoint with: Nothing
disjoint with: http://lodlaundromat.org/.well-known/genid/1035a7c7a9b194dabf1cc21a3fd99a64#90
disjoint with: http://lodlaundromat.org/.well-known/genid/1035a7c7a9b194dabf1cc21a3fd99a64#20
subclass of: container element
disjoint with: atom element
subclass of: http://lodlaundromat.org/.well-known/genid/1035a7c7a9b194dabf1cc21a3fd99a64#45
subclass of: http://lodlaundromat.org/.well-known/genid/1035a7c7a9b194dabf1cc21a3fd99a64#25
subclass of: structured element
subclass of: http://lodlaundromat.org/.well-known/genid/1035a7c7a9b194dabf1cc21a3fd99a64#33
disjoint with: http://lodlaundromat.org/.well-known/genid/1035a7c7a9b194dabf1cc21a3fd99a64#73
disjoint with: field element
disjoint with: http://lodlaundromat.org/.well-known/genid/1035a7c7a9b194dabf1cc21a3fd99a64#1
disjoint with: block element
disjoint with: table element
disjoint with: http://lodlaundromat.org/.well-known/genid/1035a7c7a9b194dabf1cc21a3fd99a64#57
disjoint with: http://lodlaundromat.org/.well-known/genid/1035a7c7a9b194dabf1cc21a3fd99a64#77
disjoint with: record element
disjoint with: http://lodlaundromat.org/.well-known/genid/1035a7c7a9b194dabf1cc21a3fd99a64#5
subclass of: http://lodlaundromat.org/.well-known/genid/1035a7c7a9b194dabf1cc21a3fd99a64#70
disjoint with: http://lodlaundromat.org/.well-known/genid/1035a7c7a9b194dabf1cc21a3fd99a64#66
disjoint with: http://lodlaundromat.org/.well-known/genid/1035a7c7a9b194dabf1cc21a3fd99a64#53
subclass of: http://lodlaundromat.org/.well-known/genid/1035a7c7a9b194dabf1cc21a3fd99a64#16
disjoint with: http://lodlaundromat.org/.well-known/genid/1035a7c7a9b194dabf1cc21a3fd99a64#49
subclass of: http://lodlaundromat.org/.well-known/genid/1035a7c7a9b194dabf1cc21a3fd99a64#85
disjoint with: http://lodlaundromat.org/.well-known/genid/1035a7c7a9b194dabf1cc21a3fd99a64#9
subclass of: http://lodlaundromat.org/.well-known/genid/1035a7c7a9b194dabf1cc21a3fd99a64#29
type: Class
comment: This class describes container elements whose content model need to begin with one or more block elements (the heading), specified through the property containsAsHeader.

flat element
disjoint with: http://lodlaundromat.org/.well-known/genid/1035a7c7a9b194dabf1cc21a3fd99a64#85
disjoint with: http://lodlaundromat.org/.well-known/genid/1035a7c7a9b194dabf1cc21a3fd99a64#70
disjoint with: http://lodlaundromat.org/.well-known/genid/1035a7c7a9b194dabf1cc21a3fd99a64#12
disjoint with: http://lodlaundromat.org/.well-known/genid/1035a7c7a9b194dabf1cc21a3fd99a64#57
disjoint with: http://lodlaundromat.org/.well-known/genid/1035a7c7a9b194dabf1cc21a3fd99a64#53
disjoint with: http://lodlaundromat.org/.well-known/genid/1035a7c7a9b194dabf1cc21a3fd99a64#94
disjoint with: http://lodlaundromat.org/.well-known/genid/1035a7c7a9b194dabf1cc21a3fd99a64#25
disjoint with: record element
disjoint with: http://lodlaundromat.org/.well-known/genid/1035a7c7a9b194dabf1cc21a3fd99a64#66
disjoint with: http://lodlaundromat.org/.well-known/genid/1035a7c7a9b194dabf1cc21a3fd99a64#103
subclass of: non-structured element
disjoint with: container element
disjoint with: block element
disjoint with: popup element
disjoint with: http://lodlaundromat.org/.well-known/genid/1035a7c7a9b194dabf1cc21a3fd99a64#16
disjoint with: http://lodlaundromat.org/.well-known/genid/1035a7c7a9b194dabf1cc21a3fd99a64#45
disjoint with: bucket element
disjoint with: milestone element
disjoint with: http://lodlaundromat.org/.well-known/genid/1035a7c7a9b194dabf1cc21a3fd99a64#29
disjoint with: http://lodlaundromat.org/.well-known/genid/1035a7c7a9b194dabf1cc21a3fd99a64#86
disjoint with: headed-container element
disjoint with: http://lodlaundromat.org/.well-known/genid/1035a7c7a9b194dabf1cc21a3fd99a64#109
disjoint with: Nothing
subclass of: pattern-based element
subclass of: Thing
disjoint with: http://lodlaundromat.org/.well-known/genid/1035a7c7a9b194dabf1cc21a3fd99a64#49
subclass of: textual element
disjoint with: meta element
disjoint with: http://lodlaundromat.org/.well-known/genid/1035a7c7a9b194dabf1cc21a3fd99a64#42
disjoint with: http://lodlaundromat.org/.well-known/genid/1035a7c7a9b194dabf1cc21a3fd99a64#73
disjoint with: mixed element
disjoint with: http://lodlaundromat.org/.well-known/genid/1035a7c7a9b194dabf1cc21a3fd99a64#5
disjoint with: marker element
disjoint with: http://lodlaundromat.org/.well-known/genid/1035a7c7a9b194dabf1cc21a3fd99a64#81
type: Class
disjoint with: non-textual element
disjoint with: structured element
disjoint with: http://lodlaundromat.org/.well-known/genid/1035a7c7a9b194dabf1cc21a3fd99a64#77
disjoint with: table element
disjoint with: http://lodlaundromat.org/.well-known/genid/1035a7c7a9b194dabf1cc21a3fd99a64#90
disjoint with: inline element
disjoint with: http://lodlaundromat.org/.well-known/genid/1035a7c7a9b194dabf1cc21a3fd99a64#9
subclass of: http://lodlaundromat.org/.well-known/genid/1035a7c7a9b194dabf1cc21a3fd99a64#84
comment: The class of elements that can contain text nodes but no elements.

popup element
disjoint with: milestone element
disjoint with: http://lodlaundromat.org/.well-known/genid/1035a7c7a9b194dabf1cc21a3fd99a64#12
disjoint with: Nothing
type: Class
disjoint with: http://lodlaundromat.org/.well-known/genid/1035a7c7a9b194dabf1cc21a3fd99a64#57
disjoint with: http://lodlaundromat.org/.well-known/genid/1035a7c7a9b194dabf1cc21a3fd99a64#53
disjoint with: http://lodlaundromat.org/.well-known/genid/1035a7c7a9b194dabf1cc21a3fd99a64#66
subclass of: http://lodlaundromat.org/.well-known/genid/1035a7c7a9b194dabf1cc21a3fd99a64#29
disjoint with: mixed element
subclass of: http://lodlaundromat.org/.well-known/genid/1035a7c7a9b194dabf1cc21a3fd99a64#16
subclass of: http://lodlaundromat.org/.well-known/genid/1035a7c7a9b194dabf1cc21a3fd99a64#61
subclass of: pattern-based element
disjoint with: http://lodlaundromat.org/.well-known/genid/1035a7c7a9b194dabf1cc21a3fd99a64#103
disjoint with: http://lodlaundromat.org/.well-known/genid/1035a7c7a9b194dabf1cc21a3fd99a64#77
subclass of: non-textual element
equivalent class: http://lodlaundromat.org/.well-known/genid/1035a7c7a9b194dabf1cc21a3fd99a64#86
disjoint with: http://lodlaundromat.org/.well-known/genid/1035a7c7a9b194dabf1cc21a3fd99a64#38
disjoint with: atom element
disjoint with: textual element
disjoint with: http://lodlaundromat.org/.well-known/genid/1035a7c7a9b194dabf1cc21a3fd99a64#109
subclass of: http://lodlaundromat.org/.well-known/genid/1035a7c7a9b194dabf1cc21a3fd99a64#85
disjoint with: http://lodlaundromat.org/.well-known/genid/1035a7c7a9b194dabf1cc21a3fd99a64#1
disjoint with: http://lodlaundromat.org/.well-known/genid/1035a7c7a9b194dabf1cc21a3fd99a64#49
subclass of: bucket element
disjoint with: http://lodlaundromat.org/.well-known/genid/1035a7c7a9b194dabf1cc21a3fd99a64#9
disjoint with: flat element
disjoint with: block element
disjoint with: http://lodlaundromat.org/.well-known/genid/1035a7c7a9b194dabf1cc21a3fd99a64#73
disjoint with: http://lodlaundromat.org/.well-known/genid/1035a7c7a9b194dabf1cc21a3fd99a64#81
disjoint with: headed-container element
subclass of: structured element
disjoint with: http://lodlaundromat.org/.well-known/genid/1035a7c7a9b194dabf1cc21a3fd99a64#90
disjoint with: inline element
disjoint with: http://lodlaundromat.org/.well-known/genid/1035a7c7a9b194dabf1cc21a3fd99a64#98
disjoint with: http://lodlaundromat.org/.well-known/genid/1035a7c7a9b194dabf1cc21a3fd99a64#94
subclass of: Thing
disjoint with: meta element
disjoint with: http://lodlaundromat.org/.well-known/genid/1035a7c7a9b194dabf1cc21a3fd99a64#45
disjoint with: http://lodlaundromat.org/.well-known/genid/1035a7c7a9b194dabf1cc21a3fd99a64#33
disjoint with: non-structured element
disjoint with: table element
disjoint with: http://lodlaundromat.org/.well-known/genid/1035a7c7a9b194dabf1cc21a3fd99a64#84
disjoint with: record element
subclass of: http://lodlaundromat.org/.well-known/genid/1035a7c7a9b194dabf1cc21a3fd99a64#20
disjoint with: field element
subclass of: http://lodlaundromat.org/.well-known/genid/1035a7c7a9b194dabf1cc21a3fd99a64#42
disjoint with: container element
disjoint with: http://lodlaundromat.org/.well-known/genid/1035a7c7a9b194dabf1cc21a3fd99a64#25
subclass of: http://lodlaundromat.org/.well-known/genid/1035a7c7a9b194dabf1cc21a3fd99a64#86
disjoint with: http://lodlaundromat.org/.well-known/genid/1035a7c7a9b194dabf1cc21a3fd99a64#5
subclass of: http://lodlaundromat.org/.well-known/genid/1035a7c7a9b194dabf1cc21a3fd99a64#70
disjoint with: marker element
comment: This class defines bucket elements that are only present within block and inline elements. Popup elements are used whenever complex structures need to be placed within content elements such as paragraphs.
subclass of: http://lodlaundromat.org/.well-known/genid/1035a7c7a9b194dabf1cc21a3fd99a64#93
subclass of: http://lodlaundromat.org/.well-known/genid/1035a7c7a9b194dabf1cc21a3fd99a64#97

bucket element
disjoint with: http://lodlaundromat.org/.well-known/genid/1035a7c7a9b194dabf1cc21a3fd99a64#57
disjoint with: http://lodlaundromat.org/.well-known/genid/1035a7c7a9b194dabf1cc21a3fd99a64#38
disjoint with: http://lodlaundromat.org/.well-known/genid/1035a7c7a9b194dabf1cc21a3fd99a64#94
disjoint with: http://lodlaundromat.org/.well-known/genid/1035a7c7a9b194dabf1cc21a3fd99a64#84
disjoint with: mixed element
disjoint with: inline element
subclass of: Thing
disjoint with: field element
disjoint with: http://lodlaundromat.org/.well-known/genid/1035a7c7a9b194dabf1cc21a3fd99a64#53
disjoint with: http://lodlaundromat.org/.well-known/genid/1035a7c7a9b194dabf1cc21a3fd99a64#5
disjoint with: http://lodlaundromat.org/.well-known/genid/1035a7c7a9b194dabf1cc21a3fd99a64#9
disjoint with: http://lodlaundromat.org/.well-known/genid/1035a7c7a9b194dabf1cc21a3fd99a64#66
disjoint with: http://lodlaundromat.org/.well-known/genid/1035a7c7a9b194dabf1cc21a3fd99a64#49
disjoint with: block element
subclass of: structured element
disjoint with: http://lodlaundromat.org/.well-known/genid/1035a7c7a9b194dabf1cc21a3fd99a64#77
disjoint with: Nothing
disjoint with: http://lodlaundromat.org/.well-known/genid/1035a7c7a9b194dabf1cc21a3fd99a64#1
subclass of: pattern-based element
type: Class
disjoint with: marker element
subclass of: http://lodlaundromat.org/.well-known/genid/1035a7c7a9b194dabf1cc21a3fd99a64#85
disjoint with: http://lodlaundromat.org/.well-known/genid/1035a7c7a9b194dabf1cc21a3fd99a64#90
disjoint with: milestone element
disjoint with: textual element
disjoint with: http://lodlaundromat.org/.well-known/genid/1035a7c7a9b194dabf1cc21a3fd99a64#73
disjoint with: http://lodlaundromat.org/.well-known/genid/1035a7c7a9b194dabf1cc21a3fd99a64#81
disjoint with: flat element
disjoint with: non-structured element
disjoint with: meta element
subclass of: non-textual element
disjoint with: atom element
disjoint with: http://lodlaundromat.org/.well-known/genid/1035a7c7a9b194dabf1cc21a3fd99a64#12
comment: The class of elements that can contain other elements but no text nodes.

has name
sub property of: topDataProperty
property disjoint with: bottomDataProperty
property disjoint with: can contain heteronymous elements
property disjoint with: can contain homonymous elements
type: FunctionalProperty
type: DatatypeProperty
comment: The name of a particular element.
range: string

record element
disjoint with: http://lodlaundromat.org/.well-known/genid/1035a7c7a9b194dabf1cc21a3fd99a64#12
subclass of: http://lodlaundromat.org/.well-known/genid/1035a7c7a9b194dabf1cc21a3fd99a64#25
disjoint with: http://lodlaundromat.org/.well-known/genid/1035a7c7a9b194dabf1cc21a3fd99a64#86
subclass of: http://lodlaundromat.org/.well-known/genid/1035a7c7a9b194dabf1cc21a3fd99a64#98
disjoint with: http://lodlaundromat.org/.well-known/genid/1035a7c7a9b194dabf1cc21a3fd99a64#73
disjoint with: Nothing
disjoint with: table element
disjoint with: marker element
subclass of: http://lodlaundromat.org/.well-known/genid/1035a7c7a9b194dabf1cc21a3fd99a64#103
disjoint with: block element
disjoint with: http://lodlaundromat.org/.well-known/genid/1035a7c7a9b194dabf1cc21a3fd99a64#5
disjoint with: http://lodlaundromat.org/.well-known/genid/1035a7c7a9b194dabf1cc21a3fd99a64#49
disjoint with: http://lodlaundromat.org/.well-known/genid/1035a7c7a9b194dabf1cc21a3fd99a64#66
disjoint with: flat element
subclass of: structured element
subclass of: http://lodlaundromat.org/.well-known/genid/1035a7c7a9b194dabf1cc21a3fd99a64#33
disjoint with: http://lodlaundromat.org/.well-known/genid/1035a7c7a9b194dabf1cc21a3fd99a64#53
disjoint with: http://lodlaundromat.org/.well-known/genid/1035a7c7a9b194dabf1cc21a3fd99a64#81
subclass of: http://lodlaundromat.org/.well-known/genid/1035a7c7a9b194dabf1cc21a3fd99a64#85
disjoint with: non-structured element
type: Class
disjoint with: http://lodlaundromat.org/.well-known/genid/1035a7c7a9b194dabf1cc21a3fd99a64#84
disjoint with: http://lodlaundromat.org/.well-known/genid/1035a7c7a9b194dabf1cc21a3fd99a64#90
subclass of: non-textual element
subclass of: http://lodlaundromat.org/.well-known/genid/1035a7c7a9b194dabf1cc21a3fd99a64#70
disjoint with: mixed element
disjoint with: http://lodlaundromat.org/.well-known/genid/1035a7c7a9b194dabf1cc21a3fd99a64#20
disjoint with: http://lodlaundromat.org/.well-known/genid/1035a7c7a9b194dabf1cc21a3fd99a64#61
disjoint with: http://lodlaundromat.org/.well-known/genid/1035a7c7a9b194dabf1cc21a3fd99a64#77
equivalent class: http://lodlaundromat.org/.well-known/genid/1035a7c7a9b194dabf1cc21a3fd99a64#103
disjoint with: popup element
disjoint with: meta element
disjoint with: field element
disjoint with: inline element
subclass of: http://lodlaundromat.org/.well-known/genid/1035a7c7a9b194dabf1cc21a3fd99a64#29
subclass of: pattern-based element
disjoint with: http://lodlaundromat.org/.well-known/genid/1035a7c7a9b194dabf1cc21a3fd99a64#109
disjoint with: http://lodlaundromat.org/.well-known/genid/1035a7c7a9b194dabf1cc21a3fd99a64#57
subclass of: container element
subclass of: Thing
subclass of: http://lodlaundromat.org/.well-known/genid/1035a7c7a9b194dabf1cc21a3fd99a64#16
disjoint with: atom element
disjoint with: headed-container element
disjoint with: http://lodlaundromat.org/.well-known/genid/1035a7c7a9b194dabf1cc21a3fd99a64#1
disjoint with: textual element
disjoint with: http://lodlaundromat.org/.well-known/genid/1035a7c7a9b194dabf1cc21a3fd99a64#9
disjoint with: milestone element
subclass of: bucket element
disjoint with: http://lodlaundromat.org/.well-known/genid/1035a7c7a9b194dabf1cc21a3fd99a64#38
subclass of: http://lodlaundromat.org/.well-known/genid/1035a7c7a9b194dabf1cc21a3fd99a64#42
disjoint with: http://lodlaundromat.org/.well-known/genid/1035a7c7a9b194dabf1cc21a3fd99a64#94
comment: This class describes container elements that can only contain heterogeneous and non repeatable elements.

non-textual element
disjoint with: http://lodlaundromat.org/.well-known/genid/1035a7c7a9b194dabf1cc21a3fd99a64#12
disjoint with: http://lodlaundromat.org/.well-known/genid/1035a7c7a9b194dabf1cc21a3fd99a64#9
disjoint with: block element
disjoint with: http://lodlaundromat.org/.well-known/genid/1035a7c7a9b194dabf1cc21a3fd99a64#94
type: Class
disjoint with: http://lodlaundromat.org/.well-known/genid/1035a7c7a9b194dabf1cc21a3fd99a64#38
disjoint with: textual element
disjoint with: mixed element
complement of: textual element
disjoint with: http://lodlaundromat.org/.well-known/genid/1035a7c7a9b194dabf1cc21a3fd99a64#5
disjoint with: Nothing
disjoint with: atom element
equivalent class: http://lodlaundromat.org/.well-known/genid/1035a7c7a9b194dabf1cc21a3fd99a64#85
disjoint with: flat element
disjoint with: http://lodlaundromat.org/.well-known/genid/1035a7c7a9b194dabf1cc21a3fd99a64#90
subclass of: Thing
disjoint with: http://lodlaundromat.org/.well-known/genid/1035a7c7a9b194dabf1cc21a3fd99a64#1
disjoint with: http://lodlaundromat.org/.well-known/genid/1035a7c7a9b194dabf1cc21a3fd99a64#77
disjoint with: http://lodlaundromat.org/.well-known/genid/1035a7c7a9b194dabf1cc21a3fd99a64#57
disjoint with: inline element
disjoint with: http://lodlaundromat.org/.well-known/genid/1035a7c7a9b194dabf1cc21a3fd99a64#53
disjoint with: field element
subclass of: http://lodlaundromat.org/.well-known/genid/1035a7c7a9b194dabf1cc21a3fd99a64#85
disjoint with: http://lodlaundromat.org/.well-known/genid/1035a7c7a9b194dabf1cc21a3fd99a64#81
disjoint with: http://lodlaundromat.org/.well-known/genid/1035a7c7a9b194dabf1cc21a3fd99a64#49
subclass of: pattern-based element
comment: The class of elements that cannot have textual content in their content models.

atom element
subclass of: Thing
disjoint with: http://lodlaundromat.org/.well-known/genid/1035a7c7a9b194dabf1cc21a3fd99a64#49
disjoint with: meta element
disjoint with: milestone element
disjoint with: http://lodlaundromat.org/.well-known/genid/1035a7c7a9b194dabf1cc21a3fd99a64#81
disjoint with: inline element
subclass of: http://lodlaundromat.org/.well-known/genid/1035a7c7a9b194dabf1cc21a3fd99a64#84
equivalent class: http://lodlaundromat.org/.well-known/genid/1035a7c7a9b194dabf1cc21a3fd99a64#1
disjoint with: http://lodlaundromat.org/.well-known/genid/1035a7c7a9b194dabf1cc21a3fd99a64#90
disjoint with: http://lodlaundromat.org/.well-known/genid/1035a7c7a9b194dabf1cc21a3fd99a64#53
disjoint with: mixed element
disjoint with: http://lodlaundromat.org/.well-known/genid/1035a7c7a9b194dabf1cc21a3fd99a64#73
disjoint with: http://lodlaundromat.org/.well-known/genid/1035a7c7a9b194dabf1cc21a3fd99a64#9
subclass of: http://lodlaundromat.org/.well-known/genid/1035a7c7a9b194dabf1cc21a3fd99a64#20
disjoint with: field element
disjoint with: http://lodlaundromat.org/.well-known/genid/1035a7c7a9b194dabf1cc21a3fd99a64#85
subclass of: textual element
disjoint with: http://lodlaundromat.org/.well-known/genid/1035a7c7a9b194dabf1cc21a3fd99a64#38
disjoint with: http://lodlaundromat.org/.well-known/genid/1035a7c7a9b194dabf1cc21a3fd99a64#70
disjoint with: http://lodlaundromat.org/.well-known/genid/1035a7c7a9b194dabf1cc21a3fd99a64#103
disjoint with: http://lodlaundromat.org/.well-known/genid/1035a7c7a9b194dabf1cc21a3fd99a64#12
disjoint with: http://lodlaundromat.org/.well-known/genid/1035a7c7a9b194dabf1cc21a3fd99a64#77
subclass of: http://lodlaundromat.org/.well-known/genid/1035a7c7a9b194dabf1cc21a3fd99a64#1
disjoint with: table element
disjoint with: http://lodlaundromat.org/.well-known/genid/1035a7c7a9b194dabf1cc21a3fd99a64#42
disjoint with: non-textual element
subclass of: flat element
disjoint with: http://lodlaundromat.org/.well-known/genid/1035a7c7a9b194dabf1cc21a3fd99a64#109
disjoint with: container element
disjoint with: Nothing
disjoint with: record element
disjoint with: structured element
disjoint with: marker element
type: Class
disjoint with: http://lodlaundromat.org/.well-known/genid/1035a7c7a9b194dabf1cc21a3fd99a64#94
disjoint with: http://lodlaundromat.org/.well-known/genid/1035a7c7a9b194dabf1cc21a3fd99a64#16
disjoint with: http://lodlaundromat.org/.well-known/genid/1035a7c7a9b194dabf1cc21a3fd99a64#66
disjoint with: http://lodlaundromat.org/.well-known/genid/1035a7c7a9b194dabf1cc21a3fd99a64#86
subclass of: pattern-based element
disjoint with: http://lodlaundromat.org/.well-known/genid/1035a7c7a9b194dabf1cc21a3fd99a64#5
subclass of: non-structured element
disjoint with: popup element
disjoint with: http://lodlaundromat.org/.well-known/genid/1035a7c7a9b194dabf1cc21a3fd99a64#25
disjoint with: http://lodlaundromat.org/.well-known/genid/1035a7c7a9b194dabf1cc21a3fd99a64#45
disjoint with: bucket element
disjoint with: http://lodlaundromat.org/.well-known/genid/1035a7c7a9b194dabf1cc21a3fd99a64#98
disjoint with: block element
disjoint with: http://lodlaundromat.org/.well-known/genid/1035a7c7a9b194dabf1cc21a3fd99a64#57
disjoint with: http://lodlaundromat.org/.well-known/genid/1035a7c7a9b194dabf1cc21a3fd99a64#33
disjoint with: headed-container element
subclass of: http://lodlaundromat.org/.well-known/genid/1035a7c7a9b194dabf1cc21a3fd99a64#61
disjoint with: http://lodlaundromat.org/.well-known/genid/1035a7c7a9b194dabf1cc21a3fd99a64#29
comment: This class is defined to describe literal text that is part of the document body. Moreover, similarly to Inline, elements following the Atom pattern can only be contained within block or inline elements (and consequently they also cannot be used as root elements of documents). It can contain textual content and no other elements.
subclass of: http://lodlaundromat.org/.well-known/genid/1035a7c7a9b194dabf1cc21a3fd99a64#8

can contain heteronymous elements
sub property of: topDataProperty
property disjoint with: bottomDataProperty
property disjoint with: has name
type: FunctionalProperty
type: DatatypeProperty
comment: A hierarchical-based entity contains al least two entities having different names.
domain: structured element
range: boolean

contains
sub property of: topObjectProperty
property disjoint with: bottomObjectProperty
inverse of: is contained by
type: ObjectProperty
comment: A structured element contains another generic element.
domain: structured element

structured element
subclass of: pattern-based element
disjoint with: meta element
disjoint with: http://lodlaundromat.org/.well-known/genid/1035a7c7a9b194dabf1cc21a3fd99a64#84
disjoint with: non-structured element
disjoint with: marker element
disjoint with: field element
disjoint with: milestone element
disjoint with: flat element
disjoint with: http://lodlaundromat.org/.well-known/genid/1035a7c7a9b194dabf1cc21a3fd99a64#1
type: Class
disjoint with: Nothing
disjoint with: atom element
disjoint with: http://lodlaundromat.org/.well-known/genid/1035a7c7a9b194dabf1cc21a3fd99a64#73
complement of: http://lodlaundromat.org/.well-known/genid/1035a7c7a9b194dabf1cc21a3fd99a64#84
complement of: non-structured element
disjoint with: http://lodlaundromat.org/.well-known/genid/1035a7c7a9b194dabf1cc21a3fd99a64#38
subclass of: Thing
disjoint with: http://lodlaundromat.org/.well-known/genid/1035a7c7a9b194dabf1cc21a3fd99a64#66
comment: The class of elements that can contain other elements.

meta element
disjoint with: atom element
disjoint with: http://lodlaundromat.org/.well-known/genid/1035a7c7a9b194dabf1cc21a3fd99a64#73
disjoint with: http://lodlaundromat.org/.well-known/genid/1035a7c7a9b194dabf1cc21a3fd99a64#38
disjoint with: http://lodlaundromat.org/.well-known/genid/1035a7c7a9b194dabf1cc21a3fd99a64#53
disjoint with: record element
subclass of: non-structured element
type: Class
disjoint with: http://lodlaundromat.org/.well-known/genid/1035a7c7a9b194dabf1cc21a3fd99a64#109
disjoint with: http://lodlaundromat.org/.well-known/genid/1035a7c7a9b194dabf1cc21a3fd99a64#86
disjoint with: table element
disjoint with: http://lodlaundromat.org/.well-known/genid/1035a7c7a9b194dabf1cc21a3fd99a64#20
disjoint with: textual element
disjoint with: block element
disjoint with: http://lodlaundromat.org/.well-known/genid/1035a7c7a9b194dabf1cc21a3fd99a64#57
subclass of: http://lodlaundromat.org/.well-known/genid/1035a7c7a9b194dabf1cc21a3fd99a64#98
disjoint with: flat element
disjoint with: bucket element
subclass of: http://lodlaundromat.org/.well-known/genid/1035a7c7a9b194dabf1cc21a3fd99a64#66
disjoint with: http://lodlaundromat.org/.well-known/genid/1035a7c7a9b194dabf1cc21a3fd99a64#42
disjoint with: inline element
disjoint with: milestone element
subclass of: http://lodlaundromat.org/.well-known/genid/1035a7c7a9b194dabf1cc21a3fd99a64#85
disjoint with: container element
subclass of: Thing
disjoint with: popup element
disjoint with: field element
disjoint with: http://lodlaundromat.org/.well-known/genid/1035a7c7a9b194dabf1cc21a3fd99a64#81
disjoint with: http://lodlaundromat.org/.well-known/genid/1035a7c7a9b194dabf1cc21a3fd99a64#61
disjoint with: http://lodlaundromat.org/.well-known/genid/1035a7c7a9b194dabf1cc21a3fd99a64#16
disjoint with: headed-container element
disjoint with: http://lodlaundromat.org/.well-known/genid/1035a7c7a9b194dabf1cc21a3fd99a64#5
disjoint with: Nothing
disjoint with: http://lodlaundromat.org/.well-known/genid/1035a7c7a9b194dabf1cc21a3fd99a64#49
disjoint with: http://lodlaundromat.org/.well-known/genid/1035a7c7a9b194dabf1cc21a3fd99a64#29
equivalent class: http://lodlaundromat.org/.well-known/genid/1035a7c7a9b194dabf1cc21a3fd99a64#66
disjoint with: http://lodlaundromat.org/.well-known/genid/1035a7c7a9b194dabf1cc21a3fd99a64#90
disjoint with: http://lodlaundromat.org/.well-known/genid/1035a7c7a9b194dabf1cc21a3fd99a64#9
disjoint with: http://lodlaundromat.org/.well-known/genid/1035a7c7a9b194dabf1cc21a3fd99a64#103
disjoint with: http://lodlaundromat.org/.well-known/genid/1035a7c7a9b194dabf1cc21a3fd99a64#94
subclass of: http://lodlaundromat.org/.well-known/genid/1035a7c7a9b194dabf1cc21a3fd99a64#84
disjoint with: mixed element
subclass of: http://lodlaundromat.org/.well-known/genid/1035a7c7a9b194dabf1cc21a3fd99a64#33
disjoint with: http://lodlaundromat.org/.well-known/genid/1035a7c7a9b194dabf1cc21a3fd99a64#77
subclass of: pattern-based element
disjoint with: http://lodlaundromat.org/.well-known/genid/1035a7c7a9b194dabf1cc21a3fd99a64#12
subclass of: marker element
disjoint with: http://lodlaundromat.org/.well-known/genid/1035a7c7a9b194dabf1cc21a3fd99a64#1
disjoint with: http://lodlaundromat.org/.well-known/genid/1035a7c7a9b194dabf1cc21a3fd99a64#45
disjoint with: structured element
disjoint with: http://lodlaundromat.org/.well-known/genid/1035a7c7a9b194dabf1cc21a3fd99a64#25
subclass of: non-textual element
disjoint with: http://lodlaundromat.org/.well-known/genid/1035a7c7a9b194dabf1cc21a3fd99a64#70
comment: This class describes elements that contain neither other elements nor textual content. Contrarily to the pattern Milestone, which was meant to describe markup elements that impact the document because of their location, the main feature of its disjoint sibling is the mere existence, independently from the position it has within the document. Meta elements convey metadata information about the document or part of it, independently of where they are. Thus, meta elements can be contained only within container elements.

block element
disjoint with: container element
disjoint with: http://lodlaundromat.org/.well-known/genid/1035a7c7a9b194dabf1cc21a3fd99a64#16
disjoint with: marker element
disjoint with: Nothing
disjoint with: http://lodlaundromat.org/.well-known/genid/1035a7c7a9b194dabf1cc21a3fd99a64#66
subclass of: http://lodlaundromat.org/.well-known/genid/1035a7c7a9b194dabf1cc21a3fd99a64#12
disjoint with: headed-container element
disjoint with: http://lodlaundromat.org/.well-known/genid/1035a7c7a9b194dabf1cc21a3fd99a64#61
subclass of: pattern-based element
subclass of: Thing
disjoint with: http://lodlaundromat.org/.well-known/genid/1035a7c7a9b194dabf1cc21a3fd99a64#73
type: Class
disjoint with: http://lodlaundromat.org/.well-known/genid/1035a7c7a9b194dabf1cc21a3fd99a64#38
subclass of: http://lodlaundromat.org/.well-known/genid/1035a7c7a9b194dabf1cc21a3fd99a64#81
equivalent class: http://lodlaundromat.org/.well-known/genid/1035a7c7a9b194dabf1cc21a3fd99a64#12
disjoint with: http://lodlaundromat.org/.well-known/genid/1035a7c7a9b194dabf1cc21a3fd99a64#103
disjoint with: flat element
disjoint with: table element
subclass of: http://lodlaundromat.org/.well-known/genid/1035a7c7a9b194dabf1cc21a3fd99a64#90
disjoint with: non-structured element
disjoint with: popup element
subclass of: structured element
disjoint with: http://lodlaundromat.org/.well-known/genid/1035a7c7a9b194dabf1cc21a3fd99a64#45
disjoint with: atom element
disjoint with: milestone element
disjoint with: meta element
disjoint with: http://lodlaundromat.org/.well-known/genid/1035a7c7a9b194dabf1cc21a3fd99a64#29
subclass of: mixed element
disjoint with: http://lodlaundromat.org/.well-known/genid/1035a7c7a9b194dabf1cc21a3fd99a64#25
disjoint with: inline element
subclass of: http://lodlaundromat.org/.well-known/genid/1035a7c7a9b194dabf1cc21a3fd99a64#94
disjoint with: http://lodlaundromat.org/.well-known/genid/1035a7c7a9b194dabf1cc21a3fd99a64#42
subclass of: http://lodlaundromat.org/.well-known/genid/1035a7c7a9b194dabf1cc21a3fd99a64#98
disjoint with: http://lodlaundromat.org/.well-known/genid/1035a7c7a9b194dabf1cc21a3fd99a64#20
subclass of: http://lodlaundromat.org/.well-known/genid/1035a7c7a9b194dabf1cc21a3fd99a64#57
subclass of: http://lodlaundromat.org/.well-known/genid/1035a7c7a9b194dabf1cc21a3fd99a64#9
disjoint with: http://lodlaundromat.org/.well-known/genid/1035a7c7a9b194dabf1cc21a3fd99a64#85
disjoint with: record element
disjoint with: field element
subclass of: http://lodlaundromat.org/.well-known/genid/1035a7c7a9b194dabf1cc21a3fd99a64#53
subclass of: http://lodlaundromat.org/.well-known/genid/1035a7c7a9b194dabf1cc21a3fd99a64#5
disjoint with: bucket element
subclass of: http://lodlaundromat.org/.well-known/genid/1035a7c7a9b194dabf1cc21a3fd99a64#33
disjoint with: non-textual element
disjoint with: http://lodlaundromat.org/.well-known/genid/1035a7c7a9b194dabf1cc21a3fd99a64#84
disjoint with: http://lodlaundromat.org/.well-known/genid/1035a7c7a9b194dabf1cc21a3fd99a64#109
disjoint with: http://lodlaundromat.org/.well-known/genid/1035a7c7a9b194dabf1cc21a3fd99a64#49
disjoint with: http://lodlaundromat.org/.well-known/genid/1035a7c7a9b194dabf1cc21a3fd99a64#70
disjoint with: http://lodlaundromat.org/.well-known/genid/1035a7c7a9b194dabf1cc21a3fd99a64#86
subclass of: http://lodlaundromat.org/.well-known/genid/1035a7c7a9b194dabf1cc21a3fd99a64#77
disjoint with: http://lodlaundromat.org/.well-known/genid/1035a7c7a9b194dabf1cc21a3fd99a64#1
subclass of: textual element
comment: This class organise the document content as a sequence of nestable elements and text nodes. In particular, elements following this pattern can contain text and other elements compliant with the patterns Inline, Atom, Milestones and Popup, which will be introduced in the following. Furthermore, it is a requirement that block elements are contained only by container and popup elements
subclass of: http://lodlaundromat.org/.well-known/genid/1035a7c7a9b194dabf1cc21a3fd99a64#19

http://lodlaundromat.org/.well-known/genid/1035a7c7a9b194dabf1cc21a3fd99a64#106
type: Restriction
has value: true
on property: can contain heteronymous elements

http://lodlaundromat.org/.well-known/genid/1035a7c7a9b194dabf1cc21a3fd99a64#114
type: Restriction
has value: true
on property: can contain homonymous elements

http://lodlaundromat.org/.well-known/genid/1035a7c7a9b194dabf1cc21a3fd99a64#112
type: Restriction
has value: false
on property: can contain heteronymous elements

http://lodlaundromat.org/.well-known/genid/1035a7c7a9b194dabf1cc21a3fd99a64#228
type: DatavaluedPropertyAtom
argument1: http://www.essepuntato.it/2008/12/pattern#x
argument2: false
property predicate: can contain heteronymous elements

http://lodlaundromat.org/.well-known/genid/1035a7c7a9b194dabf1cc21a3fd99a64#215
type: DatavaluedPropertyAtom
argument1: p
argument2: true
property predicate: can contain homonymous elements

http://lodlaundromat.org/.well-known/genid/1035a7c7a9b194dabf1cc21a3fd99a64#173
type: DatavaluedPropertyAtom
argument1: http://www.essepuntato.it/2008/12/pattern#p
argument2: true
property predicate: can contain heteronymous elements

http://lodlaundromat.org/.well-known/genid/1035a7c7a9b194dabf1cc21a3fd99a64#152
type: DatavaluedPropertyAtom
argument1: http://www.essepuntato.it/2008/12/pattern#x
argument2: false
property predicate: can contain homonymous elements

The Pattern Ontology Describing documents by means of their structural components
version info: 1.4.2
creator: Fabio Vitali
backward compatible with: Pattern-1 4.owl
date: 2013-07-16
comment: An ontology defining formally patterns for segmenting a document into atomic components, in order to be manipulated independently and re-flowed in different contexts.
description: The idea of using patterns to produce reusable and high-quality assets is not new in the literature. Software engineers, architects (as Alexander who first introduced this term) and designers very often use – or rather reuse – patterns to handle problems which recur over and over. Patterns have also been studied to modularize and customize web ontologies (http://ontologydesignpatterns.org). They guarantee the flexibility and maintainability of concepts and solutions in several heterogeneous scenarios. We've been investigating patterns for XML documents for some time. The overall goal of this research is to understand how the structure of digital documents can be segmented into atomic components, that can be manipulated independently and re-flowed in different contexts. Instead of defining a large number of complex and diversified structures, we have identified a small number of structures/patterns that are sufficient to express what most users need. Our idea is that a low number of patterns are enough to capture the most relevant document structures.
label: pattern ontology
creator: Angelo Di Iorio
creator: Silvio Peroni
prior version: Pattern-1 4.owl
type: Ontology

http://lodlaundromat.org/.well-known/genid/1035a7c7a9b194dabf1cc21a3fd99a64#108
type: Restriction
has value: false
on property: can contain homonymous elements