tab
sub property of: topObjectProperty
property disjoint with: bottomObjectProperty
type: ObjectProperty
type: Property
comment: A grouping label providing a mechanism for selecting the tab content that is to be rendered to the user.

application
sub property of: topObjectProperty
property disjoint with: bottomObjectProperty
type: ObjectProperty
type: Property
comment: A region declared as a web application, as opposed to a web document.

Date Created
sub property of: date
date: 2000-07-11
property disjoint with: bottomDataProperty
Relation: created-003
Date Modified: 2008-01-14
type: DatatypeProperty
date: 2008-01-14
sub property of: topDataProperty
relation: created-003
Has Version: created-003
issued: 2000-07-11
type: Thing
sub property of: Date
range: Literal
comment: Date of creation of the resource.
type: Property

familyName
term status: testing
type: Thing
sub property of: topDataProperty
property disjoint with: bottomDataProperty
type: DatatypeProperty
type: Property
comment: The family name of some person.
domain: Person
range: Literal

Management of a Crisis Vocabulary namespace
type: Thing
type: http://lodlaundromat.org/.well-known/genid/samples/pellet///predicate//fe8d8faed6702d7784e1ccba87e71ab5/d3e700bc1857a8001f8ca87e5b965b3a#4
Date Created: 2012-01-29T20:30:00Z
date: 2012-01-29T20:30:00Z
created by: http://lodlaundromat.org/.well-known/genid/samples/pellet///predicate//fe8d8faed6702d7784e1ccba87e71ab5/9445b29090531f162805053b8f46ccee#1
type: http://lodlaundromat.org/.well-known/genid/samples/pellet///predicate//fe8d8faed6702d7784e1ccba87e71ab5/d3e700bc1857a8001f8ca87e5b965b3a#7
type: InformationRealization
type: Entity
type: Data Item
was generated by: http://lodlaundromat.org/.well-known/genid/samples/pellet///predicate//fe8d8faed6702d7784e1ccba87e71ab5/9445b29090531f162805053b8f46ccee#1
type: Ontology
creator: Tomi Kauppinen

Skype ID
term status: testing
type: Thing
sub property of: topDataProperty
sub property of: nickname
property disjoint with: bottomDataProperty
type: DatatypeProperty
type: Property
comment: A Skype ID
domain: Agent
range: Literal

Accrual Method
issued: 2005-06-13
date: 2010-10-11
Has Version: accrualMethod-003
Relation: accrualMethod-003
type: ObjectProperty
Date Modified: 2010-10-11
sub property of: topObjectProperty
date: 2005-06-13
property disjoint with: bottomObjectProperty
type: Thing
relation: accrualMethod-003
type: Property
comment: The method by which items are added to a collection.
domain: Collection
range: Method of Accrual

tablist
sub property of: topObjectProperty
property disjoint with: bottomObjectProperty
type: ObjectProperty
type: Property
comment: A list of tab elements, which are references to tabpanel elements.

search
sub property of: topObjectProperty
property disjoint with: bottomObjectProperty
type: ObjectProperty
type: Property
member: role-properties
comment: indicates that the section provides a search facility.

subsection
term: subsection
type: Thing
sub property of: topObjectProperty
property disjoint with: bottomObjectProperty
type: ObjectProperty
type: Property
member: relrev-properties
comment: subsection refers to a resource serving as a subsection in a collection.

Bibliographic Resource
Relation: BibliographicResource-001
date: 2008-01-14
subclass of: Thing
relation: BibliographicResource-001
issued: 2008-01-14
type: Class
Has Version: BibliographicResource-001
type: Thing
disjoint with: Nothing
comment: A book, article, or other documentary resource.

Accrual Periodicity
Date Modified: 2010-10-11
sub property of: topObjectProperty
date: 2010-10-11
issued: 2005-06-13
date: 2005-06-13
type: Thing
Relation: accrualPeriodicity-003
property disjoint with: bottomObjectProperty
Has Version: accrualPeriodicity-003
type: ObjectProperty
relation: accrualPeriodicity-003
type: Property
comment: The frequency with which items are added to a collection.
domain: Collection
range: Frequency

Creation Guideline
disjoint with: Nothing
disjoint with: File
subclass of: Plan
subclass of: Data Item
subclass of: InformationRealization
type: Class
subclass of: http://lodlaundromat.org/.well-known/genid/samples/pellet///predicate//fe8d8faed6702d7784e1ccba87e71ab5/d3e700bc1857a8001f8ca87e5b965b3a#4
subclass of: Thing
subclass of: http://lodlaundromat.org/.well-known/genid/samples/pellet///predicate//fe8d8faed6702d7784e1ccba87e71ab5/d3e700bc1857a8001f8ca87e5b965b3a#7
subclass of: Entity
comment: CreationGuideline is a concept that represents a guideline used to guide the execution of a data creation. Examples for creation guidelines are transformation rules, mapping definitions, entailment rules, and database queries.

guided by
sub property of: topObjectProperty
sub property of: used
property disjoint with: accessed
property disjoint with: serialized by
property disjoint with: bottomObjectProperty
type: ObjectProperty
comment: This property refers to a creation guideline which guided the execution of a data creation. Examples for creation guidelines are transformation rules, mapping definitions, entailment rules, and database queries. Notice, all creation guidelines have provenance; we strongly encourage to describe this provenance as well, at least as far as available information permits.
domain: Data Creation
range: Creation Guideline

License Document
issued: 2008-01-14
Relation: LicenseDocument-001
subclass of: Rights Statement
relation: LicenseDocument-001
disjoint with: Nothing
type: Thing
type: Class
subclass of: Thing
date: 2008-01-14
Has Version: LicenseDocument-001
comment: A legal document giving official permission to do something with a Resource.

Description
date: 2008-01-14
description: Description may include but is not limited to: an abstract, a table of contents, a graphical representation, or a free-text account of the resource.
Relation: descriptionT-001
relation: descriptionT-001
type: Thing
sub property of: topDataProperty
type: DatatypeProperty
Date Modified: 2008-01-14
property disjoint with: bottomDataProperty
Has Version: descriptionT-001
sub property of: description
issued: 2008-01-14
comment: An account of the resource.
type: Property

group
sub property of: topObjectProperty
property disjoint with: bottomObjectProperty
type: ObjectProperty
type: Property
comment: A set of user interface objects which are not intended to be included in a page summary or table of contents by assistive technologies.

treegrid
sub property of: topObjectProperty
property disjoint with: bottomObjectProperty
type: ObjectProperty
type: Property
comment: A grid whose rows can be expanded and collapsed in the same manner as for a tree.

radiogroup
sub property of: topObjectProperty
property disjoint with: bottomObjectProperty
type: ObjectProperty
type: Property
comment: A group of radio buttons.

UDC
date: 2008-01-14
relation: UDC-003
date: 2000-07-11
Relation: UDC-003
type: VocabularyEncodingScheme
type: Thing
Has Version: UDC-003
Date Modified: 2008-01-14
issued: 2000-07-11
comment: The set of conceptual resources specified by the Universal Decimal Classification.

appendix
term: appendix
type: Thing
sub property of: topObjectProperty
property disjoint with: bottomObjectProperty
type: ObjectProperty
type: Property
member: relrev-properties
comment: appendix refers to a resource serving as an appendix in a collection.

help
term: help
type: Thing
sub property of: topObjectProperty
property disjoint with: bottomObjectProperty
type: ObjectProperty
type: Property
member: relrev-properties
comment: help refers to a resource offering help.

Is Replaced By
type: ObjectProperty
sub property of: topObjectProperty
date: 2008-01-14
date: 2000-07-11
sub property of: relation
property disjoint with: bottomObjectProperty
relation: isReplacedBy-003
note: This term is intended to be used with non-literal values as defined in the DCMI Abstract Model (http://dublincore.org/documents/abstract-model/). As of December 2007, the DCMI Usage Board is seeking a way to express this intention with a formal range declaration.
Date Modified: 2008-01-14
issued: 2000-07-11
Relation: isReplacedBy-003
sub property of: Relation
Has Version: isReplacedBy-003
type: Thing
type: Property
comment: A related resource that supplants, displaces, or supersedes the described resource.

interest
term status: testing
type: Thing
sub property of: topObjectProperty
property disjoint with: bottomObjectProperty
type: ObjectProperty
type: Property
comment: A page about a topic of interest to this person.
domain: Agent
range: Document

treeitem
sub property of: topObjectProperty
property disjoint with: bottomObjectProperty
type: ObjectProperty
type: Property
comment: An option item of a tree. This is an element within a tree that may be expanded or collapsed if it contains a sub-level group of treeitems.

work info homepage
property disjoint with: bottomObjectProperty
property disjoint with: operated by
sub property of: topObjectProperty
type: Thing
type: ObjectProperty
property disjoint with: used by
term status: testing
property disjoint with: runs
type: Property
comment: A work info homepage of some person; a page about their work for some organization.
domain: Person
range: Document

title
term status: testing
type: Thing
sub property of: topDataProperty
property disjoint with: bottomDataProperty
type: DatatypeProperty
type: Property
comment: Title (Mr, Mrs, Ms, Dr. etc)

Has Part
property disjoint with: bottomObjectProperty
relation: hasPart-003
Date Modified: 2008-01-14
Relation: hasPart-003
type: ObjectProperty
date: 2000-07-11
type: Thing
issued: 2000-07-11
note: This term is intended to be used with non-literal values as defined in the DCMI Abstract Model (http://dublincore.org/documents/abstract-model/). As of December 2007, the DCMI Usage Board is seeking a way to express this intention with a formal range declaration.
sub property of: relation
date: 2008-01-14
Has Version: hasPart-003
sub property of: topObjectProperty
sub property of: Relation
type: Property
comment: A related resource that is included either physically or logically in the described resource.

account service homepage
term status: testing
type: Thing
sub property of: topObjectProperty
property disjoint with: bottomObjectProperty
type: ObjectProperty
type: Property
comment: Indicates a homepage of the service provide for this online account.
domain: Online Account
range: Document

Data Item
disjoint with: Nothing
subclass of: Entity
subclass of: Thing
type: Class
comment: Immutable is a concept that represents entities which are immutable.

funded by
term status: archaic
type: Thing
sub property of: topObjectProperty
property disjoint with: bottomObjectProperty
type: ObjectProperty
type: Property
comment: An organization funding a project or person.
domain: Thing
range: Thing

radio
sub property of: topObjectProperty
property disjoint with: bottomObjectProperty
type: ObjectProperty
type: Property
comment: A checkable input in a group of radio roles, only one of which can be checked at a time.

Agent
type: Thing
date: 2008-01-14
Has Version: Agent-001
type: Agent Class
subclass of: Agent
description: Examples of Agent include person, organization, and software agent.
subclass of: Thing
issued: 2008-01-14
Relation: Agent-001
relation: Agent-001
type: Class
disjoint with: Nothing
equivalent class: Agent
comment: A resource that acts or has the power to act.

combobox
sub property of: topObjectProperty
property disjoint with: bottomObjectProperty
type: ObjectProperty
type: Property
comment: A presentation of a select; usually similar to a textbox where users can type ahead to select an option, or type to enter arbitrary text as a new item in the list. Also see listbox.

lastName
term status: testing
type: Thing
sub property of: topDataProperty
property disjoint with: bottomDataProperty
type: DatatypeProperty
type: Property
comment: The last name of a person.
domain: Person
range: Literal

member
term status: stable
sub property of: topObjectProperty
type: ObjectProperty
type: Thing
property disjoint with: runs
property disjoint with: bottomObjectProperty
property disjoint with: used by
property disjoint with: operated by
type: Property
comment: Indicates a member of a Group
domain: Group
range: Agent

personal mailbox
term status: stable
type: Thing
sub property of: topObjectProperty
property disjoint with: bottomObjectProperty
type: InverseFunctionalProperty
type: ObjectProperty
type: Property
comment: A personal mailbox, ie. an Internet mailbox associated with exactly one owner, the first owner of this mailbox. This is a 'static inverse functional property', in that there is (across time and change) at most one individual that ever has any particular value for foaf:mbox.
domain: Agent
range: Thing

Source
note: This term is intended to be used with non-literal values as defined in the DCMI Abstract Model (http://dublincore.org/documents/abstract-model/). As of December 2007, the DCMI Usage Board is seeking a way to express this intention with a formal range declaration.
relation: sourceT-001
description: The described resource may be derived from the related resource in whole or in part. Recommended best practice is to identify the related resource by means of a string conforming to a formal identification system.
property disjoint with: bottomObjectProperty
date: 2008-01-14
sub property of: source
sub property of: Relation
issued: 2008-01-14
sub property of: topObjectProperty
sub property of: relation
type: ObjectProperty
Relation: sourceT-001
Date Modified: 2008-01-14
type: Thing
Has Version: sourceT-001
comment: A related resource from which the described resource is derived.
type: Property

Physical Resource
date: 2008-01-14
relation: PhysicalResource-001
subclass of: Thing
type: Class
type: Thing
Has Version: PhysicalResource-001
issued: 2008-01-14
Relation: PhysicalResource-001
disjoint with: Nothing
comment: A material thing.

Relation
note: This term is intended to be used with non-literal values as defined in the DCMI Abstract Model (http://dublincore.org/documents/abstract-model/). As of December 2007, the DCMI Usage Board is seeking a way to express this intention with a formal range declaration.
description: Recommended best practice is to identify the related resource by means of a string conforming to a formal identification system.
relation: relationT-001
date: 2008-01-14
type: Thing
type: ObjectProperty
Has Version: relationT-001
sub property of: relation
property disjoint with: bottomObjectProperty
issued: 2008-01-14
Date Modified: 2008-01-14
sub property of: topObjectProperty
Relation: relationT-001
comment: A related resource.
type: Property

Non-Human Agent
disjoint with: Organization
subclass of: Agent
disjoint with: Human Agent
disjoint with: Group
disjoint with: Nothing
disjoint with: Data Publisher
subclass of: Thing
disjoint with: Person
type: Class
comment: NonHumanAgent is a general class that represents agents who are not social beings.

Is Part Of
issued: 2000-07-11
date: 2000-07-11
sub property of: relation
sub property of: topObjectProperty
sub property of: Relation
date: 2008-01-14
Date Modified: 2008-01-14
type: ObjectProperty
note: This term is intended to be used with non-literal values as defined in the DCMI Abstract Model (http://dublincore.org/documents/abstract-model/). As of December 2007, the DCMI Usage Board is seeking a way to express this intention with a formal range declaration.
type: Thing
Has Version: isPartOf-003
Relation: isPartOf-003
property disjoint with: bottomObjectProperty
relation: isPartOf-003
type: Property
comment: A related resource in which the described resource is physically or logically included.

weblog
sub property of: page
term status: testing
type: Thing
property disjoint with: bottomObjectProperty
type: InverseFunctionalProperty
type: ObjectProperty
sub property of: topObjectProperty
type: Property
range: Document
comment: A weblog of some thing (whether person, group, company etc.).
domain: Agent

Surname
term status: archaic
type: Thing
sub property of: topDataProperty
property disjoint with: bottomDataProperty
type: DatatypeProperty
type: Property
comment: The surname of some person.
domain: Person
range: Literal

document
sub property of: topObjectProperty
property disjoint with: bottomObjectProperty
type: ObjectProperty
type: Property
comment: A region containing related information that is declared as document content, as opposed to a web application.

menubar
sub property of: topObjectProperty
property disjoint with: bottomObjectProperty
type: ObjectProperty
type: Property
comment: A presentation of menu that usually remains visible and is usually presented horizontally.

Online Account
term status: testing
type: Thing
disjoint with: Nothing
subclass of: Thing
type: Class
comment: An online account.

Media Type
disjoint with: Nothing
subclass of: Media Type or Extent
type: Class
date: 2008-01-14
relation: MediaType-001
subclass of: Thing
type: Thing
Has Version: MediaType-001
Relation: MediaType-001
issued: 2008-01-14
comment: A file format or physical medium.

Agent Class
date: 2008-01-14
description: Examples of Agent Class include groups seen as classes, such as students, women, charities, lecturers.
relation: AgentClass-003
Relation: AgentClass-003
subclass of: Thing
disjoint with: Nothing
Has Version: AgentClass-003
issued: 2008-01-14
date: 2012-06-14
type: Class
Date Modified: 2012-06-14
type: Thing
subclass of: Class
comment: A group of agents.

Table Of Contents
Relation: tableOfContents-003
date: 2008-01-14
property disjoint with: bottomDataProperty
relation: tableOfContents-003
sub property of: description
date: 2000-07-11
sub property of: Description
Date Modified: 2008-01-14
type: Thing
type: DatatypeProperty
Has Version: tableOfContents-003
issued: 2000-07-11
sub property of: topDataProperty
type: Property
comment: A list of subunits of the resource.

RFC 5646
issued: 2010-10-11
description: RFC 5646 obsoletes RFC 4646.
Relation: RFC5646-001
date: 2010-10-11
type: Thing
Has Version: RFC5646-001
relation: RFC5646-001
type: Datatype
comment: The set of tags constructed according to RFC 5646 for the identification of languages.

slider
sub property of: topObjectProperty
property disjoint with: bottomObjectProperty
type: ObjectProperty
type: Property
comment: A user input where the user selects a value from within a given range.

Date Copyrighted
sub property of: topDataProperty
date: 2008-01-14
date: 2002-07-13
sub property of: Date
property disjoint with: bottomDataProperty
relation: dateCopyrighted-002
type: Thing
sub property of: date
issued: 2002-07-13
type: DatatypeProperty
Date Modified: 2008-01-14
Has Version: dateCopyrighted-002
Relation: dateCopyrighted-002
range: Literal
type: Property
comment: Date of copyright.

Coverage
type: Thing
relation: coverageT-001
type: ObjectProperty
date: 2008-01-14
Has Version: coverageT-001
Date Modified: 2008-01-14
Relation: coverageT-001
sub property of: coverage
property disjoint with: bottomObjectProperty
sub property of: topObjectProperty
description: Spatial topic and spatial applicability may be a named place or a location specified by its geographic coordinates. Temporal topic may be a named period, date, or date range. A jurisdiction may be a named administrative entity or a geographic place to which the resource applies. Recommended best practice is to use a controlled vocabulary such as the Thesaurus of Geographic Names [TGN]. Where appropriate, named places or time periods can be used in preference to numeric identifiers such as sets of coordinates or date ranges.
issued: 2008-01-14
comment: The spatial or temporal topic of the resource, the spatial applicability of the resource, or the jurisdiction under which the resource is relevant.
type: Property
range: Location, Period, or Jurisdiction

NLM
Has Version: NLM-002
issued: 2005-06-13
date: 2005-06-13
date: 2008-01-14
Relation: NLM-002
type: VocabularyEncodingScheme
Date Modified: 2008-01-14
type: Thing
relation: NLM-002
comment: The set of conceptual resources specified by the National Library of Medicine Classification.

Accrual Policy
relation: accrualPolicy-003
Has Version: accrualPolicy-003
type: ObjectProperty
date: 2005-06-13
issued: 2005-06-13
type: Thing
property disjoint with: bottomObjectProperty
sub property of: topObjectProperty
date: 2010-10-11
Relation: accrualPolicy-003
Date Modified: 2010-10-11
type: Property
comment: The policy governing the addition of items to a collection.
domain: Collection
range: Policy

Online Chat Account
term status: unstable
type: Thing
disjoint with: Nothing
subclass of: Thing
subclass of: Online Account
type: Class
comment: An online chat account.

DNA checksum
term status: archaic
type: Thing
sub property of: topDataProperty
property disjoint with: bottomDataProperty
type: DatatypeProperty
type: Property
comment: A checksum for the DNA of some thing. Joke.
range: Literal

membershipClass
term status: unstable
type: Thing
type: Property
type: AnnotationProperty
comment: Indicates the class of individuals that are a member of a Group

Artifact
disjoint with: Nothing
subclass of: Thing
type: Class
type: DeprecatedClass
comment: This class is deprecated and will be removed from the Provenance Vocabulary in the next revision. prv:Artifact was deprecated in the process of making the Provenance Vocabulary a specialization of W3C's PROV-O. Hence, use prov:Entity (or the more specific prv:Immutable) instead.

Creator
date: 2008-01-14
Date Modified: 2010-10-11
Has Version: creatorT-002
type: Thing
date: 2010-10-11
description: Examples of a Creator include a person, an organization, or a service.
issued: 2008-01-14
relation: creatorT-002
Relation: creatorT-002
comment: An entity primarily responsible for making the resource.
equivalent property: maker
sub property of: Contributor
sub property of: creator
type: Property
type: AnnotationProperty
range: Agent

knows
property disjoint with: operated by
property disjoint with: used by
type: ObjectProperty
property disjoint with: runs
property disjoint with: bottomObjectProperty
term status: stable
type: Thing
sub property of: topObjectProperty
property disjoint with: accessed
type: Property
comment: A person known by this person (indicating some level of reciprocated interaction between the parties).
domain: Person
range: Person

Data Access
disjoint with: Data Creation
disjoint with: Nothing
subclass of: Activity
subclass of: Thing
type: Class
comment: DataAccess is a concept that represents the completed execution of an activity by which an immutable data item has been retrieved from the Web.
subclass of: http://lodlaundromat.org/.well-known/genid/samples/pellet///predicate//fe8d8faed6702d7784e1ccba87e71ab5/d3e700bc1857a8001f8ca87e5b965b3a#2
subclass of: http://lodlaundromat.org/.well-known/genid/samples/pellet///predicate//fe8d8faed6702d7784e1ccba87e71ab5/d3e700bc1857a8001f8ca87e5b965b3a#3

Provenance
date: 2008-01-14
Has Version: provenance-002
Relation: provenance-002
issued: 2004-09-20
type: Thing
description: The statement may include a description of any changes successive custodians made to the resource.
sub property of: topObjectProperty
Date Modified: 2008-01-14
relation: provenance-002
type: ObjectProperty
date: 2004-09-20
property disjoint with: bottomObjectProperty
type: Property
comment: A statement of any changes in ownership and custody of the resource since its creation that are significant for its authenticity, integrity, and interpretation.
range: Provenance Statement

plan
term status: testing
type: Thing
sub property of: topDataProperty
property disjoint with: bottomDataProperty
type: DatatypeProperty
type: Property
comment: Aplan comment, in the tradition of finger and '.plan' files.
domain: Person
range: Literal

sha1sum (hex)
term status: unstable
type: Thing
sub property of: topDataProperty
property disjoint with: bottomDataProperty
type: DatatypeProperty
type: Property
comment: A sha1sum hash, in hex.
domain: Document

Given name
term status: archaic
type: Thing
sub property of: topDataProperty
property disjoint with: bottomDataProperty
type: DatatypeProperty
type: Property
comment: The given name of some person.

contents
term: contents
type: Thing
sub property of: topObjectProperty
property disjoint with: bottomObjectProperty
type: ObjectProperty
type: Property
member: relrev-properties
comment: contents refers to a resource serving as a table of contents.

page
term status: testing
type: Thing
sub property of: topObjectProperty
property disjoint with: bottomObjectProperty
inverse of: topic
type: ObjectProperty
type: Property
comment: A page or document about this thing.
domain: Thing
range: Document

LCC
Date Modified: 2008-01-14
issued: 2000-07-11
date: 2000-07-11
type: Thing
relation: LCC-003
date: 2008-01-14
Relation: LCC-003
Has Version: LCC-003
type: VocabularyEncodingScheme
comment: The set of conceptual resources specified by the Library of Congress Classification.

up
term: up
type: Thing
sub property of: topObjectProperty
property disjoint with: bottomObjectProperty
type: ObjectProperty
type: Property
member: relrev-properties
comment: up refers to a resource "above" in a hierarchically structured set.

Human Agent
disjoint with: Nothing
disjoint with: Data Providing Service
disjoint with: Non-Human Agent
subclass of: Agent
disjoint with: Server
disjoint with: WebServer
disjoint with: Service
type: Class
subclass of: Thing
comment: HumanAgent is a general class that represents agents who are social beings such as persons, organizations, companies.

role
type: Thing
type: ObjectProperty
property disjoint with: bottomObjectProperty
term: role
sub property of: topObjectProperty
type: Property
member: relrev-properties
comment: role indicates the purpose of the resource. See the XHTML Role Vocabulary for roles in this vocabulary space, and XHTMLROLE for information on extending the collection of roles.

Title
date: 2008-01-14
date: 2010-10-11
sub property of: topDataProperty
Date Modified: 2010-10-11
sub property of: title
type: DatatypeProperty
issued: 2008-01-14
property disjoint with: bottomDataProperty
Has Version: titleT-002
Relation: titleT-002
type: Thing
relation: titleT-002
type: Property
comment: A name given to the resource.
range: Literal

IMT
issued: 2000-07-11
Relation: IMT-004
date: 2000-07-11
date: 2008-01-14
Date Modified: 2008-01-14
type: VocabularyEncodingScheme
Has Version: IMT-004
type: Thing
relation: IMT-004
comment: The set of media types specified by the Internet Assigned Numbers Authority.

Location, Period, or Jurisdiction
date: 2008-01-14
disjoint with: Nothing
type: Thing
issued: 2008-01-14
Has Version: LocationPeriodOrJurisdiction-001
Relation: LocationPeriodOrJurisdiction-001
relation: LocationPeriodOrJurisdiction-001
subclass of: Thing
type: Class
comment: A location, period of time, or jurisdiction.

marquee
sub property of: topObjectProperty
property disjoint with: bottomObjectProperty
type: ObjectProperty
type: Property
comment: A type of live region where non-essential information changes frequently. Also see log.

Medium
Relation: medium-003
relation: medium-003
date: 2000-07-11
issued: 2000-07-11
type: ObjectProperty
property disjoint with: bottomObjectProperty
sub property of: topObjectProperty
Has Version: medium-003
date: 2008-01-14
sub property of: Format
type: Thing
Date Modified: 2008-01-14
sub property of: format
range: Physical Medium
comment: The material or physical carrier of the resource.
domain: Physical Resource
type: Property

Olaf Hartig
type: Person
type: Human Agent
type: SpatialThing
type: Agent
type: Thing

glossary
term: glossary
type: Thing
sub property of: topObjectProperty
property disjoint with: bottomObjectProperty
type: ObjectProperty
type: Property
member: relrev-properties
comment: glossary refers to a resource providing a glossary of terms.

ICQ chat ID
sub property of: nickname
term status: testing
type: Thing
property disjoint with: bottomDataProperty
sub property of: topDataProperty
type: InverseFunctionalProperty
type: DatatypeProperty
domain: Agent
range: Literal
comment: An ICQ chat ID
type: Property

Date Available
Relation: available-003
date: 2008-01-14
type: Thing
property disjoint with: bottomDataProperty
date: 2000-07-11
issued: 2000-07-11
Has Version: available-003
sub property of: date
Date Modified: 2008-01-14
relation: available-003
type: DatatypeProperty
sub property of: topDataProperty
sub property of: Date
comment: Date (often a range) that the resource became or will become available.
type: Property
range: Literal

list
sub property of: topObjectProperty
property disjoint with: bottomObjectProperty
type: ObjectProperty
type: Property
comment: A group of non-interactive list items. Also see listbox.

note
sub property of: topObjectProperty
property disjoint with: bottomObjectProperty
type: ObjectProperty
type: Property
member: role-properties
comment: indicates the content is parenthetic or ancillary to the main content of the resource.

account
term status: testing
type: Thing
sub property of: topObjectProperty
property disjoint with: bottomObjectProperty
type: ObjectProperty
type: Property
comment: Indicates an account held by this agent.
domain: Agent
range: Online Account

Has Format
sub property of: topObjectProperty
relation: hasFormat-003
type: ObjectProperty
issued: 2000-07-11
Relation: hasFormat-003
date: 2000-07-11
date: 2008-01-14
Date Modified: 2008-01-14
type: Thing
property disjoint with: bottomObjectProperty
Has Version: hasFormat-003
sub property of: Relation
note: This term is intended to be used with non-literal values as defined in the DCMI Abstract Model (http://dublincore.org/documents/abstract-model/). As of December 2007, the DCMI Usage Board is seeking a way to express this intention with a formal range declaration.
sub property of: relation
type: Property
comment: A related resource that is substantially the same as the pre-existing described resource, but in another format.

homepage
sub property of: topObjectProperty
term status: stable
sub property of: page
sub property of: is primary topic of
type: Thing
property disjoint with: bottomObjectProperty
type: ObjectProperty
type: InverseFunctionalProperty
comment: A homepage for some thing.
range: Document
type: Property
domain: Thing

Label Property
term status: unstable
type: Thing
disjoint with: Nothing
subclass of: Thing
type: Class
comment: A foaf:LabelProperty is any RDF property with texual values that serve as labels.

Linguistic System
type: Class
description: Examples include written, spoken, sign, and computer languages.
relation: LinguisticSystem-001
Relation: LinguisticSystem-001
Has Version: LinguisticSystem-001
issued: 2008-01-14
subclass of: Thing
disjoint with: Nothing
type: Thing
date: 2008-01-14
comment: A system of signs, symbols, sounds, gestures, or rules used in communication.

DDC
issued: 2000-07-11
date: 2000-07-11
relation: DDC-003
type: Thing
Has Version: DDC-003
Relation: DDC-003
date: 2008-01-14
Date Modified: 2008-01-14
type: VocabularyEncodingScheme
comment: The set of conceptual resources specified by the Dewey Decimal Classification.

PersonalProfileDocument
term status: testing
disjoint with: Nothing
disjoint with: Project
type: Thing
subclass of: Thing
type: Class
subclass of: Document
disjoint with: Organization
comment: A personal profile RDF document.

Data Providing Service
disjoint with: Organization
disjoint with: Data Publisher
disjoint with: Group
disjoint with: Nothing
disjoint with: Human Agent
subclass of: Non-Human Agent
disjoint with: Person
subclass of: Agent
subclass of: Thing
type: Class
comment: DataProvidingService is a concept that represents a non-human agent - usually a Web service or a server - that processes data access requests and actually sends the requested Web representations over the Web.

link
sub property of: topObjectProperty
property disjoint with: bottomObjectProperty
type: ObjectProperty
type: Property
comment: An interactive reference to an internal or external resource that, when activated, causes the user agent to navigate to that resource. Also see button.

copyright
term: copyright
type: Thing
sub property of: topObjectProperty
property disjoint with: bottomObjectProperty
type: ObjectProperty
type: Property
member: relrev-properties
comment: copyright refers to a copyright statement for the resource.

used
sub property of: topObjectProperty
property disjoint with: bottomObjectProperty
type: ObjectProperty
comment: This property is deprecated and will be removed from the Provenance Vocabulary in the next revision. prv:employedArtifact was deprecated in the process of making the Provenance Vocabulary a specialization of W3C's PROV-O. Hence, use prov:used instead.
type: DeprecatedProperty

theme
term status: archaic
type: Thing
sub property of: topObjectProperty
property disjoint with: bottomObjectProperty
type: ObjectProperty
type: Property
comment: A theme.
domain: Thing
range: Thing

File Format
type: Thing
type: Class
date: 2008-01-14
relation: FileFormat-001
description: Examples include the formats defined by the list of Internet Media Types.
subclass of: Media Type
Has Version: FileFormat-001
issued: 2008-01-14
disjoint with: Nothing
subclass of: Media Type or Extent
subclass of: Thing
Relation: FileFormat-001
comment: A digital resource format.

contentinfo
sub property of: topObjectProperty
property disjoint with: bottomObjectProperty
type: ObjectProperty
type: Property
member: role-properties
comment: contains meta information about the content on the page or the page as a whole.

Actor
disjoint with: Nothing
subclass of: Thing
type: Class
type: DeprecatedClass
comment: This class is deprecated and will be removed from the Provenance Vocabulary in the next revision. prv:Actor was deprecated in the process of making the Provenance Vocabulary a specialization of W3C's PROV-O. Hence, use one of the more specific classes prv:HumanAgent and prv:NonHumanAgent instead; or, if such a specialization is unsuitable for the use case at hand, directly use the general class prov:Agent as defined by PROV-O.

File
subclass of: http://lodlaundromat.org/.well-known/genid/samples/pellet///predicate//fe8d8faed6702d7784e1ccba87e71ab5/d3e700bc1857a8001f8ca87e5b965b3a#4
subclass of: Entity
subclass of: http://lodlaundromat.org/.well-known/genid/samples/pellet///predicate//fe8d8faed6702d7784e1ccba87e71ab5/d3e700bc1857a8001f8ca87e5b965b3a#7
type: Class
disjoint with: Data Item
disjoint with: Creation Guideline
disjoint with: Nothing
subclass of: Thing
comment: File is a general class that represents computer files/documents of any kind.

topic
term status: testing
type: Thing
sub property of: topObjectProperty
property disjoint with: bottomObjectProperty
inverse of: page
type: ObjectProperty
type: Property
comment: A topic of some page or document.
domain: Document
range: Thing

RFC 4646
relation: RFC4646-001
date: 2008-01-14
description: RFC 4646 obsoletes RFC 3066.
issued: 2008-01-14
Has Version: RFC4646-001
type: Thing
Relation: RFC4646-001
type: Datatype
comment: The set of tags constructed according to RFC 4646 for the identification of languages.

Data Item
subclass of: Entity
subclass of: http://lodlaundromat.org/.well-known/genid/samples/pellet///predicate//fe8d8faed6702d7784e1ccba87e71ab5/d3e700bc1857a8001f8ca87e5b965b3a#7
subclass of: Thing
subclass of: http://lodlaundromat.org/.well-known/genid/samples/pellet///predicate//fe8d8faed6702d7784e1ccba87e71ab5/d3e700bc1857a8001f8ca87e5b965b3a#4
disjoint with: File
subclass of: InformationRealization
disjoint with: Nothing
type: Class
comment: DataItem is a general concept that represents data items of any kind.

Frequency
subclass of: Thing
disjoint with: Nothing
type: Class
Relation: Frequency-001
relation: Frequency-001
type: Thing
date: 2008-01-14
Has Version: Frequency-001
issued: 2008-01-14
comment: A rate at which something recurs.

maker
term status: stable
type: Thing
sub property of: topObjectProperty
property disjoint with: bottomObjectProperty
inverse of: made
type: ObjectProperty
equivalent property: Creator
comment: An agent that made this thing.
domain: Thing
type: Property
range: Agent

Bibliographic Citation
date: 2003-02-15
date: 2008-01-14
Has Version: bibliographicCitation-002
description: Recommended practice is to include sufficient bibliographic detail to identify the resource as unambiguously as possible.
sub property of: topDataProperty
sub property of: identifier
property disjoint with: bottomDataProperty
type: Thing
Relation: bibliographicCitation-002
issued: 2003-02-15
Date Modified: 2008-01-14
type: DatatypeProperty
sub property of: Identifier
relation: bibliographicCitation-002
range: Literal
domain: Bibliographic Resource
comment: A bibliographic reference for the resource.
type: Property

Replaces
Has Version: replaces-003
date: 2000-07-11
note: This term is intended to be used with non-literal values as defined in the DCMI Abstract Model (http://dublincore.org/documents/abstract-model/). As of December 2007, the DCMI Usage Board is seeking a way to express this intention with a formal range declaration.
type: ObjectProperty
Date Modified: 2008-01-14
date: 2008-01-14
property disjoint with: bottomObjectProperty
sub property of: relation
sub property of: Relation
type: Thing
sub property of: topObjectProperty
Relation: replaces-003
relation: replaces-003
issued: 2000-07-11
comment: A related resource that is supplanted, displaced, or superseded by the described resource.
type: Property

DCMI Box
date: 2008-01-14
Date Modified: 2008-01-14
Has Version: Box-003
issued: 2000-07-11
relation: Box-003
date: 2000-07-11
Relation: Box-003
type: Thing
type: Datatype
comment: The set of regions in space defined by their geographic coordinates according to the DCMI Box Encoding Scheme.

icon
term: icon
type: Thing
sub property of: topObjectProperty
property disjoint with: bottomObjectProperty
type: ObjectProperty
type: Property
member: relrev-properties
comment: icon refers to a resource that represents an icon.

runs
property disjoint with: schoolHomepage
property disjoint with: current project
sub property of: topObjectProperty
property disjoint with: past project
property disjoint with: workplace homepage
property disjoint with: member
property disjoint with: image
property disjoint with: bottomObjectProperty
property disjoint with: knows
type: ObjectProperty
property disjoint with: work info homepage
property disjoint with: publications
comment: This property refers to the software that was run by a non-human actor (usually a service).
domain: Non-Human Agent

DCMI Metadata Terms - other
date: 2012-06-14
Date Modified: 2012-06-14
publisher: DCMI
type: Thing

openid
type: ObjectProperty
term status: testing
sub property of: page
property disjoint with: bottomObjectProperty
type: InverseFunctionalProperty
sub property of: is primary topic of
sub property of: topObjectProperty
type: Thing
range: Document
type: Property
domain: Agent
comment: An OpenID for an Agent.

Temporal Coverage
sub property of: Coverage
date: 2008-01-14
Has Version: temporal-003
date: 2000-07-11
property disjoint with: bottomObjectProperty
issued: 2000-07-11
Date Modified: 2008-01-14
sub property of: topObjectProperty
relation: temporal-003
type: Thing
sub property of: coverage
Relation: temporal-003
type: ObjectProperty
type: Property
range: Period of Time
comment: Temporal characteristics of the resource.

ISO 639-2
Has Version: ISO639-2-003
Date Modified: 2008-01-14
date: 2008-01-14
type: Thing
date: 2000-07-11
relation: ISO639-2-003
issued: 2000-07-11
Relation: ISO639-2-003
type: Datatype
comment: The three-letter alphabetic codes listed in ISO639-2 for the representation of names of languages.

rowheader
sub property of: topObjectProperty
property disjoint with: bottomObjectProperty
type: ObjectProperty
type: Property
comment: A cell containing header information for a row in a grid.

yielded by
sub property of: topObjectProperty
property disjoint with: bottomObjectProperty
type: ObjectProperty
comment: This property is deprecated and will be removed from the Provenance Vocabulary in the next revision. prv:yieldedBy was deprecated in the process of making the Provenance Vocabulary a specialization of W3C's PROV-O. Hence, use prov:wasGeneratedBy instead.
type: DeprecatedProperty

button
sub property of: topObjectProperty
property disjoint with: bottomObjectProperty
type: ObjectProperty
type: Property
comment: An input that allows for user-triggered actions when clicked or pressed. Also see link.

Date Valid
relation: valid-003
sub property of: topDataProperty
date: 2000-07-11
Relation: valid-003
issued: 2000-07-11
type: DatatypeProperty
sub property of: date
Date Modified: 2008-01-14
sub property of: Date
date: 2008-01-14
property disjoint with: bottomDataProperty
Has Version: valid-003
type: Thing
type: Property
range: Literal
comment: Date (often a range) of validity of a resource.

RFC 3066
type: Thing
date: 2002-07-13
relation: RFC3066-002
description: RFC 3066 has been obsoleted by RFC 4646.
Has Version: RFC3066-002
Relation: RFC3066-002
Date Modified: 2008-01-14
date: 2008-01-14
issued: 2002-07-13
type: Datatype
comment: The set of tags constructed according to RFC 3066 for the identification of languages.

bookmark
term: bookmark
type: Thing
sub property of: topObjectProperty
property disjoint with: bottomObjectProperty
type: ObjectProperty
type: Property
member: relrev-properties
comment: bookmark refers to a bookmark - a link to a key entry point within an extended document.

executed at
sub property of: topDataProperty
property disjoint with: bottomDataProperty
type: DatatypeProperty
type: DeprecatedProperty
comment: This property has been renamed to prv:completedAt. Hence, prv:performedAt is deprecated and will be removed from the Provenance Vocabulary in the next revision.

birthday
term status: unstable
type: Thing
sub property of: topDataProperty
property disjoint with: bottomDataProperty
type: FunctionalProperty
type: DatatypeProperty
type: Property
comment: The birthday of this Agent, represented in mm-dd string form, eg. '12-31'.
domain: Agent
range: Literal

retrieved by
sub property of: topObjectProperty
sub property of: wasGeneratedBy
property disjoint with: bottomObjectProperty
property disjoint with: created by
type: FunctionalProperty
type: ObjectProperty
comment: This property refers to the data access by which an immutable entity has been retrieved from the Web. Each entity that has this property is a Web representation.
domain: Data Item
domain: http://lodlaundromat.org/.well-known/genid/samples/pellet///predicate//fe8d8faed6702d7784e1ccba87e71ab5/d3e700bc1857a8001f8ca87e5b965b3a#4
range: Data Access

timer
sub property of: topObjectProperty
property disjoint with: bottomObjectProperty
type: ObjectProperty
type: Property
comment: A type of live region containing a numerical counter which indicates an amount of elapsed time from a start point, or the time remaining until an end point.

Jun Zhao
type: SpatialThing
type: Agent
type: Human Agent
type: Thing
type: Person

Extent
sub property of: topObjectProperty
relation: extent-003
issued: 2000-07-11
date: 2000-07-11
Has Version: extent-003
Date Modified: 2008-01-14
date: 2008-01-14
type: ObjectProperty
Relation: extent-003
type: Thing
sub property of: format
property disjoint with: bottomObjectProperty
sub property of: Format
type: Property
comment: The size or duration of the resource.
range: Size or Duration

Media Type or Extent
Has Version: MediaTypeOrExtent-001
issued: 2008-01-14
Relation: MediaTypeOrExtent-001
subclass of: Thing
date: 2008-01-14
relation: MediaTypeOrExtent-001
type: Thing
type: Class
disjoint with: Nothing
comment: A media type or extent.

URI
Has Version: URI-003
date: 2000-07-11
date: 2008-01-14
type: Thing
Date Modified: 2008-01-14
relation: URI-003
Relation: URI-003
issued: 2000-07-11
type: Datatype
comment: The set of identifiers constructed according to the generic syntax for Uniform Resource Identifiers as specified by the Internet Engineering Task Force.

Date
type: DatatypeProperty
issued: 2008-01-14
description: Date may be used to express temporal information at any level of granularity. Recommended best practice is to use an encoding scheme, such as the W3CDTF profile of ISO 8601 [W3CDTF].
Relation: dateT-001
sub property of: topDataProperty
Has Version: dateT-001
Date Modified: 2008-01-14
date: 2008-01-14
property disjoint with: bottomDataProperty
type: Thing
sub property of: date
relation: dateT-001
comment: A point or period of time associated with an event in the lifecycle of the resource.
type: Property
range: Literal

Physical Medium
relation: PhysicalMedium-001
type: Class
date: 2008-01-14
description: Examples include paper, canvas, or DVD.
subclass of: Media Type or Extent
subclass of: Media Type
issued: 2008-01-14
subclass of: Thing
type: Thing
disjoint with: Nothing
Relation: PhysicalMedium-001
Has Version: PhysicalMedium-001
comment: A physical material or carrier.

W3C-DTF
relation: W3CDTF-003
Date Modified: 2008-01-14
date: 2008-01-14
Relation: W3CDTF-003
date: 2000-07-11
issued: 2000-07-11
type: Thing
Has Version: W3CDTF-003
type: Datatype
comment: The set of dates and times constructed according to the W3C Date and Time Formats Specification.

p3pv1
term: p3pv1
type: Thing
sub property of: topObjectProperty
property disjoint with: bottomObjectProperty
type: ObjectProperty
type: Property
member: relrev-properties
comment: p3pv1 refers to a P3P Policy Reference File [P3P].

toolbar
sub property of: topObjectProperty
property disjoint with: bottomObjectProperty
type: ObjectProperty
type: Property
comment: A collection of commonly used function buttons represented in compact visual form.

Access Rights
date: 2003-02-15
type: ObjectProperty
relation: accessRights-002
sub property of: topObjectProperty
issued: 2003-02-15
type: Thing
Relation: accessRights-002
description: Access Rights may include information regarding access or restrictions based on privacy, security, or other policies.
date: 2008-01-14
sub property of: rights
sub property of: Rights
Date Modified: 2008-01-14
Has Version: accessRights-002
property disjoint with: bottomObjectProperty
range: Rights Statement
type: Property
comment: Information about who can access the resource or an indication of its security status.

Online E-commerce Account
term status: unstable
type: Thing
disjoint with: Nothing
subclass of: Thing
subclass of: Online Account
type: Class
comment: An online e-commerce account.

Friend of a Friend (FOAF) vocabulary
description: The Friend of a Friend (FOAF) RDF vocabulary, described using W3C RDF Schema and the Web Ontology Language.
type: Thing
type: Ontology

Provenance Statement
type: Thing
issued: 2008-01-14
Has Version: ProvenanceStatement-001
Relation: ProvenanceStatement-001
type: Class
subclass of: Thing
disjoint with: Nothing
date: 2008-01-14
relation: ProvenanceStatement-001
comment: A statement of any changes in ownership and custody of a resource since its creation that are significant for its authenticity, integrity, and interpretation.

rowgroup
sub property of: topObjectProperty
property disjoint with: bottomObjectProperty
type: ObjectProperty
type: Property
comment: A group containing one or more row elements in a grid.

banner
sub property of: topObjectProperty
property disjoint with: bottomObjectProperty
type: ObjectProperty
type: Property
member: role-properties
comment: contains the prime heading or internal title of a page.

TGN
date: 2000-07-11
Has Version: TGN-003
relation: TGN-003
Date Modified: 2008-01-14
date: 2008-01-14
type: Thing
Relation: TGN-003
type: VocabularyEncodingScheme
issued: 2000-07-11
comment: The set of places specified by the Getty Thesaurus of Geographic Names.

alert
sub property of: topObjectProperty
property disjoint with: bottomObjectProperty
type: ObjectProperty
type: Property
comment: A message with important, and usually time-sensitive, information. Also see alertdialog and status.

Jurisdiction
Relation: Jurisdiction-001
date: 2008-01-14
subclass of: Location, Period, or Jurisdiction
issued: 2008-01-14
Has Version: Jurisdiction-001
subclass of: Thing
type: Class
relation: Jurisdiction-001
type: Thing
disjoint with: Nothing
comment: The extent or range of judicial, law enforcement, or other authority.

Data Publisher
disjoint with: Non-Human Agent
disjoint with: WebServer
subclass of: Agent
disjoint with: Service
disjoint with: Server
subclass of: Thing
disjoint with: Data Providing Service
type: Class
subclass of: Human Agent
disjoint with: Nothing
comment: DataPublisher is a concept that represents entities such as persons, groups, or organizations who use a data providing service (see concept prv:DataProvidingService) to publish data on the Web.

progressbar
sub property of: topObjectProperty
property disjoint with: bottomObjectProperty
type: ObjectProperty
type: Property
comment: An element that displays the progress status for tasks that take a long time.

Group
type: Thing
subclass of: Agent
disjoint with: Server
disjoint with: Non-Human Agent
disjoint with: WebServer
disjoint with: Nothing
type: Class
subclass of: Thing
disjoint with: Service
disjoint with: Data Providing Service
subclass of: Human Agent
term status: stable
comment: A class of Agents.

DCMI Type Vocabulary
Date Modified: 2012-06-14
Has Version: DCMIType-005
type: Thing
date: 2012-06-14
date: 2000-07-11
relation: DCMIType-005
type: VocabularyEncodingScheme
Relation: DCMIType-005
issued: 2000-07-11
comment: The set of classes specified by the DCMI Type Vocabulary, used to categorize the nature or genre of the resource.

workplace homepage
type: Thing
property disjoint with: runs
property disjoint with: bottomObjectProperty
property disjoint with: used by
term status: testing
sub property of: topObjectProperty
type: ObjectProperty
property disjoint with: operated by
type: Property
comment: A workplace homepage of some person; the homepage of an organization they work for.
domain: Person
range: Document

Language
sub property of: topObjectProperty
description: Recommended best practice is to use a controlled vocabulary such as RFC 4646 [RFC4646].
Date Modified: 2008-01-14
Relation: languageT-001
Has Version: languageT-001
relation: languageT-001
date: 2008-01-14
type: ObjectProperty
sub property of: language
type: Thing
issued: 2008-01-14
property disjoint with: bottomObjectProperty
type: Property
comment: A language of the resource.
range: Linguistic System

account
term status: archaic
type: Thing
sub property of: topObjectProperty
property disjoint with: bottomObjectProperty
type: ObjectProperty
type: Property
comment: Indicates an account held by this agent.
domain: Agent
range: Online Account

involved
sub property of: topObjectProperty
property disjoint with: bottomObjectProperty
type: ObjectProperty
comment: This property is deprecated and will be removed from the Provenance Vocabulary in the next revision. prv:involvedActor was deprecated in the process of making the Provenance Vocabulary a specialization of W3C's PROV-O. Hence, use prov:wasAssociatedWith instead.
type: DeprecatedProperty

listbox
sub property of: topObjectProperty
property disjoint with: bottomObjectProperty
type: ObjectProperty
type: Property
comment: A widget that allows the user to select one or more items from a list of choices. Also see combobox and list.

Image
type: Class
disjoint with: Organization
subclass of: Thing
type: Thing
disjoint with: Project
subclass of: Document
disjoint with: Nothing
term status: testing
comment: An image.

spinbutton
sub property of: topObjectProperty
property disjoint with: bottomObjectProperty
type: ObjectProperty
type: Property
comment: A form of range that expects a user to select from amongst discrete choices.

Person
disjoint with: Server
term status: stable
subclass of: SpatialThing
disjoint with: Nothing
subclass of: Agent
disjoint with: WebServer
subclass of: Human Agent
disjoint with: Project
subclass of: Person
disjoint with: Data Providing Service
subclass of: Thing
disjoint with: Non-Human Agent
disjoint with: Service
type: Class
type: Thing
disjoint with: Organization
comment: A person.

grid
sub property of: topObjectProperty
property disjoint with: bottomObjectProperty
type: ObjectProperty
type: Property
comment: A grid is an interactive control which contains cells of tabular data arranged in rows and columns, like a table.

itsRules
term: itsRules
type: Thing
sub property of: topObjectProperty
property disjoint with: bottomObjectProperty
type: ObjectProperty
type: Property
member: relrev-properties
comment: itsRules indicates that the designated resource is an [ITS] rule set.

heading
sub property of: topObjectProperty
property disjoint with: bottomObjectProperty
type: ObjectProperty
type: Property
comment: A heading for a section of the page.

img
sub property of: topObjectProperty
property disjoint with: bottomObjectProperty
type: ObjectProperty
type: Property
comment: A container for a collection of elements that form an image.

phone
term status: testing
type: Thing
sub property of: topObjectProperty
property disjoint with: bottomObjectProperty
type: ObjectProperty
type: Property
comment: A phone, specified using fully qualified tel: URI scheme (refs: http://www.w3.org/Addressing/schemes.html#tel).

Given name
term status: testing
type: Thing
sub property of: topDataProperty
property disjoint with: bottomDataProperty
type: DatatypeProperty
type: Property
comment: The given name of some person.

directory
sub property of: topObjectProperty
property disjoint with: bottomObjectProperty
type: ObjectProperty
type: Property
comment: A list of references to members of a group, such as a static table of contents.

Is Required By
date: 2000-07-11
date: 2008-01-14
property disjoint with: bottomObjectProperty
relation: isRequiredBy-003
Relation: isRequiredBy-003
Date Modified: 2008-01-14
sub property of: relation
note: This term is intended to be used with non-literal values as defined in the DCMI Abstract Model (http://dublincore.org/documents/abstract-model/). As of December 2007, the DCMI Usage Board is seeking a way to express this intention with a formal range declaration.
Has Version: isRequiredBy-003
sub property of: topObjectProperty
type: ObjectProperty
issued: 2000-07-11
sub property of: Relation
type: Thing
comment: A related resource that requires the described resource to support its function, delivery, or coherence.
type: Property

depicts
term status: testing
type: Thing
sub property of: topObjectProperty
property disjoint with: bottomObjectProperty
inverse of: depiction
type: ObjectProperty
type: Property
comment: A thing depicted in this representation.
domain: Image
range: Thing

ISO 639-3
date: 2008-01-14
relation: ISO639-3-001
Has Version: ISO639-3-001
Relation: ISO639-3-001
issued: 2008-01-14
type: Thing
type: Datatype
comment: The set of three-letter codes listed in ISO 639-3 for the representation of names of languages.

dialog
sub property of: topObjectProperty
property disjoint with: bottomObjectProperty
type: ObjectProperty
type: Property
comment: A dialog is an application window that is designed to interrupt the current processing of an application in order to prompt the user to enter information or require a response. Also see alertdialog.

gridcell
sub property of: topObjectProperty
property disjoint with: bottomObjectProperty
type: ObjectProperty
type: Property
comment: A cell in a grid or treegrid.

name
term status: testing
type: Thing
sub property of: topDataProperty
property disjoint with: bottomDataProperty
type: DatatypeProperty
type: Property
comment: A name for some thing.
domain: Thing
range: Literal
sub property of: label

listitem
sub property of: topObjectProperty
property disjoint with: bottomObjectProperty
type: ObjectProperty
type: Property
comment: A single item in a list or directory.

Data Creation
disjoint with: Data Access
disjoint with: Nothing
subclass of: Activity
subclass of: Thing
type: Class
comment: DataCreation is a concept that represents the execution of an activity by which data items have been created.

cite
term: cite
type: Thing
sub property of: topObjectProperty
property disjoint with: bottomObjectProperty
type: ObjectProperty
type: Property
member: relrev-properties
comment: cite refers to a resource that defines a citation.

contained in
sub property of: topObjectProperty
property disjoint with: serialized by
property disjoint with: bottomObjectProperty
type: ObjectProperty
comment: This property refers to a data item that contained a data item. Hence, this property refers to another data item of a larger granularity (e.g. an RDF triple is usually contained in an RDF graph).
domain: Data Item
range: Data Item

used
sub property of: topObjectProperty
sub property of: used
property disjoint with: accessed
property disjoint with: serialized by
property disjoint with: bottomObjectProperty
type: ObjectProperty
comment: This property refers to a source data item that has been used during the creation of a data item. Examples for source data are the content of a document used for machine learning, the statements in a knowledge base used to entail a new statement, and the entries in a database used to answer a query. Notice, all source data has provenance; we strongly encourage to describe this provenance as well, at least as far as available information permits.
domain: Data Creation
range: Data Item

Provenance Vocabulary Core Ontology Specification
description: This documents specifies the Provenance Vocabulary Core Ontology which defines the main classes and properties provided by the Provenance Vocabulary.
license: http://creativecommons.org/licenses/by/1.0/
type: Thing
alternate: ns.rdf
topic: Provenance Vocabulary Core Ontology namespace
primary topic: Provenance Vocabulary Core Ontology namespace
Relation: rdfa-syntax
Conforms To: rdfa-syntax
assurance: Detached signature
relation: rdfa-syntax
type: Document
label: Document that defines the core ontology of the Provenance Vocabulary

log
sub property of: topObjectProperty
property disjoint with: bottomObjectProperty
type: ObjectProperty
type: Property
comment: A type of live region where new information is added in meaningful order and old information may disappear. Also see marquee.

alternate
term: alternate
type: Thing
sub property of: topObjectProperty
property disjoint with: bottomObjectProperty
type: ObjectProperty
type: Property
member: relrev-properties
comment: alternate designates alternate versions for a resource.

http://lodlaundromat.org/.well-known/genid/samples/pellet///predicate//fe8d8faed6702d7784e1ccba87e71ab5/9445b29090531f162805053b8f46ccee#1
was associated with: Tomi Kauppinen
performed by: Tomi Kauppinen
executed at: 2012-01-29T20:30:00Z
type: Data Creation
type: Activity
type: Thing

option
sub property of: topObjectProperty
property disjoint with: bottomObjectProperty
type: ObjectProperty
type: Property
comment: A selectable item in a select list.

form
sub property of: topObjectProperty
property disjoint with: bottomObjectProperty
type: ObjectProperty
type: Property
comment: A landmark region that contains a collection of items and objects that, as a whole, combine to create a form. Also see search.

license
term: license
type: Thing
sub property of: topObjectProperty
property disjoint with: bottomObjectProperty
type: ObjectProperty
type: Property
member: relrev-properties
comment: license refers to a resource that defines the associated license.

presentation
sub property of: topObjectProperty
property disjoint with: bottomObjectProperty
type: ObjectProperty
type: Property
comment: An element whose implicit native role semantics will not be mapped to the accessibility API.

nickname
term status: testing
type: Thing
sub property of: topDataProperty
property disjoint with: bottomDataProperty
type: DatatypeProperty
type: Property
comment: A short informal nickname characterising an agent (includes login identifiers, IRC and other chat nicknames).

Is Version Of
note: This term is intended to be used with non-literal values as defined in the DCMI Abstract Model (http://dublincore.org/documents/abstract-model/). As of December 2007, the DCMI Usage Board is seeking a way to express this intention with a formal range declaration.
date: 2008-01-14
type: ObjectProperty
Has Version: isVersionOf-003
sub property of: Relation
sub property of: relation
date: 2000-07-11
sub property of: topObjectProperty
type: Thing
description: Changes in version imply substantive changes in content rather than differences in format.
issued: 2000-07-11
relation: isVersionOf-003
Relation: isVersionOf-003
property disjoint with: bottomObjectProperty
Date Modified: 2008-01-14
type: Property
comment: A related resource of which the described resource is a version, edition, or adaptation.

Conforms To
date: 2001-05-21
issued: 2001-05-21
type: ObjectProperty
Date Modified: 2008-01-14
property disjoint with: bottomObjectProperty
date: 2008-01-14
sub property of: relation
Has Version: conformsTo-003
relation: conformsTo-003
sub property of: topObjectProperty
sub property of: Relation
type: Thing
Relation: conformsTo-003
range: Standard
comment: An established standard to which the described resource conforms.
type: Property

Date Issued
date: 2008-01-14
relation: issued-003
sub property of: Date
sub property of: topDataProperty
type: DatatypeProperty
property disjoint with: bottomDataProperty
type: Thing
Relation: issued-003
Has Version: issued-003
date: 2000-07-11
Date Modified: 2008-01-14
sub property of: date
issued: 2000-07-11
range: Literal
comment: Date of formal issuance (e.g., publication) of the resource.
type: Property

menuitemcheckbox
sub property of: topObjectProperty
property disjoint with: bottomObjectProperty
type: ObjectProperty
type: Property
comment: A checkable menuitem that has three possible values: true, false, or mixed.

Yahoo chat ID
term status: testing
type: DatatypeProperty
type: Thing
sub property of: topDataProperty
property disjoint with: bottomDataProperty
sub property of: nickname
type: InverseFunctionalProperty
domain: Agent
range: Literal
comment: A Yahoo chat ID
type: Property

Abstract
date: 2008-01-14
sub property of: topDataProperty
type: DatatypeProperty
sub property of: Description
property disjoint with: bottomDataProperty
type: Thing
issued: 2000-07-11
sub property of: description
relation: abstract-003
date: 2000-07-11
Relation: abstract-003
Has Version: abstract-003
Date Modified: 2008-01-14
type: Property
comment: A summary of the resource.

menu
sub property of: topObjectProperty
property disjoint with: bottomObjectProperty
type: ObjectProperty
type: Property
comment: A type of widget that offers a list of choices to the user.

current project
term status: testing
property disjoint with: used by
sub property of: topObjectProperty
property disjoint with: bottomObjectProperty
property disjoint with: runs
property disjoint with: operated by
type: Thing
type: ObjectProperty
type: Property
comment: A current project this person works on.
domain: Person
range: Thing

Method of Accrual
type: Thing
disjoint with: Nothing
Has Version: MethodOfAccrual-001
relation: MethodOfAccrual-001
issued: 2008-01-14
date: 2008-01-14
Relation: MethodOfAccrual-001
type: Class
subclass of: Thing
comment: A method by which resources are added to a collection.

AIM chat ID
type: DatatypeProperty
property disjoint with: bottomDataProperty
sub property of: topDataProperty
type: InverseFunctionalProperty
term status: testing
type: Thing
sub property of: nickname
type: Property
domain: Agent
comment: An AIM chat ID
range: Literal

last
term: last
type: Thing
sub property of: topObjectProperty
property disjoint with: bottomObjectProperty
type: ObjectProperty
type: Property
member: relrev-properties
comment: last refers to the last resource in a collection of resources.

Audience
property disjoint with: bottomObjectProperty
date: 2001-05-21
Date Modified: 2008-01-14
date: 2008-01-14
sub property of: topObjectProperty
issued: 2001-05-21
Has Version: audience-003
Relation: audience-003
type: ObjectProperty
type: Thing
relation: audience-003
type: Property
comment: A class of entity for whom the resource is intended or useful.
range: Agent Class

article
sub property of: topObjectProperty
property disjoint with: bottomObjectProperty
type: ObjectProperty
type: Property
comment: A section of a page that consists of a composition that forms an independent part of a document, page, or site.

section
term: section
type: Thing
sub property of: topObjectProperty
property disjoint with: bottomObjectProperty
type: ObjectProperty
type: Property
member: relrev-properties
comment: section refers to a resource serving as a section in a collection.

References
relation: references-003
Relation: references-003
note: This term is intended to be used with non-literal values as defined in the DCMI Abstract Model (http://dublincore.org/documents/abstract-model/). As of December 2007, the DCMI Usage Board is seeking a way to express this intention with a formal range declaration.
issued: 2000-07-11
date: 2000-07-11
sub property of: topObjectProperty
property disjoint with: bottomObjectProperty
Date Modified: 2008-01-14
date: 2008-01-14
type: ObjectProperty
type: Thing
sub property of: relation
Has Version: references-003
sub property of: Relation
type: Property
comment: A related resource that is referenced, cited, or otherwise pointed to by the described resource.

Detached signature
endorser: pubkey2011
type: Endorsement
type: Thing

Alternative Title
property disjoint with: bottomDataProperty
sub property of: Title
Relation: alternative-003
date: 2000-07-11
description: The distinction between titles and alternative titles is application-specific.
date: 2010-10-11
sub property of: title
type: Thing
Date Modified: 2010-10-11
issued: 2000-07-11
sub property of: topDataProperty
Has Version: alternative-003
relation: alternative-003
type: DatatypeProperty
type: Property
range: Literal
comment: An alternative name for the resource.

Identifier
sub property of: identifier
type: DatatypeProperty
relation: identifierT-001
sub property of: topDataProperty
Has Version: identifierT-001
date: 2008-01-14
description: Recommended best practice is to identify the resource by means of a string conforming to a formal identification system.
issued: 2008-01-14
property disjoint with: bottomDataProperty
Relation: identifierT-001
Date Modified: 2008-01-14
type: Thing
range: Literal
type: Property
comment: An unambiguous reference to the resource within a given context.

chapter
term: chapter
type: Thing
sub property of: topObjectProperty
property disjoint with: bottomObjectProperty
type: ObjectProperty
type: Property
member: relrev-properties
comment: chapter refers to a resource serving as a chapter in a collection.

used by
sub property of: actedOnBehalfOf
property disjoint with: member
property disjoint with: accessed
property disjoint with: bottomObjectProperty
type: ObjectProperty
property disjoint with: work info homepage
property disjoint with: schoolHomepage
property disjoint with: current project
property disjoint with: workplace homepage
property disjoint with: image
property disjoint with: knows
property disjoint with: publications
property disjoint with: past project
sub property of: topObjectProperty
comment: This property refers to a data publisher who used a data providing services at the time the provenance description refers to.
domain: Data Providing Service
range: Data Publisher

Provenance Vocabulary Core Ontology namespace
date: 2009-08-25T12:00:00Z
Date Created: 2009-08-25T12:00:00Z
type: Thing
date: 2012-03-14T12:00:00Z
description: The Provenance Vocabulary provides classes and properties for describing provenance of Web data. The vocabulary focuses on two main use cases: 1.) It enables consumers of Web data to describe provenance of data retrieved from the Web and of data derived from such Web data. 2.) It enables providers of Web data to publish provenance-related metadata about their data. Notice, the vocabulary is not intended for describing provenance of other kinds of Web content. The Provenance Vocabulary is designed as a Web data specific specialization of the W3C PROV Ontology (PROV-O); classes and properties provided by the vocabulary are domain specific extensions of the more general concepts introduced in PROV-O. As a consequence, any Provenance Vocabulary based description of provenance can be easily interpreted and exchanged according to the W3C PROV family of standards.
Date Modified: 2012-03-14T12:00:00Z
type: Ontology
creator: Jun Zhao
creator: Olaf Hartig

textbox
sub property of: topObjectProperty
property disjoint with: bottomObjectProperty
type: ObjectProperty
type: Property
comment: Input that allows free-form text as its value.

Instructional Method
description: Instructional Method will typically include ways of presenting instructional materials or conducting instructional activities, patterns of learner-to-learner and learner-to-instructor interactions, and mechanisms by which group and individual levels of learning are measured. Instructional methods include all aspects of the instruction and learning processes from planning and implementation through evaluation and feedback.
property disjoint with: bottomObjectProperty
Date Modified: 2008-01-14
Relation: instructionalMethod-002
Has Version: instructionalMethod-002
sub property of: topObjectProperty
date: 2008-01-14
type: Thing
date: 2005-06-13
type: ObjectProperty
issued: 2005-06-13
relation: instructionalMethod-002
type: Property
comment: A process, used to engender knowledge, attitudes and skills, that the described resource is designed to support.
range: Method of Instruction

schoolHomepage
sub property of: topObjectProperty
property disjoint with: runs
property disjoint with: used by
property disjoint with: operated by
type: Thing
property disjoint with: bottomObjectProperty
type: ObjectProperty
term status: testing
type: Property
comment: A homepage of a school attended by the person.
domain: Person
range: Document

geekcode
term status: archaic
type: Thing
sub property of: topDataProperty
property disjoint with: bottomDataProperty
type: DatatypeProperty
type: Property
comment: A textual geekcode for this person, see http://www.geekcode.com/geek.html
domain: Person
range: Literal

status
sub property of: topObjectProperty
property disjoint with: bottomObjectProperty
type: ObjectProperty
type: Property
comment: A container whose content is advisory information for the user but is not important enough to justify an alert. Also see alert.

family_name
term status: archaic
type: Thing
sub property of: topDataProperty
property disjoint with: bottomDataProperty
type: DatatypeProperty
type: Property
comment: The family name of some person.
domain: Person
range: Literal

Date Submitted
date: 2002-07-13
property disjoint with: bottomDataProperty
sub property of: date
type: Thing
description: Examples of resources to which a Date Submitted may be relevant are a thesis (submitted to a university department) or an article (submitted to a journal).
relation: dateSubmitted-002
sub property of: Date
date: 2008-01-14
Date Modified: 2008-01-14
issued: 2002-07-13
type: DatatypeProperty
sub property of: topDataProperty
Has Version: dateSubmitted-002
Relation: dateSubmitted-002
type: Property
range: Literal
comment: Date of submission of the resource.

Is Format Of
date: 2000-07-11
date: 2008-01-14
relation: isFormatOf-003
Has Version: isFormatOf-003
property disjoint with: bottomObjectProperty
Date Modified: 2008-01-14
issued: 2000-07-11
sub property of: relation
note: This term is intended to be used with non-literal values as defined in the DCMI Abstract Model (http://dublincore.org/documents/abstract-model/). As of December 2007, the DCMI Usage Board is seeking a way to express this intention with a formal range declaration.
type: Thing
type: ObjectProperty
sub property of: topObjectProperty
sub property of: Relation
Relation: isFormatOf-003
type: Property
comment: A related resource that is substantially the same as the described resource, but in another format.

definition
sub property of: topObjectProperty
property disjoint with: bottomObjectProperty
type: ObjectProperty
type: Property
member: role-properties
comment: indicates the definition of a term or concept.

Mediator
type: ObjectProperty
description: In an educational context, a mediator might be a parent, teacher, teaching assistant, or care-giver.
Relation: mediator-003
date: 2008-01-14
issued: 2001-05-21
relation: mediator-003
sub property of: topObjectProperty
Has Version: mediator-003
property disjoint with: bottomObjectProperty
Date Modified: 2008-01-14
date: 2001-05-21
type: Thing
sub property of: Audience
type: Property
range: Agent Class
comment: An entity that mediates access to the resource and for whom the resource is intended or useful.

Organization
disjoint with: WebServer
term status: stable
disjoint with: Image
disjoint with: Non-Human Agent
subclass of: Agent
disjoint with: Nothing
disjoint with: Data Providing Service
subclass of: Human Agent
disjoint with: Person
disjoint with: Document
subclass of: Thing
type: Thing
disjoint with: PersonalProfileDocument
type: Class
disjoint with: Server
disjoint with: Service
comment: An organization.

Policy
Relation: Policy-001
type: Class
relation: Policy-001
date: 2008-01-14
issued: 2008-01-14
Has Version: Policy-001
type: Thing
disjoint with: Nothing
subclass of: Thing
comment: A plan or course of action by an authority, intended to influence and determine decisions, actions, and other matters.

region
sub property of: topObjectProperty
property disjoint with: bottomObjectProperty
type: ObjectProperty
type: Property
comment: A large perceivable section of a web page or document, that the author feels is important enough to be included in a page summary or table of contents, for example, an area of the page containing live sporting event statistics.

checkbox
sub property of: topObjectProperty
property disjoint with: bottomObjectProperty
type: ObjectProperty
type: Property
comment: A checkable input that has three possible values: true, false, or mixed.

main
sub property of: topObjectProperty
property disjoint with: bottomObjectProperty
type: ObjectProperty
type: Property
member: role-properties
comment: acts as the main content of the document.

Method of Instruction
issued: 2008-01-14
subclass of: Thing
type: Thing
Relation: MethodOfInstruction-001
type: Class
disjoint with: Nothing
date: 2008-01-14
relation: MethodOfInstruction-001
Has Version: MethodOfInstruction-001
comment: A process that is used to engender knowledge, attitudes, and skills.

accessed
sub property of: topObjectProperty
property disjoint with: used
property disjoint with: guided by
property disjoint with: bottomObjectProperty
type: ObjectProperty
comment: This property refers to the Web resource that has been accessed during the execution of a data access. More precisely, the request of the referenced Web resource resulted in retrieving the representation that has been retrieved by the corresponding prv:DataAccess execution.
domain: Data Access
range: WebResource

operated by
property disjoint with: work info homepage
property disjoint with: bottomObjectProperty
type: ObjectProperty
sub property of: topObjectProperty
property disjoint with: knows
property disjoint with: member
property disjoint with: accessed
property disjoint with: past project
property disjoint with: image
sub property of: actedOnBehalfOf
property disjoint with: publications
property disjoint with: current project
property disjoint with: schoolHomepage
property disjoint with: workplace homepage
comment: This property refers to a human agent who was operating a non-human agent. For instance, a service provider operates a data providing service (see concept prv:DataProvidingService). Another example is a human agent who operates a non-human data creating agent.
domain: Non-Human Agent
range: Human Agent

tooltip
sub property of: topObjectProperty
property disjoint with: bottomObjectProperty
type: ObjectProperty
type: Property
comment: A contextual popup that displays a description for an element.

focus
term status: testing
type: Thing
sub property of: topObjectProperty
property disjoint with: bottomObjectProperty
type: ObjectProperty
type: Property
comment: The underlying or 'focal' entity associated with some SKOS-described concept.
domain: Concept
range: Thing

index
term: index
type: Thing
sub property of: topObjectProperty
property disjoint with: bottomObjectProperty
type: ObjectProperty
type: Property
member: relrev-properties
comment: index refers to a resource providing an index.

Size or Duration
description: Examples include a number of pages, a specification of length, width, and breadth, or a period in hours, minutes, and seconds.
subclass of: Thing
disjoint with: Nothing
type: Thing
relation: SizeOrDuration-001
date: 2008-01-14
type: Class
subclass of: Media Type or Extent
Has Version: SizeOrDuration-001
issued: 2008-01-14
Relation: SizeOrDuration-001
comment: A dimension or extent, or a time taken to play or execute.

completed at
sub property of: topDataProperty
property disjoint with: bottomDataProperty
sub property of: endedAtTime
equivalent property: endedAtTime
type: FunctionalProperty
type: DatatypeProperty
comment: This property refers to the time an activity has been completed.

made
term status: stable
type: Thing
sub property of: topObjectProperty
property disjoint with: bottomObjectProperty
inverse of: maker
type: ObjectProperty
type: Property
comment: Something that was made by this agent.
domain: Agent
range: Thing

topic_interest
term status: testing
type: Thing
sub property of: topObjectProperty
property disjoint with: bottomObjectProperty
type: ObjectProperty
type: Property
comment: A thing of interest to this person.
domain: Agent
range: Thing

past project
sub property of: topObjectProperty
property disjoint with: operated by
term status: testing
property disjoint with: bottomObjectProperty
type: ObjectProperty
property disjoint with: runs
type: Thing
property disjoint with: used by
type: Property
comment: A project this person has previously worked on.
domain: Person
range: Thing

prev
term: prev
type: Thing
sub property of: topObjectProperty
property disjoint with: bottomObjectProperty
type: ObjectProperty
type: Property
member: relrev-properties
comment: prev refers to a previous resource (before the current one) in an ordered collection of resources.

Non-Human Actor
disjoint with: Nothing
subclass of: Thing
type: Class
type: DeprecatedClass
comment: This class is deprecated and will be removed from the Provenance Vocabulary in the next revision. prv:NonHumanActor was renamed to prv:NonHumanAgent in the process of making the Provenance Vocabulary a specialization of W3C's PROV-O. Hence, use prv:NonHumanAgent instead.

RFC 1766
Has Version: RFC1766-003
date: 2008-01-14
date: 2000-07-11
Date Modified: 2008-01-14
type: Thing
relation: RFC1766-003
Relation: RFC1766-003
issued: 2000-07-11
type: Datatype
comment: The set of tags, constructed according to RFC 1766, for the identification of languages.

created by
sub property of: topObjectProperty
sub property of: wasGeneratedBy
property disjoint with: retrieved by
property disjoint with: bottomObjectProperty
type: ObjectProperty
comment: This property refers to the creation of a data item (or a file that serializes data items).
domain: http://lodlaundromat.org/.well-known/genid/samples/pellet///predicate//fe8d8faed6702d7784e1ccba87e71ab5/d3e700bc1857a8001f8ca87e5b965b3a#7
range: Data Creation
property chain axiom: http://lodlaundromat.org/.well-known/genid/samples/pellet///predicate//fe8d8faed6702d7784e1ccba87e71ab5/d3e700bc1857a8001f8ca87e5b965b3a#10

MSN chat ID
sub property of: nickname
property disjoint with: bottomDataProperty
type: Thing
sub property of: topDataProperty
type: InverseFunctionalProperty
term status: testing
type: DatatypeProperty
comment: An MSN chat ID
domain: Agent
type: Property
range: Literal

Is Referenced By
type: ObjectProperty
property disjoint with: bottomObjectProperty
date: 2008-01-14
Date Modified: 2008-01-14
date: 2000-07-11
sub property of: topObjectProperty
issued: 2000-07-11
sub property of: relation
type: Thing
note: This term is intended to be used with non-literal values as defined in the DCMI Abstract Model (http://dublincore.org/documents/abstract-model/). As of December 2007, the DCMI Usage Board is seeking a way to express this intention with a formal range declaration.
Relation: isReferencedBy-003
sub property of: Relation
relation: isReferencedBy-003
Has Version: isReferencedBy-003
comment: A related resource that references, cites, or otherwise points to the described resource.
type: Property

immediately preceded by
sub property of: relation
property disjoint with: bottomObjectProperty
property disjoint with: serialized by
sub property of: Relation
sub property of: Replaces
sub property of: topObjectProperty
type: ObjectProperty
sub property of: http://lodlaundromat.org/.well-known/genid/samples/pellet///predicate//fe8d8faed6702d7784e1ccba87e71ab5/d3e700bc1857a8001f8ca87e5b965b3a#1
comment: This property may be used to make the relationship between different version of a data item explicit. More precisely, this property refers to an immediately preceding version of a data item; hence, the new version (i.e. the subject) has been created using the old version (i.e. the object). We strongly encourage to also describe this creation of the new version explicitly.
domain: Data Item
range: Data Item

stylesheet
term: stylesheet
type: Thing
sub property of: topObjectProperty
property disjoint with: bottomObjectProperty
type: ObjectProperty
type: Property
member: relrev-properties
comment: stylesheet refers to a resource serving as a stylesheet for a resource.

DCMI Point
date: 2008-01-14
relation: Point-003
Date Modified: 2008-01-14
type: Thing
date: 2000-07-11
issued: 2000-07-11
Has Version: Point-003
Relation: Point-003
type: Datatype
comment: The set of points in space defined by their geographic coordinates according to the DCMI Point Encoding Scheme.

Requires
relation: requires-003
Has Version: requires-003
Relation: requires-003
sub property of: topObjectProperty
issued: 2000-07-11
date: 2008-01-14
sub property of: relation
date: 2000-07-11
note: This term is intended to be used with non-literal values as defined in the DCMI Abstract Model (http://dublincore.org/documents/abstract-model/). As of December 2007, the DCMI Usage Board is seeking a way to express this intention with a formal range declaration.
property disjoint with: bottomObjectProperty
Date Modified: 2008-01-14
type: Thing
sub property of: Relation
type: ObjectProperty
type: Property
comment: A related resource that is required by the described resource to support its function, delivery, or coherence.

based near
term status: testing
type: Thing
sub property of: topObjectProperty
property disjoint with: bottomObjectProperty
type: ObjectProperty
type: Property
comment: A location that something is based near, for some broadly human notion of near.
domain: SpatialThing
range: SpatialThing

primary topic
type: FunctionalProperty
sub property of: topic
term status: stable
type: ObjectProperty
type: Thing
inverse of: is primary topic of
sub property of: topObjectProperty
property disjoint with: bottomObjectProperty
domain: Document
range: Thing
type: Property
comment: The primary topic of some page or document.

tabpanel
sub property of: topObjectProperty
property disjoint with: bottomObjectProperty
type: ObjectProperty
type: Property
comment: A container for the resources associated with a tab, where each tab is contained in a tablist.

navigation
sub property of: topObjectProperty
property disjoint with: bottomObjectProperty
type: ObjectProperty
type: Property
member: role-properties
comment: indicates a collection of items suitable for navigating the document or related documents.

complementary
sub property of: topObjectProperty
property disjoint with: bottomObjectProperty
type: ObjectProperty
type: Property
member: role-properties
comment: indicates that the section supports but is separable from the main content of resource.

Rights
description: Typically, rights information includes a statement about various property rights associated with the resource, including intellectual property rights.
property disjoint with: bottomObjectProperty
type: Thing
issued: 2008-01-14
relation: rightsT-001
Date Modified: 2008-01-14
sub property of: topObjectProperty
Has Version: rightsT-001
date: 2008-01-14
sub property of: rights
Relation: rightsT-001
type: ObjectProperty
range: Rights Statement
comment: Information about rights held in and over the resource.
type: Property

Subject
Has Version: subjectT-002
Date Modified: 2012-06-14
description: Typically, the subject will be represented using keywords, key phrases, or classification codes. Recommended best practice is to use a controlled vocabulary.
Relation: subjectT-002
type: ObjectProperty
type: Thing
date: 2012-06-14
property disjoint with: bottomObjectProperty
issued: 2008-01-14
sub property of: subject
sub property of: topObjectProperty
date: 2008-01-14
relation: subjectT-002
note: This term is intended to be used with non-literal values as defined in the DCMI Abstract Model (http://dublincore.org/documents/abstract-model/). As of December 2007, the DCMI Usage Board is seeking a way to express this intention with a formal range declaration.
type: Property
comment: The topic of the resource.

Period of Time
subclass of: Thing
type: Thing
issued: 2008-01-14
date: 2008-01-14
type: Class
subclass of: Location, Period, or Jurisdiction
Has Version: PeriodOfTime-001
relation: PeriodOfTime-001
disjoint with: Nothing
Relation: PeriodOfTime-001
comment: An interval of time that is named or defined by its start and end dates.

sha1sum of a personal mailbox URI name
term status: testing
type: Thing
sub property of: topDataProperty
property disjoint with: bottomDataProperty
type: InverseFunctionalProperty
type: DatatypeProperty
type: Property
comment: The sha1sum of the URI of an Internet mailbox associated with exactly one owner, the first owner of the mailbox.
domain: Agent
range: Literal

is primary topic of
sub property of: topObjectProperty
property disjoint with: bottomObjectProperty
type: Thing
type: ObjectProperty
sub property of: page
type: InverseFunctionalProperty
term status: stable
inverse of: primary topic
comment: A document that this thing is the primary topic of.
domain: Thing
range: Document
type: Property

columnheader
sub property of: topObjectProperty
property disjoint with: bottomObjectProperty
type: ObjectProperty
type: Property
comment: A cell containing header information for a column.

Rights Holder
date: 2004-06-14
relation: rightsHolder-002
issued: 2004-06-14
type: Thing
date: 2008-01-14
type: ObjectProperty
property disjoint with: bottomObjectProperty
sub property of: topObjectProperty
Date Modified: 2008-01-14
Relation: rightsHolder-002
Has Version: rightsHolder-002
type: Property
comment: A person or organization owning or managing rights over the resource.
range: Agent

Spatial Coverage
date: 2008-01-14
type: ObjectProperty
relation: spatial-003
date: 2000-07-11
Relation: spatial-003
issued: 2000-07-11
Date Modified: 2008-01-14
property disjoint with: bottomObjectProperty
Has Version: spatial-003
sub property of: topObjectProperty
sub property of: Coverage
sub property of: coverage
type: Thing
type: Property
range: Location
comment: Spatial characteristics of the resource.

Publisher
Relation: publisherT-001
Date Modified: 2010-10-11
date: 2008-01-14
issued: 2008-01-14
date: 2010-10-11
relation: publisherT-001
type: Thing
Has Version: publisherT-001
sub property of: topObjectProperty
property disjoint with: bottomObjectProperty
description: Examples of a Publisher include a person, an organization, or a service.
sub property of: publisher
type: ObjectProperty
range: Agent
comment: An entity responsible for making the resource available.
type: Property

logo
term status: testing
type: Thing
sub property of: topObjectProperty
property disjoint with: bottomObjectProperty
type: InverseFunctionalProperty
type: ObjectProperty
type: Property
comment: A logo representing some thing.
domain: Thing
range: Thing

Rights Statement
type: Thing
subclass of: Thing
Has Version: RightsStatement-001
relation: RightsStatement-001
disjoint with: Nothing
date: 2008-01-14
type: Class
issued: 2008-01-14
Relation: RightsStatement-001
comment: A statement about the intellectual property rights (IPR) held in or over a Resource, a legal document giving official permission to do something with a resource, or a statement about access rights.

Tomi Kauppinen
type: Person
type: Thing
type: Human Agent
type: Agent
type: SpatialThing

top
term: top
type: Thing
sub property of: topObjectProperty
property disjoint with: bottomObjectProperty
type: ObjectProperty
type: Property
member: relrev-properties
comment: top is a synonym for start.

accessed
property disjoint with: bottomObjectProperty
sub property of: topObjectProperty
property disjoint with: used
property disjoint with: knows
property disjoint with: operated by
property disjoint with: guided by
property disjoint with: used by
type: ObjectProperty
sub property of: wasAssociatedWith
comment: This property refers to the service that provided the Web representation during the execution of a data access.
domain: Data Access
range: Data Providing Service

MeSH
Date Modified: 2008-01-14
date: 2008-01-14
date: 2000-07-11
Has Version: MESH-003
type: Thing
issued: 2000-07-11
Relation: MESH-003
type: VocabularyEncodingScheme
relation: MESH-003
comment: The set of labeled concepts specified by the Medical Subject Headings.

menuitem
sub property of: topObjectProperty
property disjoint with: bottomObjectProperty
type: ObjectProperty
type: Property
comment: An option in a group of choices contained by a menu or menubar.

image
property disjoint with: operated by
sub property of: depiction
type: ObjectProperty
term status: testing
property disjoint with: bottomObjectProperty
sub property of: topObjectProperty
property disjoint with: used by
property disjoint with: runs
type: Thing
type: Property
comment: An image that can be used to represent some thing (ie. those depictions which are particularly representative of something, eg. one's photo on a homepage).
domain: Person
range: Image

menuitemradio
sub property of: topObjectProperty
property disjoint with: bottomObjectProperty
type: ObjectProperty
type: Property
comment: A checkable menuitem in a group of menuitemradio roles, only one of which can be checked at a time.

Project
disjoint with: PersonalProfileDocument
type: Class
term status: testing
disjoint with: Document
subclass of: Thing
disjoint with: Nothing
disjoint with: Image
disjoint with: Person
type: Thing
comment: A project (a collective endeavour of some kind).

Management of a Crisis (MOAC) Vocabulary Specification
topic: Management of a Crisis Vocabulary namespace
primary topic: Management of a Crisis Vocabulary namespace
stylesheet: main.css
alternate: moac-2012-01-29.rdf
type: Thing
type: Document
label: Document that defines the Management of a Crisis Vocabulary

account name
term status: testing
type: Thing
sub property of: topDataProperty
property disjoint with: bottomDataProperty
type: DatatypeProperty
type: Property
comment: Indicates the name (identifier) associated with this online account.
domain: Online Account
range: Literal

Location
Relation: Location-001
date: 2008-01-14
type: Class
subclass of: Location, Period, or Jurisdiction
relation: Location-001
type: Thing
issued: 2008-01-14
Has Version: Location-001
subclass of: Thing
disjoint with: Nothing
comment: A spatial region or named place.

jabber ID
term status: testing
type: Thing
sub property of: topDataProperty
property disjoint with: bottomDataProperty
type: InverseFunctionalProperty
type: DatatypeProperty
type: Property
comment: A jabber ID for something.
domain: Agent
range: Literal

scrollbar
sub property of: topObjectProperty
property disjoint with: bottomObjectProperty
type: ObjectProperty
type: Property
comment: A graphical object that controls the scrolling of content within a viewing area, regardless of whether the content is fully displayed within the viewing area.

Format
relation: formatT-001
description: Examples of dimensions include size and duration. Recommended best practice is to use a controlled vocabulary such as the list of Internet Media Types [MIME].
Has Version: formatT-001
Date Modified: 2008-01-14
date: 2008-01-14
sub property of: topObjectProperty
issued: 2008-01-14
sub property of: format
type: ObjectProperty
property disjoint with: bottomObjectProperty
type: Thing
Relation: formatT-001
type: Property
comment: The file format, physical medium, or dimensions of the resource.
range: Media Type or Extent

LCSH
issued: 2000-07-11
type: VocabularyEncodingScheme
Has Version: LCSH-003
Date Modified: 2008-01-14
relation: LCSH-003
date: 2000-07-11
Relation: LCSH-003
type: Thing
date: 2008-01-14
comment: The set of labeled concepts specified by the Library of Congress Subject Headings.

Human Actor
disjoint with: Nothing
subclass of: Thing
type: Class
type: DeprecatedClass
comment: This class is deprecated and will be removed from the Provenance Vocabulary in the next revision. prv:HumanActor was renamed to prv:HumanAgent in the process of making the Provenance Vocabulary a specialization of W3C's PROV-O. Hence, use prv:HumanAgent instead.

Online Gaming Account
term status: unstable
type: Thing
disjoint with: Nothing
subclass of: Thing
subclass of: Online Account
type: Class
comment: An online gaming account.

Document
term status: testing
subclass of: Thing
disjoint with: Nothing
type: Class
disjoint with: Project
type: Thing
disjoint with: Organization
comment: A document.

tipjar
term status: testing
type: Thing
sub property of: topObjectProperty
sub property of: page
property disjoint with: bottomObjectProperty
type: ObjectProperty
type: Property
comment: A tipjar document for this agent, describing means for payment and reward.
domain: Agent
range: Document

age
term status: unstable
type: Thing
sub property of: topDataProperty
property disjoint with: bottomDataProperty
type: FunctionalProperty
type: DatatypeProperty
type: Property
comment: The age in years of some agent.
domain: Agent
range: Literal

publications
sub property of: topObjectProperty
term status: testing
property disjoint with: runs
type: Thing
property disjoint with: bottomObjectProperty
property disjoint with: used by
type: ObjectProperty
property disjoint with: operated by
type: Property
comment: A link to the publications of this person.
domain: Person
range: Document

start
term: start
type: Thing
sub property of: topObjectProperty
property disjoint with: bottomObjectProperty
type: ObjectProperty
type: Property
member: relrev-properties
comment: start refers to the first resource in a collection of resources.

next
term: next
type: Thing
sub property of: topObjectProperty
property disjoint with: bottomObjectProperty
type: ObjectProperty
type: Property
member: relrev-properties
comment: next refers to the next resource (after the current one) in an ordered collection of resources.

separator
sub property of: topObjectProperty
property disjoint with: bottomObjectProperty
type: ObjectProperty
type: Property
comment: A divider that separates and distinguishes sections of content or groups of menuitems.

License
date: 2008-01-14
type: ObjectProperty
sub property of: topObjectProperty
sub property of: rights
issued: 2004-06-14
Relation: license-002
date: 2004-06-14
relation: license-002
Date Modified: 2008-01-14
property disjoint with: bottomObjectProperty
Has Version: license-002
type: Thing
sub property of: Rights
comment: A legal document giving official permission to do something with the resource.
type: Property
range: License Document

firstName
term status: testing
type: Thing
sub property of: topDataProperty
property disjoint with: bottomDataProperty
type: DatatypeProperty
type: Property
comment: The first name of a person.
domain: Person
range: Literal

serialized by
sub property of: topObjectProperty
property disjoint with: contained in
property disjoint with: used
property disjoint with: guided by
property disjoint with: bottomObjectProperty
property disjoint with: immediately preceded by
type: ObjectProperty
comment: This property refers to a file that serialized a data item.
domain: Data Item
range: File

Type
property disjoint with: bottomObjectProperty
sub property of: topObjectProperty
date: 2008-01-14
Has Version: typeT-001
sub property of: type
type: Thing
description: Recommended best practice is to use a controlled vocabulary such as the DCMI Type Vocabulary [DCMITYPE]. To describe the file format, physical medium, or dimensions of the resource, use the Format element.
Date Modified: 2008-01-14
Relation: typeT-001
relation: typeT-001
type: ObjectProperty
issued: 2008-01-14
range: Class
type: Property
comment: The nature or genre of the resource.

ISO 3166
issued: 2000-07-11
type: Thing
date: 2000-07-11
date: 2008-01-14
Date Modified: 2008-01-14
relation: ISO3166-004
Has Version: ISO3166-004
Relation: ISO3166-004
type: Datatype
comment: The set of codes listed in ISO 3166-1 for the representation of names of countries.

alertdialog
sub property of: topObjectProperty
property disjoint with: bottomObjectProperty
type: ObjectProperty
type: Property
comment: A type of dialog that contains an alert message, where initial focus goes an element within the dialog. Also see alert and dialog.

Contributor
date: 2008-01-14
sub property of: topObjectProperty
description: Examples of a Contributor include a person, an organization, or a service.
Relation: contributorT-001
type: ObjectProperty
date: 2010-10-11
type: Thing
Date Modified: 2010-10-11
issued: 2008-01-14
sub property of: contributor
relation: contributorT-001
property disjoint with: bottomObjectProperty
Has Version: contributorT-001
comment: An entity responsible for making contributions to the resource.
type: Property
range: Agent

depiction
term status: testing
type: Thing
sub property of: topObjectProperty
property disjoint with: bottomObjectProperty
inverse of: depicts
type: ObjectProperty
type: Property
comment: A depiction of some thing.
domain: Thing
range: Image

status
term status: unstable
type: Thing
sub property of: topDataProperty
property disjoint with: bottomDataProperty
type: DatatypeProperty
type: Property
comment: A string expressing what the user is happy for the general public (normally) to know about their current activity.
domain: Agent
range: Literal

Agent
type: Class
subclass of: Agent
equivalent class: Agent
subclass of: Thing
disjoint with: Nothing
type: Thing
term status: stable
comment: An agent (eg. person, group, software or physical artifact).

tree
sub property of: topObjectProperty
property disjoint with: bottomObjectProperty
type: ObjectProperty
type: Property
comment: A type of list that may contain sub-level nested groups that can be collapsed and expanded.

Standard
Relation: Standard-001
date: 2008-01-14
subclass of: Thing
disjoint with: Nothing
Has Version: Standard-001
relation: Standard-001
type: Class
issued: 2008-01-14
type: Thing
comment: A basis for comparison; a reference point against which other things can be evaluated.

gender
term status: testing
type: Thing
sub property of: topDataProperty
property disjoint with: bottomDataProperty
type: FunctionalProperty
type: DatatypeProperty
type: Property
comment: The gender of this Agent (typically but not necessarily 'male' or 'female').
domain: Agent
range: Literal

math
sub property of: topObjectProperty
property disjoint with: bottomObjectProperty
type: ObjectProperty
type: Property
comment: Content that represents a mathematical expression.

first
term: first
type: Thing
sub property of: topObjectProperty
property disjoint with: bottomObjectProperty
type: ObjectProperty
type: Property
member: relrev-properties
comment: first refers the first item in a collection (see also start and top).

myersBriggs
term status: testing
type: Thing
sub property of: topDataProperty
property disjoint with: bottomDataProperty
type: DatatypeProperty
type: Property
comment: A Myers Briggs (MBTI) personality classification.
domain: Person
range: Literal

DCMI Period
date: 2000-07-11
relation: Period-003
Relation: Period-003
type: Thing
Date Modified: 2008-01-14
issued: 2000-07-11
date: 2008-01-14
Has Version: Period-003
type: Datatype
comment: The set of time intervals defined by their limits according to the DCMI Period Encoding Scheme.

Date Modified
type: DatatypeProperty
sub property of: topDataProperty
date: 2000-07-11
Date Modified: 2008-01-14
date: 2008-01-14
sub property of: Date
relation: modified-003
property disjoint with: bottomDataProperty
type: Thing
issued: 2000-07-11
Relation: modified-003
sub property of: date
Has Version: modified-003
type: Property
range: Literal
comment: Date on which the resource was changed.

row
sub property of: topObjectProperty
property disjoint with: bottomObjectProperty
type: ObjectProperty
type: Property
comment: A row of cells in a grid.

Date Accepted
date: 2008-01-14
Relation: dateAccepted-002
Date Modified: 2008-01-14
type: Thing
type: DatatypeProperty
sub property of: date
description: Examples of resources to which a Date Accepted may be relevant are a thesis (accepted by a university department) or an article (accepted by a journal).
property disjoint with: bottomDataProperty
sub property of: topDataProperty
date: 2002-07-13
Has Version: dateAccepted-002
sub property of: Date
issued: 2002-07-13
relation: dateAccepted-002
range: Literal
comment: Date of acceptance of the resource.
type: Property

Audience Education Level
type: Thing
relation: educationLevel-002
issued: 2002-07-13
Has Version: educationLevel-002
sub property of: Audience
date: 2002-07-13
date: 2008-01-14
sub property of: topObjectProperty
type: ObjectProperty
property disjoint with: bottomObjectProperty
Date Modified: 2008-01-14
Relation: educationLevel-002
type: Property
comment: A class of entity, defined in terms of progression through an educational or training context, for which the described resource is intended.
range: Agent Class

meta
term: meta
type: Thing
sub property of: topObjectProperty
property disjoint with: bottomObjectProperty
type: ObjectProperty
type: Property
member: relrev-properties
comment: meta refers to a resource that provides metadata.

Execution
disjoint with: Nothing
subclass of: Thing
type: Class
type: DeprecatedClass
comment: This class is deprecated and will be removed from the Provenance Vocabulary in the next revision. prv:Execution was deprecated in the process of making the Provenance Vocabulary a specialization of W3C's PROV-O. Hence, use prov:Activity instead.

Has Version
relation: hasVersion-003
sub property of: topObjectProperty
Has Version: hasVersion-003
sub property of: relation
property disjoint with: bottomObjectProperty
Date Modified: 2008-01-14
date: 2008-01-14
note: This term is intended to be used with non-literal values as defined in the DCMI Abstract Model (http://dublincore.org/documents/abstract-model/). As of December 2007, the DCMI Usage Board is seeking a way to express this intention with a formal range declaration.
issued: 2000-07-11
date: 2000-07-11
type: Thing
type: ObjectProperty
Relation: hasVersion-003
sub property of: Relation
comment: A related resource that is a version, edition, or adaptation of the described resource.
type: Property

performed by
sub property of: topObjectProperty
sub property of: wasAssociatedWith
property disjoint with: bottomObjectProperty
type: ObjectProperty
comment: This property refers to an agent that/who performed an activity.

thumbnail
term status: testing
type: Thing
sub property of: topObjectProperty
property disjoint with: bottomObjectProperty
type: ObjectProperty
type: Property
comment: A derived thumbnail image.
domain: Image
range: Image

http://lodlaundromat.org/.well-known/genid/samples/pellet///predicate//fe8d8faed6702d7784e1ccba87e71ab5/d3e700bc1857a8001f8ca87e5b965b3a#2
type: Restriction
on property: accessed
max cardinality: 1

http://lodlaundromat.org/.well-known/genid/samples/pellet///predicate//fe8d8faed6702d7784e1ccba87e71ab5/d3e700bc1857a8001f8ca87e5b965b3a#3
type: Restriction
on property: accessed
max cardinality: 1