ShelterDistributionPoint
subclass of: Resource
subclass of: Thing
type: Class
comment: ShelterDistributionPoint is a specific location where humanitarian relief agencies provide shelter assistances as a part of relief distribution.

FoodShortage
subclass of: Resource
subclass of: Thing
type: Class
comment: FoodShortage is a widespread scarcity of food that may apply to any faunal species.

NFIItems
subclass of: Thing
subclass of: Resource
type: Class
comment: NFIItems also known as Non Food Items include, but are not limited to, jerry cans, kots, mats distributed or stocked by shelter response humanitarian agencies.

Menaces
subclass of: Resource
subclass of: Thing
type: Class
comment: A Menace is a threat or danger that causes intimidation.

Bibliographic Resource
subclass of: Resource
Has Version: BibliographicResource-001
issued: 2008-01-14
type: Class
comment: A book, article, or other documentary resource.
Relation: BibliographicResource-001
relation: BibliographicResource-001
date: 2008-01-14

MedicalEquipmentAndSupplyNeeds
subclass of: Resource
subclass of: Thing
type: Class
comment: MedicalEquipmentAndSupplyNeeds is a term describe the demand for Medical Equipment and Supplies.

http://lodlaundromat.org/.well-known/genid/samples/jena///predicate//fe8d8faed6702d7784e1ccba87e71ab5/d3e700bc1857a8001f8ca87e5b965b3a#3
subclass of: Resource
subclass of: Thing
type: Class
type: Restriction
on property: accessed
max cardinality: 1

Creation Guideline
subclass of: Thing
subclass of: Resource
type: Class
comment: CreationGuideline is a concept that represents a guideline used to guide the execution of a data creation. Examples for creation guidelines are transformation rules, mapping definitions, entailment rules, and database queries.
subclass of: Plan
subclass of: Data Item
subclass of: http://lodlaundromat.org/.well-known/genid/samples/jena///predicate//fe8d8faed6702d7784e1ccba87e71ab5/d3e700bc1857a8001f8ca87e5b965b3a#4
subclass of: Entity
subclass of: http://lodlaundromat.org/.well-known/genid/samples/jena///predicate//fe8d8faed6702d7784e1ccba87e71ab5/d3e700bc1857a8001f8ca87e5b965b3a#7
subclass of: InformationRealization

guided by
range: Thing
domain: Thing
type: ObjectProperty
comment: This property refers to a creation guideline which guided the execution of a data creation. Examples for creation guidelines are transformation rules, mapping definitions, entailment rules, and database queries. Notice, all creation guidelines have provenance; we strongly encourage to describe this provenance as well, at least as far as available information permits.
domain: Data Creation
range: Creation Guideline
sub property of: used
type: Property
range: Resource
domain: Resource
domain: Activity
range: http://lodlaundromat.org/.well-known/genid/samples/jena///predicate//fe8d8faed6702d7784e1ccba87e71ab5/d3e700bc1857a8001f8ca87e5b965b3a#4
range: Data Item
range: http://lodlaundromat.org/.well-known/genid/samples/jena///predicate//fe8d8faed6702d7784e1ccba87e71ab5/d3e700bc1857a8001f8ca87e5b965b3a#7
range: Entity
range: Plan
range: InformationRealization

License Document
subclass of: Resource
Has Version: LicenseDocument-001
issued: 2008-01-14
type: Class
comment: A legal document giving official permission to do something with a Resource.
subclass of: Rights Statement
Relation: LicenseDocument-001
relation: LicenseDocument-001
date: 2008-01-14

When3W
subclass of: Thing
subclass of: Resource
type: Class
comment: Specific time in relation to humanitarian response.

interest
range: Thing
domain: Thing
type: Property
type: ObjectProperty
comment: A page about a topic of interest to this person.
domain: Agent
range: Document
term status: testing
domain: Resource
range: Resource

HospitalOperating
subclass of: Resource
subclass of: Thing
type: Class
comment: HospitalOperating describes still functioning hospital after a disaster.

SecurityConcern
subclass of: Resource
subclass of: Thing
type: Class
comment: SecurityConcern is a abstract term related to the worries of protection against danger, damage, loss, and criminal activity.

work info homepage
range: Thing
domain: Thing
type: Property
type: ObjectProperty
comment: A work info homepage of some person; a page about their work for some organization.
domain: Person
range: Document
term status: testing
domain: Agent
domain: Resource
domain: Human Agent
domain: SpatialThing
range: Resource

ShelterActivity
subclass of: Thing
subclass of: Resource
type: Class
comment: ShelterActivity is a term that describes Shelter Cluster related humanitarian response.

account service homepage
range: Thing
domain: Thing
type: Property
type: ObjectProperty
comment: Indicates a homepage of the service provide for this online account.
domain: Online Account
range: Document
term status: testing
domain: Resource
range: Resource

Data Item
subclass of: Thing
subclass of: Resource
type: Class
comment: Immutable is a concept that represents entities which are immutable.
subclass of: Entity

Agent
subclass of: Resource
subclass of: Agent
description: Examples of Agent include person, organization, and software agent.
Has Version: Agent-001
issued: 2008-01-14
type: Agent Class
type: Class
comment: A resource that acts or has the power to act.
Relation: Agent-001
relation: Agent-001
date: 2008-01-14
equivalent class: Agent

InfrastructureDamage
subclass of: Thing
subclass of: Resource
type: Class
comment: InfrastureDamage is about the damage of physically existing basic facilities, services, and installations needed for the functioning of a community or society.

PriceGouging
subclass of: Resource
subclass of: Thing
type: Class
comment: PriceGouging is a pejorative term referring to a situation in which a seller prices goods or commodities much higher than is considered reasonable or fair.

FinancialServicesAvailable
subclass of: Resource
subclass of: Thing
type: Class
comment: FinancialServicesAvailabe refers to services provided by the certain Non Government Organizations or finance industry as a part of recovery packages to the disaster affected communities.

member
range: Thing
domain: Thing
type: Property
type: ObjectProperty
comment: Indicates a member of a Group
domain: Group
range: Agent
term status: stable
domain: Agent
domain: Resource
domain: Human Agent
range: Resource

personal mailbox
domain: Thing
type: Property
type: InverseFunctionalProperty
type: ObjectProperty
comment: A personal mailbox, ie. an Internet mailbox associated with exactly one owner, the first owner of this mailbox. This is a 'static inverse functional property', in that there is (across time and change) at most one individual that ever has any particular value for foaf:mbox.
domain: Agent
range: Thing
term status: stable
domain: Resource
range: Resource

Source
sub property of: relation
description: The described resource may be derived from the related resource in whole or in part. Recommended best practice is to identify the related resource by means of a string conforming to a formal identification system.
note: This term is intended to be used with non-literal values as defined in the DCMI Abstract Model (http://dublincore.org/documents/abstract-model/). As of December 2007, the DCMI Usage Board is seeking a way to express this intention with a formal range declaration.
comment: A related resource from which the described resource is derived.
type: Property
sub property of: source
sub property of: Relation
issued: 2008-01-14
Date Modified: 2008-01-14
Has Version: sourceT-001
Relation: sourceT-001
relation: sourceT-001
date: 2008-01-14

Physical Resource
subclass of: Resource
Has Version: PhysicalResource-001
issued: 2008-01-14
type: Class
comment: A material thing.
Relation: PhysicalResource-001
relation: PhysicalResource-001
date: 2008-01-14

Non-Human Agent
subclass of: Thing
subclass of: Resource
type: Class
comment: NonHumanAgent is a general class that represents agents who are not social beings.
disjoint with: Human Agent
subclass of: Agent

weblog
range: Thing
domain: Thing
sub property of: page
type: Property
range: Document
term status: testing
comment: A weblog of some thing (whether person, group, company etc.).
domain: Agent
type: InverseFunctionalProperty
type: ObjectProperty
range: Resource
domain: Resource

Media Type
subclass of: Resource
Has Version: MediaType-001
issued: 2008-01-14
type: Class
comment: A file format or physical medium.
subclass of: Media Type or Extent
Relation: MediaType-001
relation: MediaType-001
date: 2008-01-14

Online Account
subclass of: Resource
type: Class
comment: An online account.
subclass of: Thing
term status: testing

Needs3W
subclass of: Resource
subclass of: Thing
type: Class
comment: Cluster Specific humanitarian response information.

PersonsNews
subclass of: Resource
subclass of: Thing
type: Class
comment: PersonNews is the information about a person's status, e.g. death, injured, alive etc.

Agent Class
subclass of: Resource
description: Examples of Agent Class include groups seen as classes, such as students, women, charities, lecturers.
Has Version: AgentClass-003
issued: 2008-01-14
Date Modified: 2012-06-14
type: Class
comment: A group of agents.
subclass of: Class
Relation: AgentClass-003
relation: AgentClass-003
date: 2012-06-14
date: 2008-01-14

Where3W
subclass of: Thing
subclass of: Resource
type: Class
comment: Specific location(s) in relation to humanitarian response.

Online Chat Account
subclass of: Resource
subclass of: Thing
type: Class
comment: An online chat account.
subclass of: Online Account
term status: unstable

Artifact
subclass of: Resource
subclass of: Thing
type: Class
type: DeprecatedClass
comment: This class is deprecated and will be removed from the Provenance Vocabulary in the next revision. prv:Artifact was deprecated in the process of making the Provenance Vocabulary a specialization of W3C's PROV-O. Hence, use prov:Entity (or the more specific prv:Immutable) instead.

knows
range: Thing
domain: Thing
type: Property
type: ObjectProperty
comment: A person known by this person (indicating some level of reciprocated interaction between the parties).
domain: Person
range: Person
term status: stable
domain: Agent
domain: Resource
domain: Human Agent
domain: SpatialThing
range: Agent
range: Resource
range: Human Agent
range: SpatialThing

Creator
sub property of: contributor
sub property of: maker
Date Modified: 2010-10-11
comment: An entity primarily responsible for making the resource.
Has Version: creatorT-002
equivalent property: maker
issued: 2008-01-14
sub property of: Contributor
sub property of: creator
type: Property
type: AnnotationProperty
description: Examples of a Creator include a person, an organization, or a service.
range: Agent
Relation: creatorT-002
relation: creatorT-002
date: 2010-10-11
date: 2008-01-14
range: Thing
range: Resource
domain: Thing
domain: Resource

Data Access
subclass of: Thing
subclass of: Resource
type: Class
comment: DataAccess is a concept that represents the completed execution of an activity by which an immutable data item has been retrieved from the Web.
disjoint with: Data Creation
subclass of: http://lodlaundromat.org/.well-known/genid/samples/jena///predicate//fe8d8faed6702d7784e1ccba87e71ab5/d3e700bc1857a8001f8ca87e5b965b3a#2
subclass of: http://lodlaundromat.org/.well-known/genid/samples/jena///predicate//fe8d8faed6702d7784e1ccba87e71ab5/d3e700bc1857a8001f8ca87e5b965b3a#3
subclass of: Activity

CollapsedStructure
subclass of: Resource
subclass of: Thing
type: Class
comment: A CollapsedStructure is a term that defines a totally damaged state of a structure resulting from human or natural phenomenon.

page
range: Thing
type: Property
type: ObjectProperty
comment: A page or document about this thing.
domain: Thing
range: Document
inverse of: topic
term status: testing
domain: Resource
range: Resource

Human Agent
subclass of: Thing
subclass of: Resource
type: Class
comment: HumanAgent is a general class that represents agents who are social beings such as persons, organizations, companies.
disjoint with: Non-Human Agent
subclass of: Agent

Incident
subclass of: Thing
subclass of: Resource
type: Class
comment: Incident is a distinct or definite event.

UshahidiReport
subclass of: Resource
subclass of: Thing
type: Class
comment: UshahidiReport is a report from Ushahidi, contains simultaneously temporal and geospatial archive of events, based on the local observers' reports.

RoadBlocked
subclass of: Resource
subclass of: Thing
type: Class
comment: RoadBlocked indicate a road is blocked by a barricade caused by natural disaster or set up by human.

Location, Period, or Jurisdiction
subclass of: Resource
Has Version: LocationPeriodOrJurisdiction-001
issued: 2008-01-14
type: Class
comment: A location, period of time, or jurisdiction.
Relation: LocationPeriodOrJurisdiction-001
relation: LocationPeriodOrJurisdiction-001
date: 2008-01-14

What3W
subclass of: Resource
subclass of: Thing
type: Class
comment: Specific activities in relation to humanitarian response.

WaterSanitationAndHygienePromotion
subclass of: Resource
subclass of: Thing
type: Class
comment: WaterSanitationAndHygienePromotion is a term refers to a concept that improving access to safe water and sanitation facilities leads to healthier families and communities. (UNICEF)

ShelterOffered
subclass of: Resource
subclass of: Thing
type: Class
comment: ShelterOffered indicates a location where internally displace people have been offered termporary/transitional shelters.
comment: ShelterOffered relates shelter activities when a humanitarian relief agencies provide shelter (e.g. tents, tarps) materials as a part of a relief distribution.

ContaminatedWaterSupply
subclass of: Resource
subclass of: Thing
type: Class
comment: The source and delivery system provides water but polluted. It could result in outbreaks of diseases and other health realted issues.

HumanRemainsManagement
subclass of: Resource
subclass of: Thing
type: Class
comment: HumanRemainsManagement is an abstract term used to define morgues or other locations where dead bodies can be properlay managed.

account
range: Thing
domain: Thing
type: Property
type: ObjectProperty
comment: Indicates an account held by this agent.
domain: Agent
range: Online Account
term status: testing
domain: Resource
range: Resource

NonfoodAidDistributionPoint
subclass of: Resource
subclass of: Thing
type: Class
comment: NonfoodAidDistributionPoint is a location for distributing or transporting life saving Non Food Item other than food items, also known as NFIs in humaniatarian sphere.

homepage
range: Thing
comment: A homepage for some thing.
range: Document
type: Property
term status: stable
sub property of: page
sub property of: is primary topic of
domain: Thing
type: ObjectProperty
type: InverseFunctionalProperty
range: Resource
domain: Resource

Label Property
subclass of: Resource
subclass of: Thing
type: Class
comment: A foaf:LabelProperty is any RDF property with texual values that serve as labels.
term status: unstable

Linguistic System
subclass of: Resource
description: Examples include written, spoken, sign, and computer languages.
Has Version: LinguisticSystem-001
issued: 2008-01-14
type: Class
comment: A system of signs, symbols, sounds, gestures, or rules used in communication.
Relation: LinguisticSystem-001
relation: LinguisticSystem-001
date: 2008-01-14

PsychiatricNeed
subclass of: Resource
subclass of: Thing
type: Class
comment: PsychiatricNeed is a term indicate that people need medical care for mental disorders.

SearchAndRescue
subclass of: Resource
subclass of: Thing
type: Class
comment: SearchAndRescue is a part of humanitarian relief effort on the immediate on set of disaster where a team of experts try and locate missing persons.

PersonalProfileDocument
subclass of: Resource
subclass of: Thing
type: Class
comment: A personal profile RDF document.
subclass of: Document
term status: testing

Data Providing Service
subclass of: Thing
subclass of: Resource
type: Class
comment: DataProvidingService is a concept that represents a non-human agent - usually a Web service or a server - that processes data access requests and actually sends the requested Web representations over the Web.
subclass of: Non-Human Agent
subclass of: Agent

Others
subclass of: Resource
subclass of: Thing
type: Class
comment: Others is the class that is used when certain instance does not fit any of the classes. (Source:Ushahidi Haiti)

used
range: Thing
domain: Thing
type: ObjectProperty
comment: This property is deprecated and will be removed from the Provenance Vocabulary in the next revision. prv:employedArtifact was deprecated in the process of making the Provenance Vocabulary a specialization of W3C's PROV-O. Hence, use prov:used instead.
type: DeprecatedProperty
type: Property
domain: Resource
range: Resource

Actor
subclass of: Resource
subclass of: Thing
type: Class
type: DeprecatedClass
comment: This class is deprecated and will be removed from the Provenance Vocabulary in the next revision. prv:Actor was deprecated in the process of making the Provenance Vocabulary a specialization of W3C's PROV-O. Hence, use one of the more specific classes prv:HumanAgent and prv:NonHumanAgent instead; or, if such a specialization is unsuitable for the use case at hand, directly use the general class prov:Agent as defined by PROV-O.

File Format
subclass of: Resource
description: Examples include the formats defined by the list of Internet Media Types.
Has Version: FileFormat-001
issued: 2008-01-14
type: Class
comment: A digital resource format.
subclass of: Media Type
Relation: FileFormat-001
relation: FileFormat-001
date: 2008-01-14

File
subclass of: http://lodlaundromat.org/.well-known/genid/samples/jena///predicate//fe8d8faed6702d7784e1ccba87e71ab5/d3e700bc1857a8001f8ca87e5b965b3a#4
subclass of: Thing
subclass of: http://lodlaundromat.org/.well-known/genid/samples/jena///predicate//fe8d8faed6702d7784e1ccba87e71ab5/d3e700bc1857a8001f8ca87e5b965b3a#7
subclass of: Resource
type: Class
comment: File is a general class that represents computer files/documents of any kind.
disjoint with: Data Item
subclass of: Entity

topic
domain: Thing
type: Property
type: ObjectProperty
comment: A topic of some page or document.
domain: Document
range: Thing
inverse of: page
term status: testing
domain: Resource
range: Resource

Data Item
subclass of: http://lodlaundromat.org/.well-known/genid/samples/jena///predicate//fe8d8faed6702d7784e1ccba87e71ab5/d3e700bc1857a8001f8ca87e5b965b3a#4
subclass of: Thing
subclass of: http://lodlaundromat.org/.well-known/genid/samples/jena///predicate//fe8d8faed6702d7784e1ccba87e71ab5/d3e700bc1857a8001f8ca87e5b965b3a#7
subclass of: Resource
type: Class
comment: DataItem is a general concept that represents data items of any kind.
disjoint with: File
subclass of: Entity
subclass of: InformationRealization

IASCCluster
subclass of: Thing
subclass of: Resource
type: Class
comment: Humanitarian sectors and categories of population for achieving more strategic responses and better prioritization of available resources by clarifying the division of labour among organizations, better defining the roles and responsibilities of humanitarian organizations within the sectors, and providing the Humanitarian Coordinator with both a first point of call and a provider of last resort in all the key sectors or areas of activity.

Frequency
subclass of: Resource
Has Version: Frequency-001
issued: 2008-01-14
type: Class
comment: A rate at which something recurs.
Relation: Frequency-001
relation: Frequency-001
date: 2008-01-14

maker
sub property of: contributor
sub property of: Contributor
sub property of: creator
sub property of: Creator
range: Thing
equivalent property: Creator
comment: An agent that made this thing.
term status: stable
domain: Thing
inverse of: made
type: Property
range: Agent
type: ObjectProperty
range: Resource
domain: Resource

Replaces
range: Thing
domain: Thing
Has Version: replaces-003
type: ObjectProperty
note: This term is intended to be used with non-literal values as defined in the DCMI Abstract Model (http://dublincore.org/documents/abstract-model/). As of December 2007, the DCMI Usage Board is seeking a way to express this intention with a formal range declaration.
Date Modified: 2008-01-14
comment: A related resource that is supplanted, displaced, or superseded by the described resource.
sub property of: relation
sub property of: Relation
type: Property
issued: 2000-07-11
Relation: replaces-003
relation: replaces-003
date: 2008-01-14
date: 2000-07-11
domain: Resource
range: Resource

ServiceAvailable
subclass of: Resource
subclass of: Thing
type: Class
comment: ServiceAvailable is an abstract term that indicates availability of different life saving and sustaining services in a disaster struck location/place.

runs
range: Thing
domain: Thing
type: ObjectProperty
comment: This property refers to the software that was run by a non-human actor (usually a service).
domain: Non-Human Agent
type: Property
domain: Resource
domain: Agent
range: Resource

Agency
subclass of: Thing
subclass of: Resource
type: Class
comment: Agency is an organization that aims to manage a crisis.

GroupViolence
subclass of: Resource
subclass of: Thing
type: Class
comment: GroupViolence is a term used to describe more than one individual engaging in some form of criminal activities.

openid
range: Thing
domain: Thing
sub property of: page
range: Document
type: ObjectProperty
term status: testing
type: Property
domain: Agent
type: InverseFunctionalProperty
sub property of: is primary topic of
comment: An OpenID for an Agent.
range: Resource
domain: Resource

NeedsResponse3W
subclass of: Thing
subclass of: Resource
type: Class
comment: Humanitarian needs and response related activities.

yielded by
range: Thing
domain: Thing
type: ObjectProperty
comment: This property is deprecated and will be removed from the Provenance Vocabulary in the next revision. prv:yieldedBy was deprecated in the process of making the Provenance Vocabulary a specialization of W3C's PROV-O. Hence, use prov:wasGeneratedBy instead.
type: DeprecatedProperty
type: Property
domain: Resource
range: Resource

ShelterNeeded
subclass of: Resource
subclass of: Thing
type: Class
comment: ShelterNeeded is a term used to indicate number of emergency life saving basic structures like tents and tarpaulins.
comment: ShelterNeeded records information regarding additional shelter needs as a part of planned relief distribution processes.

AidManipulation
subclass of: Resource
subclass of: Thing
type: Class
comment: AidManipulation.

executed at
type: Property
type: DeprecatedProperty
comment: This property has been renamed to prv:completedAt. Hence, prv:performedAt is deprecated and will be removed from the Provenance Vocabulary in the next revision.
type: DatatypeProperty

FoodDistributionPoint
subclass of: Resource
subclass of: Thing
type: Class
comment: FoodDistributionPoint is a pre-identified location for distributing or transporting food or drink to the affected communities.

retrieved by
range: Thing
domain: Thing
type: ObjectProperty
comment: This property refers to the data access by which an immutable entity has been retrieved from the Web. Each entity that has this property is a Web representation.
type: FunctionalProperty
domain: Data Item
domain: http://lodlaundromat.org/.well-known/genid/samples/jena///predicate//fe8d8faed6702d7784e1ccba87e71ab5/d3e700bc1857a8001f8ca87e5b965b3a#4
range: Data Access
sub property of: wasGeneratedBy
type: Property
range: Resource
domain: Resource
domain: Entity
range: http://lodlaundromat.org/.well-known/genid/samples/jena///predicate//fe8d8faed6702d7784e1ccba87e71ab5/d3e700bc1857a8001f8ca87e5b965b3a#3
range: Activity
range: http://lodlaundromat.org/.well-known/genid/samples/jena///predicate//fe8d8faed6702d7784e1ccba87e71ab5/d3e700bc1857a8001f8ca87e5b965b3a#2

Media Type or Extent
subclass of: Resource
Has Version: MediaTypeOrExtent-001
issued: 2008-01-14
type: Class
comment: A media type or extent.
Relation: MediaTypeOrExtent-001
relation: MediaTypeOrExtent-001
date: 2008-01-14

Physical Medium
subclass of: Resource
description: Examples include paper, canvas, or DVD.
Has Version: PhysicalMedium-001
issued: 2008-01-14
type: Class
comment: A physical material or carrier.
subclass of: Media Type
Relation: PhysicalMedium-001
relation: PhysicalMedium-001
date: 2008-01-14

AskingToFowardAMessage
subclass of: Resource
subclass of: Thing
type: Class
comment: AskingToFowardAMessage is the term used to forward certain community directed messages using third party sources.

InfectiousHumanDisease
subclass of: Resource
subclass of: Thing
type: Class
comment: InfectiousHumanDisease comprise of clinically evident illness resulting from the infection, presence and growth of pathogenic biological agents in an individual host organism that could also infect others.

NaturalHazards
subclass of: Resource
subclass of: Thing
type: Class
comment: NaturalHazards is a term represent a threat of a naturally occurring event that will have a negative effect on people or the environment .

InternetAccess
subclass of: Resource
subclass of: Thing
type: Class
comment: InternetAccess refers to certain place that can provide internet services.

Online E-commerce Account
subclass of: Resource
subclass of: Thing
type: Class
comment: An online e-commerce account.
subclass of: Online Account
term status: unstable

Provenance Statement
subclass of: Resource
Has Version: ProvenanceStatement-001
issued: 2008-01-14
type: Class
comment: A statement of any changes in ownership and custody of a resource since its creation that are significant for its authenticity, integrity, and interpretation.
Relation: ProvenanceStatement-001
relation: ProvenanceStatement-001
date: 2008-01-14

Jurisdiction
subclass of: Resource
Has Version: Jurisdiction-001
issued: 2008-01-14
type: Class
comment: The extent or range of judicial, law enforcement, or other authority.
subclass of: Location, Period, or Jurisdiction
Relation: Jurisdiction-001
relation: Jurisdiction-001
date: 2008-01-14

Data Publisher
subclass of: Thing
subclass of: Resource
type: Class
comment: DataPublisher is a concept that represents entities such as persons, groups, or organizations who use a data providing service (see concept prv:DataProvidingService) to publish data on the Web.
subclass of: Human Agent
subclass of: Agent

Group
subclass of: Resource
subclass of: Thing
subclass of: Agent
subclass of: Human Agent
type: Class
comment: A class of Agents.
term status: stable

workplace homepage
range: Thing
domain: Thing
type: Property
type: ObjectProperty
comment: A workplace homepage of some person; the homepage of an organization they work for.
domain: Person
range: Document
term status: testing
domain: Agent
domain: Resource
domain: Human Agent
domain: SpatialThing
range: Resource

Who3W
subclass of: Thing
subclass of: Resource
type: Class
comment: Specific agency or Organisation humanitarian response information.

account
range: Thing
domain: Thing
type: Property
type: ObjectProperty
comment: Indicates an account held by this agent.
domain: Agent
range: Online Account
term status: archaic
domain: Resource
range: Resource

involved
range: Thing
domain: Thing
type: ObjectProperty
comment: This property is deprecated and will be removed from the Provenance Vocabulary in the next revision. prv:involvedActor was deprecated in the process of making the Provenance Vocabulary a specialization of W3C's PROV-O. Hence, use prov:wasAssociatedWith instead.
type: DeprecatedProperty
type: Property
domain: Resource
range: Resource

Image
subclass of: Resource
subclass of: Thing
type: Class
comment: An image.
subclass of: Document
term status: testing

Person
subclass of: Resource
subclass of: Thing
subclass of: Agent
comment: A person.
term status: stable
subclass of: SpatialThing
subclass of: Human Agent
disjoint with: Project
type: Class
subclass of: Person
disjoint with: Organization

phone
range: Thing
domain: Thing
type: Property
type: ObjectProperty
comment: A phone, specified using fully qualified tel: URI scheme (refs: http://www.w3.org/Addressing/schemes.html#tel).
term status: testing
domain: Resource
range: Resource

Floods
subclass of: Resource
subclass of: Thing
type: Class
comment: A flood is an overflow of an expanse of water that submerges land.

depicts
domain: Thing
type: Property
type: ObjectProperty
comment: A thing depicted in this representation.
domain: Image
range: Thing
inverse of: depiction
term status: testing
domain: Resource
domain: Document
range: Resource

Data Creation
subclass of: Thing
subclass of: Resource
type: Class
comment: DataCreation is a concept that represents the execution of an activity by which data items have been created.
disjoint with: Data Access
subclass of: Activity

contained in
range: Thing
domain: Thing
type: ObjectProperty
comment: This property refers to a data item that contained a data item. Hence, this property refers to another data item of a larger granularity (e.g. an RDF triple is usually contained in an RDF graph).
domain: Data Item
range: Data Item
type: Property
domain: Resource
domain: http://lodlaundromat.org/.well-known/genid/samples/jena///predicate//fe8d8faed6702d7784e1ccba87e71ab5/d3e700bc1857a8001f8ca87e5b965b3a#4
domain: http://lodlaundromat.org/.well-known/genid/samples/jena///predicate//fe8d8faed6702d7784e1ccba87e71ab5/d3e700bc1857a8001f8ca87e5b965b3a#7
domain: Entity
domain: InformationRealization
range: Resource
range: http://lodlaundromat.org/.well-known/genid/samples/jena///predicate//fe8d8faed6702d7784e1ccba87e71ab5/d3e700bc1857a8001f8ca87e5b965b3a#4
range: http://lodlaundromat.org/.well-known/genid/samples/jena///predicate//fe8d8faed6702d7784e1ccba87e71ab5/d3e700bc1857a8001f8ca87e5b965b3a#7
range: Entity
range: InformationRealization

used
range: Thing
domain: Thing
type: ObjectProperty
comment: This property refers to a source data item that has been used during the creation of a data item. Examples for source data are the content of a document used for machine learning, the statements in a knowledge base used to entail a new statement, and the entries in a database used to answer a query. Notice, all source data has provenance; we strongly encourage to describe this provenance as well, at least as far as available information permits.
domain: Data Creation
range: Data Item
sub property of: used
type: Property
range: Resource
domain: Resource
domain: Activity
range: http://lodlaundromat.org/.well-known/genid/samples/jena///predicate//fe8d8faed6702d7784e1ccba87e71ab5/d3e700bc1857a8001f8ca87e5b965b3a#4
range: http://lodlaundromat.org/.well-known/genid/samples/jena///predicate//fe8d8faed6702d7784e1ccba87e71ab5/d3e700bc1857a8001f8ca87e5b965b3a#7
range: Entity
range: InformationRealization

PortOpen
subclass of: Resource
subclass of: Thing
type: Class
comment: PortOpen is the term that indicate a port opening of regular business for receiving humanitarian relief materials.

alternate
range: Thing
domain: Thing
type: ObjectProperty
type: Property
member: relrev-properties
term: alternate
comment: alternate designates alternate versions for a resource.
domain: Resource
range: Resource

Cluster1Shelter
subclass of: Resource
subclass of: Thing
type: Class
comment: Inter Agency Standing Committee Emergency Shelter related agency specific activities. The Shelter Cluster is co-chaired by IFRC and UNHCR at the global level. IFRC is convener of the Emergency Shelter Cluster in disaster situations while UNHCR leads the Emergency Shelter Cluster in the area of conflict generated IDPs (Internally Displaced Persons). In addition to IFRC and UNHCR, participants in the Global Shelter Cluster include: ACTED, Archi-Urgent, Article 25, Care UK, CHF, CRS, DFID, Habitat for Humanity, IOM, Medair, NRC, OFDA, Oxfam GB, ProAct, ProVention, RedR, Relief International, RICS, Save The Children UK, Shelter Centre, SKAT, UN Habitat, UN OCHA, UNRWA and World Vision. (source: sheltercluster.org, accessed on 12 Feb 2012)

ShelterNFIItems
subclass of: Thing
subclass of: Resource
type: Class
comment: ShelterNFIItems define Shelter Cluster related humanitarian relief items (e.g. tents, tarpulins).

license
range: Thing
domain: Thing
type: ObjectProperty
type: Property
member: relrev-properties
term: license
comment: license refers to a resource that defines the associated license.
domain: Resource
range: Resource

Conforms To
range: Thing
domain: Thing
issued: 2001-05-21
type: ObjectProperty
Date Modified: 2008-01-14
range: Standard
sub property of: relation
comment: An established standard to which the described resource conforms.
Has Version: conformsTo-003
sub property of: Relation
type: Property
Relation: conformsTo-003
relation: conformsTo-003
date: 2008-01-14
date: 2001-05-21
domain: Resource
range: Resource

PublicHealth
subclass of: Resource
subclass of: Thing
type: Class
comment: PublicHealth is a term that deals with overall health related issues, conerns and initiatives for or in a community .

TheftOfAid
subclass of: Resource
subclass of: Thing
type: Class
comment: TheftOfAid is a term that indicate a form of criminal activity when unknown person(s) steal the relief distribution materials either from gowdown or relief distribution points.

current project
domain: Thing
type: Property
type: ObjectProperty
comment: A current project this person works on.
domain: Person
range: Thing
term status: testing
domain: Agent
domain: Resource
domain: Human Agent
domain: SpatialThing
range: Resource

Method of Accrual
subclass of: Resource
Has Version: MethodOfAccrual-001
issued: 2008-01-14
type: Class
comment: A method by which resources are added to a collection.
Relation: MethodOfAccrual-001
relation: MethodOfAccrual-001
date: 2008-01-14

WaterShortage
subclass of: Resource
subclass of: Thing
type: Class
comment: Watershortage is a term used to refer to the situations that water resources can not meet human demand.

RubbleRemoval
subclass of: Resource
subclass of: Thing
type: Class
comment: RubbleRemoval is a term about the agreed upon and systamatic disopsal of of broken stone, of irregular size, shape and texture from a locaktion with totally damaged or partially damaged infrastructures.

MedicalEmergency
subclass of: Resource
subclass of: Thing
type: Class
comment: A medical emergency is an injury that is acute and poses an immediate risk to a person's life or long term health.

MedicalEmergency
subclass of: Resource
subclass of: Thing
type: Class
comment: High possibility of loss resulting from the occurrence of the phenomenon.

CompromisedBridge
subclass of: Resource
subclass of: Thing
type: Class
comment: CompromisedBridge is a partially or completely damaged bridge that can no longer be used for transporting people or relief materials.

used by
range: Thing
domain: Thing
type: ObjectProperty
comment: This property refers to a data publisher who used a data providing services at the time the provenance description refers to.
domain: Data Providing Service
range: Data Publisher
sub property of: actedOnBehalfOf
type: Property
range: Resource
domain: Resource
domain: Agent
domain: Non-Human Agent
range: Human Agent
range: Agent

HealthOfWomen
subclass of: Resource
subclass of: Thing
type: Class
comment: HealthOfWomen is a term used to include all the health issues related to female gender.

Riot
subclass of: Resource
subclass of: Thing
type: Class
comment: A riot is a form of civil disorder characterized often by disorganized groups lashing out in a sudden and intense rash of violence against authority, property or people.

PeopleTrapped
subclass of: Resource
subclass of: Thing
type: Class
comment: People found in dangerous stituation might not be able to escape from the place they are.

schoolHomepage
range: Thing
domain: Thing
type: Property
type: ObjectProperty
comment: A homepage of a school attended by the person.
domain: Person
range: Document
term status: testing
domain: Agent
domain: Resource
domain: Human Agent
domain: SpatialThing
range: Resource

ShelterResponse
subclass of: Resource
subclass of: Thing
type: Class
comment: ShelterResponse is related to activities defining Shelter Clusters' humanitarian response in an emergency.

AffectedPopulation
subclass of: Resource
subclass of: Thing
type: Class
comment: AffectedPopulation is a group of disaster affecgted people in need of humanitarian support.

Organization
subclass of: Resource
subclass of: Agent
subclass of: Thing
type: Class
term status: stable
subclass of: Human Agent
disjoint with: Person
disjoint with: Document
comment: An organization.

Policy
subclass of: Resource
Has Version: Policy-001
issued: 2008-01-14
type: Class
comment: A plan or course of action by an authority, intended to influence and determine decisions, actions, and other matters.
Relation: Policy-001
relation: Policy-001
date: 2008-01-14

Deaths
subclass of: Resource
subclass of: Thing
type: Class
comment: Deaths are the termination of the biological functions that sustain a living organism.

Method of Instruction
subclass of: Resource
Has Version: MethodOfInstruction-001
issued: 2008-01-14
type: Class
comment: A process that is used to engender knowledge, attitudes, and skills.
Relation: MethodOfInstruction-001
relation: MethodOfInstruction-001
date: 2008-01-14

accessed
range: Thing
domain: Thing
type: ObjectProperty
comment: This property refers to the Web resource that has been accessed during the execution of a data access. More precisely, the request of the referenced Web resource resulted in retrieving the representation that has been retrieved by the corresponding prv:DataAccess execution.
domain: Data Access
range: WebResource
type: Property
domain: Resource
domain: http://lodlaundromat.org/.well-known/genid/samples/jena///predicate//fe8d8faed6702d7784e1ccba87e71ab5/d3e700bc1857a8001f8ca87e5b965b3a#3
domain: Activity
domain: http://lodlaundromat.org/.well-known/genid/samples/jena///predicate//fe8d8faed6702d7784e1ccba87e71ab5/d3e700bc1857a8001f8ca87e5b965b3a#2
range: Resource

operated by
range: Thing
domain: Thing
type: ObjectProperty
comment: This property refers to a human agent who was operating a non-human agent. For instance, a service provider operates a data providing service (see concept prv:DataProvidingService). Another example is a human agent who operates a non-human data creating agent.
domain: Non-Human Agent
range: Human Agent
sub property of: actedOnBehalfOf
type: Property
range: Resource
domain: Resource
domain: Agent
range: Agent

focus
domain: Thing
type: Property
type: ObjectProperty
comment: The underlying or 'focal' entity associated with some SKOS-described concept.
domain: Concept
range: Thing
term status: testing
domain: Resource
range: Resource

Size or Duration
subclass of: Resource
description: Examples include a number of pages, a specification of length, width, and breadth, or a period in hours, minutes, and seconds.
Has Version: SizeOrDuration-001
issued: 2008-01-14
type: Class
comment: A dimension or extent, or a time taken to play or execute.
subclass of: Media Type or Extent
Relation: SizeOrDuration-001
relation: SizeOrDuration-001
date: 2008-01-14

past project
domain: Thing
type: Property
type: ObjectProperty
comment: A project this person has previously worked on.
domain: Person
range: Thing
term status: testing
domain: Agent
domain: Resource
domain: Human Agent
domain: SpatialThing
range: Resource

completed at
sub property of: endedAtTime
type: FunctionalProperty
comment: This property refers to the time an activity has been completed.
type: DatatypeProperty
equivalent property: endedAtTime
type: Property

made
domain: Thing
type: Property
type: ObjectProperty
comment: Something that was made by this agent.
domain: Agent
range: Thing
inverse of: maker
term status: stable
domain: Resource
range: Resource

topic_interest
domain: Thing
type: Property
type: ObjectProperty
comment: A thing of interest to this person.
domain: Agent
range: Thing
term status: testing
domain: Resource
range: Resource

ShelterAgency
subclass of: Thing
subclass of: Resource
type: Class
comment: ShelterAgency is a Shelter Cluster related humanitarian partner or a specific organization involved in shelter related humanitarian response.

Non-Human Actor
subclass of: Resource
subclass of: Thing
type: Class
type: DeprecatedClass
comment: This class is deprecated and will be removed from the Provenance Vocabulary in the next revision. prv:NonHumanActor was renamed to prv:NonHumanAgent in the process of making the Provenance Vocabulary a specialization of W3C's PROV-O. Hence, use prv:NonHumanAgent instead.

created by
type: Property
range: Thing
domain: Thing
type: ObjectProperty
comment: This property refers to the creation of a data item (or a file that serializes data items).
domain: http://lodlaundromat.org/.well-known/genid/samples/jena///predicate//fe8d8faed6702d7784e1ccba87e71ab5/d3e700bc1857a8001f8ca87e5b965b3a#7
range: Data Creation
sub property of: wasGeneratedBy
property chain axiom: http://lodlaundromat.org/.well-known/genid/samples/jena///predicate//fe8d8faed6702d7784e1ccba87e71ab5/d3e700bc1857a8001f8ca87e5b965b3a#10
range: Resource
domain: Resource
range: Activity

EarthquakeAndAftershock
subclass of: Resource
subclass of: Thing
type: Class
comment: An earthquake is the result of a sudden release of energy in the Earth's crust that creates seismic waves, and an aftershock is an earthquake that occurs after a previous earthquake, the mainshock.

immediately preceded by
sub property of: relation
sub property of: Relation
range: Thing
domain: Thing
type: ObjectProperty
comment: This property may be used to make the relationship between different version of a data item explicit. More precisely, this property refers to an immediately preceding version of a data item; hence, the new version (i.e. the subject) has been created using the old version (i.e. the object). We strongly encourage to also describe this creation of the new version explicitly.
domain: Data Item
range: Data Item
sub property of: http://lodlaundromat.org/.well-known/genid/samples/jena///predicate//fe8d8faed6702d7784e1ccba87e71ab5/d3e700bc1857a8001f8ca87e5b965b3a#1
sub property of: Replaces
type: Property
range: Resource
domain: Resource
domain: http://lodlaundromat.org/.well-known/genid/samples/jena///predicate//fe8d8faed6702d7784e1ccba87e71ab5/d3e700bc1857a8001f8ca87e5b965b3a#4
domain: http://lodlaundromat.org/.well-known/genid/samples/jena///predicate//fe8d8faed6702d7784e1ccba87e71ab5/d3e700bc1857a8001f8ca87e5b965b3a#7
domain: Entity
domain: InformationRealization
range: http://lodlaundromat.org/.well-known/genid/samples/jena///predicate//fe8d8faed6702d7784e1ccba87e71ab5/d3e700bc1857a8001f8ca87e5b965b3a#4
range: http://lodlaundromat.org/.well-known/genid/samples/jena///predicate//fe8d8faed6702d7784e1ccba87e71ab5/d3e700bc1857a8001f8ca87e5b965b3a#7
range: Entity
range: InformationRealization

Emergency
subclass of: Resource
subclass of: Thing
type: Class
comment: Emergency is a situation that poses an immediate crisis to human, life, health, property or environment.

Cluster3WASH
subclass of: Resource
subclass of: Thing
type: Class
comment: Inter Agency Standing Committee Emergency Water Sanitation and Hygine related agency specific activities. UNICEF is the global cluster lead for WASH.

based near
range: Thing
domain: Thing
type: Property
type: ObjectProperty
comment: A location that something is based near, for some broadly human notion of near.
domain: SpatialThing
range: SpatialThing
term status: testing
domain: Resource
range: Resource

Looting
subclass of: Resource
subclass of: Thing
type: Class
comment: Looting is term that indicate a form of criminal activity when disaster affected people forcefully take away the relief distribution materials.

primary topic
domain: Thing
domain: Document
type: FunctionalProperty
range: Thing
type: Property
term status: stable
type: ObjectProperty
comment: The primary topic of some page or document.
inverse of: is primary topic of
domain: Resource
range: Resource

Period of Time
subclass of: Resource
Has Version: PeriodOfTime-001
issued: 2008-01-14
type: Class
comment: An interval of time that is named or defined by its start and end dates.
subclass of: Location, Period, or Jurisdiction
Relation: PeriodOfTime-001
relation: PeriodOfTime-001
date: 2008-01-14

WaterShortage
subclass of: Resource
subclass of: Thing
type: Class
comment: Abstract term to describe the collection of which agency is doing what activities and where.

is primary topic of
range: Thing
comment: A document that this thing is the primary topic of.
domain: Thing
sub property of: page
type: InverseFunctionalProperty
range: Document
type: Property
term status: stable
inverse of: primary topic
type: ObjectProperty
range: Resource
domain: Resource

Rights Statement
subclass of: Resource
Has Version: RightsStatement-001
issued: 2008-01-14
type: Class
comment: A statement about the intellectual property rights (IPR) held in or over a Resource, a legal document giving official permission to do something with a resource, or a statement about access rights.
Relation: RightsStatement-001
relation: RightsStatement-001
date: 2008-01-14

accessed
range: Thing
domain: Thing
type: ObjectProperty
comment: This property refers to the service that provided the Web representation during the execution of a data access.
domain: Data Access
range: Data Providing Service
sub property of: wasAssociatedWith
type: Property
range: Resource
domain: Resource
domain: http://lodlaundromat.org/.well-known/genid/samples/jena///predicate//fe8d8faed6702d7784e1ccba87e71ab5/d3e700bc1857a8001f8ca87e5b965b3a#3
domain: Activity
domain: http://lodlaundromat.org/.well-known/genid/samples/jena///predicate//fe8d8faed6702d7784e1ccba87e71ab5/d3e700bc1857a8001f8ca87e5b965b3a#2
range: Agent
range: Non-Human Agent

CommunicationLinesDown
subclass of: Resource
subclass of: Thing
type: Class
comment: CommunicationLinesDown indicates that a mobile or a landline phone in ceratain area will not work because of the problem in the communication wired poles.

image
range: Thing
domain: Thing
type: Property
type: ObjectProperty
comment: An image that can be used to represent some thing (ie. those depictions which are particularly representative of something, eg. one's photo on a homepage).
domain: Person
range: Image
sub property of: depiction
term status: testing
range: Resource
range: Document
domain: Resource
domain: Agent
domain: Human Agent
domain: SpatialThing

Project
subclass of: Resource
subclass of: Thing
type: Class
comment: A project (a collective endeavour of some kind).
disjoint with: Person
disjoint with: Document
term status: testing

ChronicCareNeeds
subclass of: Resource
subclass of: Thing
type: Class
comment: ChronicCareNeeds refers to the requirement of medical care which addresses preexisting or long term illness.

VitalLines
subclass of: Resource
subclass of: Thing
type: Class
comment: Vitallines is an abstract term that refer to particulars that could directly impact human lives.

http://lodlaundromat.org/.well-known/genid/samples/jena///predicate//fe8d8faed6702d7784e1ccba87e71ab5/d3e700bc1857a8001f8ca87e5b965b3a#2
subclass of: Resource
subclass of: Thing
type: Class
type: Restriction
on property: accessed
max cardinality: 1

FeedingCentersAvailable
subclass of: Resource
subclass of: Thing
type: Class
comment: FeedingCentersAvailable is a term that defines a location of a facility which supports providing basic life saving foods to infants and lactating mothers.

Location
subclass of: Resource
Has Version: Location-001
issued: 2008-01-14
type: Class
comment: A spatial region or named place.
subclass of: Location, Period, or Jurisdiction
Relation: Location-001
relation: Location-001
date: 2008-01-14

WaterDistributionPoint
subclass of: Resource
subclass of: Thing
type: Class
comment: WaterDistributionPoint is a location for distributing or transporting daily water to the disaster affected communities.

AnimalIllnessOrDeath
subclass of: Resource
subclass of: Thing
type: Class
comment: AnimalIllnessOrDeath refers to the illness or death of animals caused by a disaster highlighting the possibility of spread of disease because of direct or indirect contamination.

PowerOutage
subclass of: Resource
subclass of: Thing
type: Class
comment: A PowerOutage is a term which refers to electrical power failure, which means a short- or long-term loss of the electric power to an area.

Human Actor
subclass of: Resource
subclass of: Thing
type: Class
type: DeprecatedClass
comment: This class is deprecated and will be removed from the Provenance Vocabulary in the next revision. prv:HumanActor was renamed to prv:HumanAgent in the process of making the Provenance Vocabulary a specialization of W3C's PROV-O. Hence, use prv:HumanAgent instead.

ContaminatedWater
subclass of: Resource
subclass of: Thing
type: Class
comment: Undrinkable Water is water that is regarded unfit/unhealthy to drink for both humans and animals.

Online Gaming Account
subclass of: Resource
subclass of: Thing
type: Class
comment: An online gaming account.
subclass of: Online Account
term status: unstable

Document
subclass of: Resource
subclass of: Thing
type: Class
comment: A document.
disjoint with: Organization
disjoint with: Project
term status: testing

UnstableStructure
subclass of: Resource
subclass of: Thing
type: Class
comment: UnstableStructure is a term that describe a partially damaged bulidings/structures which is still standing but uninhabitable.

tipjar
range: Thing
domain: Thing
type: Property
type: ObjectProperty
comment: A tipjar document for this agent, describing means for payment and reward.
domain: Agent
range: Document
sub property of: page
term status: testing
range: Resource
domain: Resource

publications
range: Thing
domain: Thing
type: Property
type: ObjectProperty
comment: A link to the publications of this person.
domain: Person
range: Document
term status: testing
domain: Agent
domain: Resource
domain: Human Agent
domain: SpatialThing
range: Resource

Fire
subclass of: Resource
subclass of: Thing
type: Class
comment: Fire is an uncontrolled burning that has the potential to cause physical damage on human life, health, property or ecology.

serialized by
range: Thing
domain: Thing
type: ObjectProperty
comment: This property refers to a file that serialized a data item.
domain: Data Item
range: File
type: Property
domain: Resource
domain: http://lodlaundromat.org/.well-known/genid/samples/jena///predicate//fe8d8faed6702d7784e1ccba87e71ab5/d3e700bc1857a8001f8ca87e5b965b3a#4
domain: http://lodlaundromat.org/.well-known/genid/samples/jena///predicate//fe8d8faed6702d7784e1ccba87e71ab5/d3e700bc1857a8001f8ca87e5b965b3a#7
domain: Entity
domain: InformationRealization
range: Resource
range: http://lodlaundromat.org/.well-known/genid/samples/jena///predicate//fe8d8faed6702d7784e1ccba87e71ab5/d3e700bc1857a8001f8ca87e5b965b3a#4
range: http://lodlaundromat.org/.well-known/genid/samples/jena///predicate//fe8d8faed6702d7784e1ccba87e71ab5/d3e700bc1857a8001f8ca87e5b965b3a#7
range: Entity

Cluster2Food
subclass of: Resource
subclass of: Thing
type: Class
comment: Inter Agency Standing Committee Emergency Food related agency specific activities. World Food Programme (WFP) is the global cluster lead for Food.

ShelterItems
subclass of: Resource
subclass of: Thing
type: Class
comment: ShelterItems include, but are not limited to, tents, tarpulins distributed or stocked by shelter response humanitarian agencies.

Landslides
subclass of: Resource
subclass of: Thing
type: Class
comment: A landslide is a geological phenomenon which includes a wide range of ground movement.

depiction
range: Thing
type: Property
type: ObjectProperty
comment: A depiction of some thing.
domain: Thing
range: Image
inverse of: depicts
term status: testing
domain: Resource
range: Resource
range: Document

Agent
subclass of: Thing
subclass of: Resource
subclass of: Agent
type: Class
comment: An agent (eg. person, group, software or physical artifact).
equivalent class: Agent
term status: stable

Standard
subclass of: Resource
Has Version: Standard-001
issued: 2008-01-14
type: Class
comment: A basis for comparison; a reference point against which other things can be evaluated.
Relation: Standard-001
relation: Standard-001
date: 2008-01-14

Response3W
subclass of: Resource
subclass of: Thing
type: Class
comment: Cluster Specific humanitarian response information.

IDPConcentration
subclass of: Resource
subclass of: Thing
type: Class
comment: IDPConcentration refers to the act of internally displaced people gathering in a certain location, which could eventually turn into an IDP camp.

FuelShortage
subclass of: Resource
subclass of: Thing
type: Class
comment: FuelShortage is a lack of minimal cooking or other fuel that a person need on a daily basis.

MissingPersons
subclass of: Resource
subclass of: Thing
type: Class
comment: MissingPersons are persons whose whereabouts are unknown after sudden onset of disaster.

Execution
subclass of: Resource
subclass of: Thing
type: Class
type: DeprecatedClass
comment: This class is deprecated and will be removed from the Provenance Vocabulary in the next revision. prv:Execution was deprecated in the process of making the Provenance Vocabulary a specialization of W3C's PROV-O. Hence, use prov:Activity instead.

performed by
type: Property
range: Thing
domain: Thing
type: ObjectProperty
comment: This property refers to an agent that/who performed an activity.
sub property of: wasAssociatedWith
range: Resource
domain: Resource

thumbnail
range: Thing
domain: Thing
type: Property
type: ObjectProperty
comment: A derived thumbnail image.
domain: Image
range: Image
term status: testing
domain: Resource
domain: Document
range: Resource
range: Document

tab
type: Property
comment: A grouping label providing a mechanism for selecting the tab content that is to be rendered to the user.

application
type: Property
comment: A region declared as a web application, as opposed to a web document.

Date Created
sub property of: date
range: Literal
Date Modified: 2008-01-14
type: DatatypeProperty
comment: Date of creation of the resource.
type: Property
Has Version: created-003
issued: 2000-07-11
sub property of: Date
Relation: created-003
relation: created-003
date: 2008-01-14
date: 2000-07-11
range: Resource

familyName
type: Property
type: DatatypeProperty
comment: The family name of some person.
domain: Person
range: Literal
term status: testing
domain: Agent
domain: Resource
domain: Thing
domain: Human Agent
domain: SpatialThing
range: Resource

Skype ID
type: Property
type: DatatypeProperty
comment: A Skype ID
domain: Agent
range: Literal
sub property of: nickname
term status: testing
domain: Resource
domain: Thing
range: Resource

Management of a Crisis Vocabulary namespace
created by: http://lodlaundromat.org/.well-known/genid/samples/jena///predicate//fe8d8faed6702d7784e1ccba87e71ab5/9445b29090531f162805053b8f46ccee#1
Date Created: 2012-01-29T20:30:00Z
creator: Tomi Kauppinen
created by: http://lodlaundromat.org/.well-known/genid/fe8d8faed6702d7784e1ccba87e71ab5#1
type: Data Item
type: Ontology
was generated by: http://lodlaundromat.org/.well-known/genid/samples/jena///predicate//fe8d8faed6702d7784e1ccba87e71ab5/9445b29090531f162805053b8f46ccee#1
was generated by: http://lodlaundromat.org/.well-known/genid/fe8d8faed6702d7784e1ccba87e71ab5#1
type: http://lodlaundromat.org/.well-known/genid/samples/jena///predicate//fe8d8faed6702d7784e1ccba87e71ab5/d3e700bc1857a8001f8ca87e5b965b3a#7
type: Thing
date: 2012-01-29T20:30:00Z
contributor: Tomi Kauppinen
Contributor: Tomi Kauppinen
maker: Tomi Kauppinen
type: Entity
type: InformationRealization
type: http://lodlaundromat.org/.well-known/genid/samples/jena///predicate//fe8d8faed6702d7784e1ccba87e71ab5/d3e700bc1857a8001f8ca87e5b965b3a#4

Accrual Method
Has Version: accrualMethod-003
issued: 2005-06-13
Date Modified: 2010-10-11
type: Property
comment: The method by which items are added to a collection.
domain: Collection
range: Method of Accrual
Relation: accrualMethod-003
relation: accrualMethod-003
date: 2010-10-11
date: 2005-06-13
domain: Resource
range: Resource

tablist
type: Property
comment: A list of tab elements, which are references to tabpanel elements.

search
type: Property
member: role-properties
comment: indicates that the section provides a search facility.

subsection
type: Property
member: relrev-properties
term: subsection
comment: subsection refers to a resource serving as a subsection in a collection.

hasNFIItems
type: DataProperty
comment: hasNFIItems indicates the name or a type of Non Food Items.
range: NFIItems
range: string
type: Property
range: Resource
range: Thing

Accrual Periodicity
Has Version: accrualPeriodicity-003
issued: 2005-06-13
Date Modified: 2010-10-11
type: Property
comment: The frequency with which items are added to a collection.
domain: Collection
range: Frequency
Relation: accrualPeriodicity-003
relation: accrualPeriodicity-003
date: 2010-10-11
date: 2005-06-13
domain: Resource
range: Resource

Description
comment: An account of the resource.
description: Description may include but is not limited to: an abstract, a table of contents, a graphical representation, or a free-text account of the resource.
type: DatatypeProperty
Date Modified: 2008-01-14
Has Version: descriptionT-001
sub property of: description
issued: 2008-01-14
type: Property
Relation: descriptionT-001
relation: descriptionT-001
date: 2008-01-14

group
type: Property
comment: A set of user interface objects which are not intended to be included in a page summary or table of contents by assistive technologies.

radiogroup
type: Property
comment: A group of radio buttons.

treegrid
type: Property
comment: A grid whose rows can be expanded and collapsed in the same manner as for a tree.

UDC
Has Version: UDC-003
issued: 2000-07-11
Date Modified: 2008-01-14
type: VocabularyEncodingScheme
comment: The set of conceptual resources specified by the Universal Decimal Classification.
Relation: UDC-003
relation: UDC-003
date: 2008-01-14
date: 2000-07-11

appendix
type: Property
member: relrev-properties
term: appendix
comment: appendix refers to a resource serving as an appendix in a collection.

help
type: Property
member: relrev-properties
term: help
comment: help refers to a resource offering help.

Is Replaced By
type: Property
sub property of: relation
note: This term is intended to be used with non-literal values as defined in the DCMI Abstract Model (http://dublincore.org/documents/abstract-model/). As of December 2007, the DCMI Usage Board is seeking a way to express this intention with a formal range declaration.
Date Modified: 2008-01-14
issued: 2000-07-11
sub property of: Relation
Has Version: isReplacedBy-003
comment: A related resource that supplants, displaces, or supersedes the described resource.
Relation: isReplacedBy-003
relation: isReplacedBy-003
date: 2008-01-14
date: 2000-07-11

tentDistbn
type: DataProperty
comment: tentDistbn relates the amount (count) of shelter items being offered.
range: ShelterOffered
range: int
type: Property
range: Resource

treeitem
type: Property
comment: An option item of a tree. This is an element within a tree that may be expanded or collapsed if it contains a sub-level group of treeitems.

title
type: Property
type: DatatypeProperty
comment: Title (Mr, Mrs, Ms, Dr. etc)
term status: testing

Has Part
type: Property
Date Modified: 2008-01-14
issued: 2000-07-11
comment: A related resource that is included either physically or logically in the described resource.
note: This term is intended to be used with non-literal values as defined in the DCMI Abstract Model (http://dublincore.org/documents/abstract-model/). As of December 2007, the DCMI Usage Board is seeking a way to express this intention with a formal range declaration.
sub property of: relation
Has Version: hasPart-003
sub property of: Relation
Relation: hasPart-003
relation: hasPart-003
date: 2008-01-14
date: 2000-07-11

funded by
type: Property
type: ObjectProperty
comment: An organization funding a project or person.
domain: Thing
range: Thing
term status: archaic
domain: Resource
range: Resource

radio
type: Property
comment: A checkable input in a group of radio roles, only one of which can be checked at a time.

combobox
type: Property
comment: A presentation of a select; usually similar to a textbox where users can type ahead to select an option, or type to enter arbitrary text as a new item in the list. Also see listbox.

affectedby
type: DataProperty
comment: affectedby indicates disaster which has influence on population.
comment: affectedby indicates the relation of people being affected by certain disaster.
range: AffectedPopulation
range: NaturalHazard
range: NaturalHazards
range: ShelterOffered
type: Property
range: Resource
range: Thing

title
type: DataProperty
comment: description is about the content of an incident.
domain: Incident
range: string
type: Property
domain: Resource
domain: Thing
range: Resource

lastName
type: Property
type: DatatypeProperty
comment: The last name of a person.
domain: Person
range: Literal
term status: testing
domain: Agent
domain: Resource
domain: Thing
domain: Human Agent
domain: SpatialThing
range: Resource

Relation
note: This term is intended to be used with non-literal values as defined in the DCMI Abstract Model (http://dublincore.org/documents/abstract-model/). As of December 2007, the DCMI Usage Board is seeking a way to express this intention with a formal range declaration.
comment: A related resource.
description: Recommended best practice is to identify the related resource by means of a string conforming to a formal identification system.
Has Version: relationT-001
type: Property
sub property of: relation
issued: 2008-01-14
Date Modified: 2008-01-14
Relation: relationT-001
relation: relationT-001
date: 2008-01-14

Is Part Of
issued: 2000-07-11
type: Property
sub property of: relation
sub property of: Relation
Date Modified: 2008-01-14
note: This term is intended to be used with non-literal values as defined in the DCMI Abstract Model (http://dublincore.org/documents/abstract-model/). As of December 2007, the DCMI Usage Board is seeking a way to express this intention with a formal range declaration.
Has Version: isPartOf-003
comment: A related resource in which the described resource is physically or logically included.
Relation: isPartOf-003
relation: isPartOf-003
date: 2008-01-14
date: 2000-07-11

belongsToCluster
type: DataProperty
comment: belongsToCluster indicates the organisation which belongs to a specific IASC cluster for example, emergency Shelter cluster or Food Cluster.
range: IASCCluster
range: moac:Who3W
type: Property
range: Resource
range: Thing

Surname
type: Property
type: DatatypeProperty
comment: The surname of some person.
domain: Person
range: Literal
term status: archaic
domain: Agent
domain: Resource
domain: Thing
domain: Human Agent
domain: SpatialThing
range: Resource

document
type: Property
comment: A region containing related information that is declared as document content, as opposed to a web application.

menubar
type: Property
comment: A presentation of menu that usually remains visible and is usually presented horizontally.

atLocation
type: DataProperty
comment: atGeoLocationLatitude is a data property used to link location or "Where" with specific latitude in the form of decimal degree.
domain: Where3W
range: float
type: Property
domain: Resource
domain: Thing
range: Resource

Table Of Contents
Has Version: tableOfContents-003
issued: 2000-07-11
Date Modified: 2008-01-14
type: Property
comment: A list of subunits of the resource.
sub property of: description
sub property of: Description
Relation: tableOfContents-003
relation: tableOfContents-003
date: 2008-01-14
date: 2000-07-11

RFC 5646
description: RFC 5646 obsoletes RFC 4646.
Has Version: RFC5646-001
issued: 2010-10-11
type: Datatype
comment: The set of tags constructed according to RFC 5646 for the identification of languages.
Relation: RFC5646-001
relation: RFC5646-001
date: 2010-10-11
type: Class

slider
type: Property
comment: A user input where the user selects a value from within a given range.

Date Copyrighted
range: Literal
type: Property
sub property of: Date
comment: Date of copyright.
sub property of: date
issued: 2002-07-13
Date Modified: 2008-01-14
Has Version: dateCopyrighted-002
Relation: dateCopyrighted-002
relation: dateCopyrighted-002
date: 2008-01-14
date: 2002-07-13
range: Resource

Coverage
issued: 2008-01-14
comment: The spatial or temporal topic of the resource, the spatial applicability of the resource, or the jurisdiction under which the resource is relevant.
Has Version: coverageT-001
Date Modified: 2008-01-14
sub property of: coverage
type: Property
range: Location, Period, or Jurisdiction
description: Spatial topic and spatial applicability may be a named place or a location specified by its geographic coordinates. Temporal topic may be a named period, date, or date range. A jurisdiction may be a named administrative entity or a geographic place to which the resource applies. Recommended best practice is to use a controlled vocabulary such as the Thesaurus of Geographic Names [TGN]. Where appropriate, named places or time periods can be used in preference to numeric identifiers such as sets of coordinates or date ranges.
Relation: coverageT-001
relation: coverageT-001
date: 2008-01-14
range: Resource

NLM
Has Version: NLM-002
issued: 2005-06-13
Date Modified: 2008-01-14
type: VocabularyEncodingScheme
comment: The set of conceptual resources specified by the National Library of Medicine Classification.
Relation: NLM-002
relation: NLM-002
date: 2008-01-14
date: 2005-06-13

Accrual Policy
Has Version: accrualPolicy-003
issued: 2005-06-13
Date Modified: 2010-10-11
type: Property
comment: The policy governing the addition of items to a collection.
domain: Collection
range: Policy
Relation: accrualPolicy-003
relation: accrualPolicy-003
date: 2010-10-11
date: 2005-06-13
domain: Resource
range: Resource

DNA checksum
type: Property
type: DatatypeProperty
comment: A checksum for the DNA of some thing. Joke.
range: Literal
term status: archaic
range: Resource

title
type: DataProperty
comment: Title is an identifying name given to an incident.
domain: Incident
range: string
type: Property
domain: Resource
domain: Thing
range: Resource

membershipClass
type: Property
type: AnnotationProperty
comment: Indicates the class of individuals that are a member of a Group
term status: unstable

impact
type: DataProperty
comment: Impact is the effect or impression of disaster on population or infrastructure
range: AffectedPopulation
range: InfrastructureDamage
range: NaturalHazard
type: Property
range: Resource
range: Thing

Management of a Crisis (MOAC) Vocabulary Specification
Conforms To: rdfa-syntax
description: Efforts have been made to involve a number of international humanitarian and crowdsourcing volunteering communities to authenticate MOAC usability, functionality and structures. Since, the vocabulary is still evolving, necessary changes based on expert recommendations will be carefully documented and necessary changes will be continuously updated in the same platform.
type: Document
alternate: moac-2012-01-29.rdf
stylesheet: main.css
label: Document that defines the Management of a Crisis Vocabulary
primary topic: Management of a Crisis Vocabulary namespace
Relation: rdfa-syntax
relation: rdfa-syntax
type: Thing
topic: Management of a Crisis Vocabulary namespace

Provenance
description: The statement may include a description of any changes successive custodians made to the resource.
Has Version: provenance-002
issued: 2004-09-20
Date Modified: 2008-01-14
type: Property
comment: A statement of any changes in ownership and custody of the resource since its creation that are significant for its authenticity, integrity, and interpretation.
range: Provenance Statement
Relation: provenance-002
relation: provenance-002
date: 2008-01-14
date: 2004-09-20
range: Resource

plan
type: Property
type: DatatypeProperty
comment: Aplan comment, in the tradition of finger and '.plan' files.
domain: Person
range: Literal
term status: testing
domain: Agent
domain: Resource
domain: Thing
domain: Human Agent
domain: SpatialThing
range: Resource

sha1sum (hex)
type: Property
type: DatatypeProperty
comment: A sha1sum hash, in hex.
domain: Document
term status: unstable
domain: Resource
domain: Thing

Given name
type: Property
type: DatatypeProperty
comment: The given name of some person.
term status: archaic

contents
type: Property
member: relrev-properties
term: contents
comment: contents refers to a resource serving as a table of contents.

LCC
Has Version: LCC-003
issued: 2000-07-11
Date Modified: 2008-01-14
type: VocabularyEncodingScheme
comment: The set of conceptual resources specified by the Library of Congress Classification.
Relation: LCC-003
relation: LCC-003
date: 2008-01-14
date: 2000-07-11

up
type: Property
member: relrev-properties
term: up
comment: up refers to a resource "above" in a hierarchically structured set.

role
type: Property
member: relrev-properties
term: role
comment: role indicates the purpose of the resource. See the XHTML Role Vocabulary for roles in this vocabulary space, and XHTMLROLE for information on extending the collection of roles.
type: Container

http://lodlaundromat.org/.well-known/genid/fe8d8faed6702d7784e1ccba87e71ab5#1
executed at: 2012-01-29T20:30:00Z
performed by: Tomi Kauppinen
type: Data Creation
was associated with: Tomi Kauppinen
type: Thing
type: Activity

Title
type: Property
comment: A name given to the resource.
Date Modified: 2010-10-11
sub property of: title
range: Literal
type: DatatypeProperty
issued: 2008-01-14
Has Version: titleT-002
Relation: titleT-002
relation: titleT-002
date: 2010-10-11
date: 2008-01-14
range: Resource

IMT
Has Version: IMT-004
issued: 2000-07-11
Date Modified: 2008-01-14
type: VocabularyEncodingScheme
comment: The set of media types specified by the Internet Assigned Numbers Authority.
Relation: IMT-004
relation: IMT-004
date: 2008-01-14
date: 2000-07-11

marquee
type: Property
comment: A type of live region where non-essential information changes frequently. Also see log.

Medium
range: Physical Medium
comment: The material or physical carrier of the resource.
domain: Physical Resource
issued: 2000-07-11
type: Property
Has Version: medium-003
sub property of: Format
Date Modified: 2008-01-14
sub property of: format
Relation: medium-003
relation: medium-003
date: 2008-01-14
date: 2000-07-11
range: Media Type or Extent
range: Resource
domain: Resource
range: Media Type

Olaf Hartig
type: Person
type: Thing
type: Agent
type: SpatialThing
type: Human Agent
made: Provenance Vocabulary Core Ontology namespace

glossary
type: Property
member: relrev-properties
term: glossary
comment: glossary refers to a resource providing a glossary of terms.

NFINeededAt
type: DataProperty
comment: NFINeededAt relates "where" Non Food Items response might be necessary.
range: AffectedPopulation
range: Where3W
range: Location
type: Property
range: Location, Period, or Jurisdiction
range: Resource

ICQ chat ID
sub property of: nickname
term status: testing
domain: Agent
range: Literal
comment: An ICQ chat ID
type: InverseFunctionalProperty
type: Property
type: DatatypeProperty
type: ObjectProperty
domain: Resource
domain: Thing
range: Resource

Date Available
comment: Date (often a range) that the resource became or will become available.
issued: 2000-07-11
Has Version: available-003
sub property of: date
Date Modified: 2008-01-14
type: Property
sub property of: Date
range: Literal
Relation: available-003
relation: available-003
date: 2008-01-14
date: 2000-07-11
range: Resource

list
type: Property
comment: A group of non-interactive list items. Also see listbox.

note
type: Property
member: role-properties
comment: indicates the content is parenthetic or ancillary to the main content of the resource.

Has Format
issued: 2000-07-11
Date Modified: 2008-01-14
type: Property
comment: A related resource that is substantially the same as the pre-existing described resource, but in another format.
Has Version: hasFormat-003
sub property of: Relation
note: This term is intended to be used with non-literal values as defined in the DCMI Abstract Model (http://dublincore.org/documents/abstract-model/). As of December 2007, the DCMI Usage Board is seeking a way to express this intention with a formal range declaration.
sub property of: relation
Relation: hasFormat-003
relation: hasFormat-003
date: 2008-01-14
date: 2000-07-11

DDC
Has Version: DDC-003
issued: 2000-07-11
Date Modified: 2008-01-14
type: VocabularyEncodingScheme
comment: The set of conceptual resources specified by the Dewey Decimal Classification.
Relation: DDC-003
relation: DDC-003
date: 2008-01-14
date: 2000-07-11

link
type: Property
comment: An interactive reference to an internal or external resource that, when activated, causes the user agent to navigate to that resource. Also see button.

atLocation
type: DataProperty
comment: GeoLocationLatitude is a data property used to link location or "Where" with specific longitude in the form of decimal degree.
domain: Where3W
range: float
type: Property
domain: Resource
domain: Thing
range: Resource

copyright
type: Property
member: relrev-properties
term: copyright
comment: copyright refers to a copyright statement for the resource.

theme
type: Property
type: ObjectProperty
comment: A theme.
domain: Thing
range: Thing
term status: archaic
domain: Resource
range: Resource

contentinfo
type: Property
member: role-properties
comment: contains meta information about the content on the page or the page as a whole.

involvedIn
type: DataProperty
comment: involvedIn indicates the agency that is involved with humanitarian activities/response in a disaster.
range: ShelterActivity
range: ShelterAgency
range: ShelterResponse
type: Property
range: Resource
range: Thing

RFC 4646
description: RFC 4646 obsoletes RFC 3066.
Has Version: RFC4646-001
issued: 2008-01-14
type: Datatype
comment: The set of tags constructed according to RFC 4646 for the identification of languages.
Relation: RFC4646-001
relation: RFC4646-001
date: 2008-01-14
type: Class

countInStock
type: DataProperty
comment: countInStock indicates the number of items currently stockpiled either at a store or at a distribution location.
range: ShelterNFIItems
range: int
type: Property
range: Resource
range: Thing

Bibliographic Citation
Has Version: bibliographicCitation-002
description: Recommended practice is to include sufficient bibliographic detail to identify the resource as unambiguously as possible.
range: Literal
domain: Bibliographic Resource
comment: A bibliographic reference for the resource.
type: Property
sub property of: identifier
issued: 2003-02-15
Date Modified: 2008-01-14
sub property of: Identifier
Relation: bibliographicCitation-002
relation: bibliographicCitation-002
date: 2008-01-14
date: 2003-02-15
range: Resource
domain: Resource

icon
type: Property
member: relrev-properties
term: icon
comment: icon refers to a resource that represents an icon.

DCMI Box
Has Version: Box-003
issued: 2000-07-11
Date Modified: 2008-01-14
type: Datatype
comment: The set of regions in space defined by their geographic coordinates according to the DCMI Box Encoding Scheme.
Relation: Box-003
relation: Box-003
date: 2008-01-14
date: 2000-07-11
type: Class

DCMI Metadata Terms - other
Date Modified: 2012-06-14
publisher: DCMI
date: 2012-06-14

Temporal Coverage
sub property of: Coverage
Has Version: temporal-003
type: Property
issued: 2000-07-11
Date Modified: 2008-01-14
range: Period of Time
comment: Temporal characteristics of the resource.
sub property of: coverage
Relation: temporal-003
relation: temporal-003
date: 2008-01-14
date: 2000-07-11
range: Location, Period, or Jurisdiction
range: Resource

ISO 639-2
Has Version: ISO639-2-003
issued: 2000-07-11
Date Modified: 2008-01-14
type: Datatype
comment: The three-letter alphabetic codes listed in ISO639-2 for the representation of names of languages.
Relation: ISO639-2-003
relation: ISO639-2-003
date: 2008-01-14
date: 2000-07-11
type: Class

rowheader
type: Property
comment: A cell containing header information for a row in a grid.

button
type: Property
comment: An input that allows for user-triggered actions when clicked or pressed. Also see link.

Date Valid
type: Property
range: Literal
issued: 2000-07-11
sub property of: date
comment: Date (often a range) of validity of a resource.
Date Modified: 2008-01-14
sub property of: Date
Has Version: valid-003
Relation: valid-003
relation: valid-003
date: 2008-01-14
date: 2000-07-11
range: Resource

shelterOfferedAt
type: DataProperty
comment: shelterOfferedAt relates "where" shelter relief agencies provided relief items.
range: ShelterAgency
range: Where3W
range: Location
type: Property
range: Location, Period, or Jurisdiction
range: Resource

RFC 3066
description: RFC 3066 has been obsoleted by RFC 4646.
Has Version: RFC3066-002
issued: 2002-07-13
Date Modified: 2008-01-14
type: Datatype
comment: The set of tags constructed according to RFC 3066 for the identification of languages.
Relation: RFC3066-002
relation: RFC3066-002
date: 2008-01-14
date: 2002-07-13
type: Class

bookmark
type: Property
member: relrev-properties
term: bookmark
comment: bookmark refers to a bookmark - a link to a key entry point within an extended document.

birthday
type: Property
type: FunctionalProperty
type: DatatypeProperty
comment: The birthday of this Agent, represented in mm-dd string form, eg. '12-31'.
domain: Agent
range: Literal
term status: unstable
domain: Resource
domain: Thing
range: Resource

hasShelterItems
type: DataProperty
comment: hasShelterItems indicates the name or a type of shelter related items.
range: ShelterItems
range: string
type: Property
range: Resource
range: Thing

has3Wcomponent
type: DataProperty
comment: has3Wcomponent indicates the four saparate components of 3W i.e Who What Where and When.
range: WaterShortage
type: Property
range: Resource
range: Thing

timer
type: Property
comment: A type of live region containing a numerical counter which indicates an amount of elapsed time from a start point, or the time remaining until an end point.

Jun Zhao
type: Person
type: Thing
type: Agent
type: SpatialThing
type: Human Agent
made: Provenance Vocabulary Core Ontology namespace

Extent
type: Property
comment: The size or duration of the resource.
issued: 2000-07-11
range: Size or Duration
Has Version: extent-003
Date Modified: 2008-01-14
sub property of: format
sub property of: Format
Relation: extent-003
relation: extent-003
date: 2008-01-14
date: 2000-07-11
range: Media Type or Extent
range: Resource

URI
Has Version: URI-003
issued: 2000-07-11
Date Modified: 2008-01-14
type: Datatype
comment: The set of identifiers constructed according to the generic syntax for Uniform Resource Identifiers as specified by the Internet Engineering Task Force.
Relation: URI-003
relation: URI-003
date: 2008-01-14
date: 2000-07-11
type: Class

Date
issued: 2008-01-14
comment: A point or period of time associated with an event in the lifecycle of the resource.
description: Date may be used to express temporal information at any level of granularity. Recommended best practice is to use an encoding scheme, such as the W3CDTF profile of ISO 8601 [W3CDTF].
Has Version: dateT-001
Date Modified: 2008-01-14
type: Property
range: Literal
sub property of: date
Relation: dateT-001
relation: dateT-001
date: 2008-01-14
range: Resource

W3C-DTF
Has Version: W3CDTF-003
issued: 2000-07-11
Date Modified: 2008-01-14
type: Datatype
comment: The set of dates and times constructed according to the W3C Date and Time Formats Specification.
Relation: W3CDTF-003
relation: W3CDTF-003
date: 2008-01-14
date: 2000-07-11
type: Class

p3pv1
type: Property
member: relrev-properties
term: p3pv1
comment: p3pv1 refers to a P3P Policy Reference File [P3P].

toolbar
type: Property
comment: A collection of commonly used function buttons represented in compact visual form.

Access Rights
range: Rights Statement
type: Property
issued: 2003-02-15
comment: Information about who can access the resource or an indication of its security status.
description: Access Rights may include information regarding access or restrictions based on privacy, security, or other policies.
sub property of: rights
sub property of: Rights
Date Modified: 2008-01-14
Has Version: accessRights-002
Relation: accessRights-002
relation: accessRights-002
date: 2008-01-14
date: 2003-02-15
range: Resource

atLocation
type: DataProperty
comment: clusterActivity is a property to relate humanitarian Clusters with ongoing humanitarian response to meet the needs of affected population.
domain: IASCCluster
domain: NeedsResponse3W
type: Property
domain: Resource
domain: Thing

Friend of a Friend (FOAF) vocabulary
type: Ontology
description: The Friend of a Friend (FOAF) RDF vocabulary, described using W3C RDF Schema and the Web Ontology Language.

rowgroup
type: Property
comment: A group containing one or more row elements in a grid.

banner
type: Property
member: role-properties
comment: contains the prime heading or internal title of a page.

TGN
Has Version: TGN-003
issued: 2000-07-11
Date Modified: 2008-01-14
type: VocabularyEncodingScheme
comment: The set of places specified by the Getty Thesaurus of Geographic Names.
Relation: TGN-003
relation: TGN-003
date: 2008-01-14
date: 2000-07-11

alert
type: Property
comment: A message with important, and usually time-sensitive, information. Also see alertdialog and status.

progressbar
type: Property
comment: An element that displays the progress status for tasks that take a long time.

DCMI Type Vocabulary
Has Version: DCMIType-005
issued: 2000-07-11
Date Modified: 2012-06-14
type: VocabularyEncodingScheme
comment: The set of classes specified by the DCMI Type Vocabulary, used to categorize the nature or genre of the resource.
Relation: DCMIType-005
relation: DCMIType-005
date: 2012-06-14
date: 2000-07-11

Language
Date Modified: 2008-01-14
type: Property
Has Version: languageT-001
sub property of: language
description: Recommended best practice is to use a controlled vocabulary such as RFC 4646 [RFC4646].
issued: 2008-01-14
comment: A language of the resource.
range: Linguistic System
Relation: languageT-001
relation: languageT-001
date: 2008-01-14
range: Resource

listbox
type: Property
comment: A widget that allows the user to select one or more items from a list of choices. Also see combobox and list.

spinbutton
type: Property
comment: A form of range that expects a user to select from amongst discrete choices.

grid
type: Property
comment: A grid is an interactive control which contains cells of tabular data arranged in rows and columns, like a table.

itsRules
type: Property
member: relrev-properties
term: itsRules
comment: itsRules indicates that the designated resource is an [ITS] rule set.

heading
type: Property
comment: A heading for a section of the page.

img
type: Property
comment: A container for a collection of elements that form an image.

shelterNeededAt
type: DataProperty
comment: shelterNeededAt relates "where" shelter response might be necessary.
range: AffectedPopulation
range: Where3W
range: Location
type: Property
range: Location, Period, or Jurisdiction
range: Resource

directory
type: Property
comment: A list of references to members of a group, such as a static table of contents.

Given name
type: Property
type: DatatypeProperty
comment: The given name of some person.
term status: testing

Is Required By
comment: A related resource that requires the described resource to support its function, delivery, or coherence.
type: Property
Date Modified: 2008-01-14
sub property of: relation
note: This term is intended to be used with non-literal values as defined in the DCMI Abstract Model (http://dublincore.org/documents/abstract-model/). As of December 2007, the DCMI Usage Board is seeking a way to express this intention with a formal range declaration.
Has Version: isRequiredBy-003
issued: 2000-07-11
sub property of: Relation
Relation: isRequiredBy-003
relation: isRequiredBy-003
date: 2008-01-14
date: 2000-07-11

ISO 639-3
Has Version: ISO639-3-001
issued: 2008-01-14
type: Datatype
comment: The set of three-letter codes listed in ISO 639-3 for the representation of names of languages.
Relation: ISO639-3-001
relation: ISO639-3-001
date: 2008-01-14
type: Class

gridcell
type: Property
comment: A cell in a grid or treegrid.

dialog
type: Property
comment: A dialog is an application window that is designed to interrupt the current processing of an application in order to prompt the user to enter information or require a response. Also see alertdialog.

name
type: Property
type: DatatypeProperty
comment: A name for some thing.
domain: Thing
range: Literal
sub property of: label
term status: testing
domain: Resource
range: Resource

listitem
type: Property
comment: A single item in a list or directory.

cite
type: Property
member: relrev-properties
term: cite
comment: cite refers to a resource that defines a citation.

Document that defines the core ontology of the Provenance Vocabulary
type: Document
alternate: ns.rdf
primary topic: Provenance Vocabulary Core Ontology namespace
description: This documents specifies the Provenance Vocabulary Core Ontology which defines the main classes and properties provided by the Provenance Vocabulary.
assurance: Detached signature
title: Provenance Vocabulary Core Ontology Specification
license: http://creativecommons.org/licenses/by/1.0/
Conforms To: rdfa-syntax
type: Thing
Relation: rdfa-syntax
relation: rdfa-syntax
topic: Provenance Vocabulary Core Ontology namespace

log
type: Property
comment: A type of live region where new information is added in meaningful order and old information may disappear. Also see marquee.

atLocation
type: DataProperty
comment: atLocation is a data property to attest agency to a certain location.
domain: Who3W
range: string
type: Property
domain: Resource
domain: Thing
range: Resource

option
type: Property
comment: A selectable item in a select list.

form
type: Property
comment: A landmark region that contains a collection of items and objects that, as a whole, combine to create a form. Also see search.

presentation
type: Property
comment: An element whose implicit native role semantics will not be mapped to the accessibility API.

nickname
type: Property
type: DatatypeProperty
comment: A short informal nickname characterising an agent (includes login identifiers, IRC and other chat nicknames).
term status: testing

Is Version Of
note: This term is intended to be used with non-literal values as defined in the DCMI Abstract Model (http://dublincore.org/documents/abstract-model/). As of December 2007, the DCMI Usage Board is seeking a way to express this intention with a formal range declaration.
Has Version: isVersionOf-003
sub property of: Relation
type: Property
sub property of: relation
comment: A related resource of which the described resource is a version, edition, or adaptation.
issued: 2000-07-11
description: Changes in version imply substantive changes in content rather than differences in format.
Date Modified: 2008-01-14
Relation: isVersionOf-003
relation: isVersionOf-003
date: 2008-01-14
date: 2000-07-11

supplyingAgency
type: DataProperty
comment: supplyingAgency indicates the name of an organisation that is responsible to provide humanitarian relief items.
range: ShelterAgency
range: moac:Who3W
range: string
type: Property
range: Resource
range: Thing

Date Issued
range: Literal
sub property of: Date
comment: Date of formal issuance (e.g., publication) of the resource.
Has Version: issued-003
Date Modified: 2008-01-14
type: Property
issued: 2000-07-11
sub property of: date
Relation: issued-003
relation: issued-003
date: 2008-01-14
date: 2000-07-11
range: Resource

menuitemcheckbox
type: Property
comment: A checkable menuitem that has three possible values: true, false, or mixed.

Yahoo chat ID
domain: Agent
term status: testing
range: Literal
comment: A Yahoo chat ID
type: DatatypeProperty
sub property of: nickname
type: Property
type: InverseFunctionalProperty
type: ObjectProperty
domain: Resource
domain: Thing
range: Resource

Abstract
Has Version: abstract-003
issued: 2000-07-11
Date Modified: 2008-01-14
type: Property
comment: A summary of the resource.
sub property of: description
sub property of: Description
Relation: abstract-003
relation: abstract-003
date: 2008-01-14
date: 2000-07-11

menu
type: Property
comment: A type of widget that offers a list of choices to the user.

AIM chat ID
type: Property
type: DatatypeProperty
domain: Agent
comment: An AIM chat ID
type: InverseFunctionalProperty
term status: testing
range: Literal
sub property of: nickname
type: ObjectProperty
domain: Resource
domain: Thing
range: Resource

ns#
description: MOAC, the Management of a Crisis Vocabulary, is a lightweight vocabulary aiming to provide terms to enable practitioners to relate different "things" in crisis management activities together as Linked Data. The initial MOAC terms originated from the Inter Agency Standing Committee (IASC), Emergency Shelter Cluster in Haiti, UNOCHA 3W Who What Where Contact Database and

last
type: Property
member: relrev-properties
term: last
comment: last refers to the last resource in a collection of resources.

Audience
Has Version: audience-003
issued: 2001-05-21
Date Modified: 2008-01-14
type: Property
comment: A class of entity for whom the resource is intended or useful.
range: Agent Class
Relation: audience-003
relation: audience-003
date: 2008-01-14
date: 2001-05-21
range: Resource
range: Class

article
type: Property
comment: A section of a page that consists of a composition that forms an independent part of a document, page, or site.

date
type: DataProperty
comment: date indicates a particular date.
range: date
type: Property
range: Resource

countOfAffectedPopulation
type: DataProperty
comment: countOfAffectedPopulation indicates the total number of people affected by a certain disaster.
range: AffectedPopulation
range: int
type: Property
range: Resource
range: Thing

section
type: Property
member: relrev-properties
term: section
comment: section refers to a resource serving as a section in a collection.

approved
type: DataProperty
comment: approved is a data property to attest a event or incident or document is true or not.
domain: Agency
range: boolean
type: Property
domain: Thing
domain: Resource
range: Resource

References
type: Property
note: This term is intended to be used with non-literal values as defined in the DCMI Abstract Model (http://dublincore.org/documents/abstract-model/). As of December 2007, the DCMI Usage Board is seeking a way to express this intention with a formal range declaration.
issued: 2000-07-11
Date Modified: 2008-01-14
sub property of: relation
Has Version: references-003
sub property of: Relation
comment: A related resource that is referenced, cited, or otherwise pointed to by the described resource.
Relation: references-003
relation: references-003
date: 2008-01-14
date: 2000-07-11

Detached signature
type: Endorsement
endorser: pubkey2011
type: Thing

countInPipeline
type: DataProperty
comment: countInPipeline indicates the number of relief items that are "in the process" of arriving from a different location.
range: ShelterNFIItems
range: int
type: Property
range: Resource
range: Thing

Alternative Title
sub property of: Title
sub property of: title
type: Property
Date Modified: 2010-10-11
range: Literal
issued: 2000-07-11
description: The distinction between titles and alternative titles is application-specific.
Has Version: alternative-003
comment: An alternative name for the resource.
Relation: alternative-003
relation: alternative-003
date: 2010-10-11
date: 2000-07-11
range: Resource

Identifier
sub property of: identifier
range: Literal
Has Version: identifierT-001
description: Recommended best practice is to identify the resource by means of a string conforming to a formal identification system.
issued: 2008-01-14
type: Property
comment: An unambiguous reference to the resource within a given context.
Date Modified: 2008-01-14
Relation: identifierT-001
relation: identifierT-001
date: 2008-01-14
range: Resource

chapter
type: Property
member: relrev-properties
term: chapter
comment: chapter refers to a resource serving as a chapter in a collection.

Provenance Vocabulary Core Ontology namespace
type: Ontology
description: The Provenance Vocabulary provides classes and properties for describing provenance of Web data. The vocabulary focuses on two main use cases: 1.) It enables consumers of Web data to describe provenance of data retrieved from the Web and of data derived from such Web data. 2.) It enables providers of Web data to publish provenance-related metadata about their data. Notice, the vocabulary is not intended for describing provenance of other kinds of Web content. The Provenance Vocabulary is designed as a Web data specific specialization of the W3C PROV Ontology (PROV-O); classes and properties provided by the vocabulary are domain specific extensions of the more general concepts introduced in PROV-O. As a consequence, any Provenance Vocabulary based description of provenance can be easily interpreted and exchanged according to the W3C PROV family of standards.
Date Created: 2009-08-25T12:00:00Z
Date Modified: 2012-03-14T12:00:00Z
creator: Jun Zhao
creator: Olaf Hartig
date: 2012-03-14T12:00:00Z
date: 2009-08-25T12:00:00Z
contributor: Jun Zhao
contributor: Olaf Hartig
Contributor: Jun Zhao
Contributor: Olaf Hartig
maker: Jun Zhao
maker: Olaf Hartig
type: Thing

textbox
type: Property
comment: Input that allows free-form text as its value.

countofAffectedHH
type: DataProperty
comment: countofAffectedHH indicates total number of House Holds affected by a certain disaster.
range: AffectedPopulation
range: int
type: Property
range: Resource
range: Thing

Instructional Method
description: Instructional Method will typically include ways of presenting instructional materials or conducting instructional activities, patterns of learner-to-learner and learner-to-instructor interactions, and mechanisms by which group and individual levels of learning are measured. Instructional methods include all aspects of the instruction and learning processes from planning and implementation through evaluation and feedback.
Has Version: instructionalMethod-002
issued: 2005-06-13
Date Modified: 2008-01-14
type: Property
comment: A process, used to engender knowledge, attitudes and skills, that the described resource is designed to support.
range: Method of Instruction
Relation: instructionalMethod-002
relation: instructionalMethod-002
date: 2008-01-14
date: 2005-06-13
range: Resource

geekcode
type: Property
type: DatatypeProperty
comment: A textual geekcode for this person, see http://www.geekcode.com/geek.html
domain: Person
range: Literal
term status: archaic
domain: Agent
domain: Resource
domain: Thing
domain: Human Agent
domain: SpatialThing
range: Resource

status
type: Property
comment: A container whose content is advisory information for the user but is not important enough to justify an alert. Also see alert.

family_name
type: Property
type: DatatypeProperty
comment: The family name of some person.
domain: Person
range: Literal
term status: archaic
domain: Agent
domain: Resource
domain: Thing
domain: Human Agent
domain: SpatialThing
range: Resource

Date Submitted
sub property of: date
type: Property
range: Literal
comment: Date of submission of the resource.
sub property of: Date
Date Modified: 2008-01-14
issued: 2002-07-13
description: Examples of resources to which a Date Submitted may be relevant are a thesis (submitted to a university department) or an article (submitted to a journal).
Has Version: dateSubmitted-002
Relation: dateSubmitted-002
relation: dateSubmitted-002
date: 2008-01-14
date: 2002-07-13
range: Resource

Is Format Of
Has Version: isFormatOf-003
Date Modified: 2008-01-14
issued: 2000-07-11
sub property of: relation
type: Property
note: This term is intended to be used with non-literal values as defined in the DCMI Abstract Model (http://dublincore.org/documents/abstract-model/). As of December 2007, the DCMI Usage Board is seeking a way to express this intention with a formal range declaration.
sub property of: Relation
comment: A related resource that is substantially the same as the described resource, but in another format.
Relation: isFormatOf-003
relation: isFormatOf-003
date: 2008-01-14
date: 2000-07-11

http://lodlaundromat.org/.well-known/genid/samples/jena///predicate//fe8d8faed6702d7784e1ccba87e71ab5/9445b29090531f162805053b8f46ccee#1
type: Data Creation
performed by: Tomi Kauppinen
executed at: 2012-01-29T20:30:00Z
was associated with: Tomi Kauppinen
type: Thing
type: Activity

definition
type: Property
member: role-properties
comment: indicates the definition of a term or concept.

Mediator
type: Property
range: Agent Class
issued: 2001-05-21
Has Version: mediator-003
Date Modified: 2008-01-14
comment: An entity that mediates access to the resource and for whom the resource is intended or useful.
description: In an educational context, a mediator might be a parent, teacher, teaching assistant, or care-giver.
sub property of: Audience
Relation: mediator-003
relation: mediator-003
date: 2008-01-14
date: 2001-05-21
range: Resource
range: Class

title
type: DataProperty
comment: category is about the sort of an incident.
domain: Incident
range: string
type: Property
domain: Resource
domain: Thing
range: Resource

region
type: Property
comment: A large perceivable section of a web page or document, that the author feels is important enough to be included in a page summary or table of contents, for example, an area of the page containing live sporting event statistics.

checkbox
type: Property
comment: A checkable input that has three possible values: true, false, or mixed.

main
type: Property
member: role-properties
comment: acts as the main content of the document.

tooltip
type: Property
comment: A contextual popup that displays a description for an element.

index
type: Property
member: relrev-properties
term: index
comment: index refers to a resource providing an index.

prev
type: Property
member: relrev-properties
term: prev
comment: prev refers to a previous resource (before the current one) in an ordered collection of resources.

Is Referenced By
Date Modified: 2008-01-14
issued: 2000-07-11
sub property of: relation
note: This term is intended to be used with non-literal values as defined in the DCMI Abstract Model (http://dublincore.org/documents/abstract-model/). As of December 2007, the DCMI Usage Board is seeking a way to express this intention with a formal range declaration.
comment: A related resource that references, cites, or otherwise points to the described resource.
type: Property
sub property of: Relation
Has Version: isReferencedBy-003
Relation: isReferencedBy-003
relation: isReferencedBy-003
date: 2008-01-14
date: 2000-07-11

MSN chat ID
sub property of: nickname
type: InverseFunctionalProperty
comment: An MSN chat ID
domain: Agent
type: DatatypeProperty
term status: testing
type: Property
range: Literal
type: ObjectProperty
domain: Resource
domain: Thing
range: Resource

RFC 1766
Has Version: RFC1766-003
issued: 2000-07-11
Date Modified: 2008-01-14
type: Datatype
comment: The set of tags, constructed according to RFC 1766, for the identification of languages.
Relation: RFC1766-003
relation: RFC1766-003
date: 2008-01-14
date: 2000-07-11
type: Class

stylesheet
type: Property
member: relrev-properties
term: stylesheet
comment: stylesheet refers to a resource serving as a stylesheet for a resource.

DCMI Point
Has Version: Point-003
issued: 2000-07-11
Date Modified: 2008-01-14
type: Datatype
comment: The set of points in space defined by their geographic coordinates according to the DCMI Point Encoding Scheme.
Relation: Point-003
relation: Point-003
date: 2008-01-14
date: 2000-07-11
type: Class

Requires
Has Version: requires-003
type: Property
comment: A related resource that is required by the described resource to support its function, delivery, or coherence.
issued: 2000-07-11
sub property of: relation
note: This term is intended to be used with non-literal values as defined in the DCMI Abstract Model (http://dublincore.org/documents/abstract-model/). As of December 2007, the DCMI Usage Board is seeking a way to express this intention with a formal range declaration.
Date Modified: 2008-01-14
sub property of: Relation
Relation: requires-003
relation: requires-003
date: 2008-01-14
date: 2000-07-11

navigation
type: Property
member: role-properties
comment: indicates a collection of items suitable for navigating the document or related documents.

tabpanel
type: Property
comment: A container for the resources associated with a tab, where each tab is contained in a tablist.

complementary
type: Property
member: role-properties
comment: indicates that the section supports but is separable from the main content of resource.

Rights
range: Rights Statement
issued: 2008-01-14
description: Typically, rights information includes a statement about various property rights associated with the resource, including intellectual property rights.
comment: Information about rights held in and over the resource.
Date Modified: 2008-01-14
type: Property
Has Version: rightsT-001
sub property of: rights
Relation: rightsT-001
relation: rightsT-001
date: 2008-01-14
range: Resource

Subject
Has Version: subjectT-002
Date Modified: 2012-06-14
description: Typically, the subject will be represented using keywords, key phrases, or classification codes. Recommended best practice is to use a controlled vocabulary.
issued: 2008-01-14
sub property of: subject
type: Property
note: This term is intended to be used with non-literal values as defined in the DCMI Abstract Model (http://dublincore.org/documents/abstract-model/). As of December 2007, the DCMI Usage Board is seeking a way to express this intention with a formal range declaration.
comment: The topic of the resource.
Relation: subjectT-002
relation: subjectT-002
date: 2012-06-14
date: 2008-01-14

sha1sum of a personal mailbox URI name
type: Property
type: InverseFunctionalProperty
type: DatatypeProperty
comment: The sha1sum of the URI of an Internet mailbox associated with exactly one owner, the first owner of the mailbox.
domain: Agent
range: Literal
term status: testing
type: ObjectProperty
domain: Resource
domain: Thing
range: Resource

columnheader
type: Property
comment: A cell containing header information for a column.

verified
type: DataProperty
comment: verified is a property used in describing if certain information/data has been checked with more than one sources.
domain: Agency
range: boolean
type: Property
domain: Thing
domain: Resource
range: Resource

Rights Holder
Has Version: rightsHolder-002
issued: 2004-06-14
Date Modified: 2008-01-14
type: Property
comment: A person or organization owning or managing rights over the resource.
range: Agent
Relation: rightsHolder-002
relation: rightsHolder-002
date: 2008-01-14
date: 2004-06-14
range: Resource
range: Thing

Spatial Coverage
type: Property
range: Location
comment: Spatial characteristics of the resource.
issued: 2000-07-11
Date Modified: 2008-01-14
Has Version: spatial-003
sub property of: Coverage
sub property of: coverage
Relation: spatial-003
relation: spatial-003
date: 2008-01-14
date: 2000-07-11
range: Location, Period, or Jurisdiction
range: Resource

Publisher
Date Modified: 2010-10-11
issued: 2008-01-14
range: Agent
comment: An entity responsible for making the resource available.
Has Version: publisherT-001
type: Property
description: Examples of a Publisher include a person, an organization, or a service.
sub property of: publisher
Relation: publisherT-001
relation: publisherT-001
date: 2010-10-11
date: 2008-01-14
range: Resource
range: Thing

logo
type: Property
type: ObjectProperty
type: InverseFunctionalProperty
comment: A logo representing some thing.
domain: Thing
range: Thing
term status: testing
domain: Resource
range: Resource

Tomi Kauppinen
type: Person
type: Thing
type: Agent
type: SpatialThing
type: Human Agent
made: Management of a Crisis Vocabulary namespace

top
type: Property
member: relrev-properties
term: top
comment: top is a synonym for start.

MeSH
Has Version: MESH-003
issued: 2000-07-11
Date Modified: 2008-01-14
type: VocabularyEncodingScheme
comment: The set of labeled concepts specified by the Medical Subject Headings.
Relation: MESH-003
relation: MESH-003
date: 2008-01-14
date: 2000-07-11

menuitem
type: Property
comment: An option in a group of choices contained by a menu or menubar.

menuitemradio
type: Property
comment: A checkable menuitem in a group of menuitemradio roles, only one of which can be checked at a time.

Management of a Crisis (MOAC) Vocabulary Specification
alternate: moac-2012-01-29.rdf
stylesheet: main.css
type: Document
label: Document that defines the Management of a Crisis Vocabulary
primary topic: Management of a Crisis Vocabulary namespace
type: Thing
topic: Management of a Crisis Vocabulary namespace

account name
type: Property
type: DatatypeProperty
comment: Indicates the name (identifier) associated with this online account.
domain: Online Account
range: Literal
term status: testing
domain: Resource
domain: Thing
range: Resource

jabber ID
type: Property
type: DatatypeProperty
type: InverseFunctionalProperty
comment: A jabber ID for something.
domain: Agent
range: Literal
term status: testing
type: ObjectProperty
domain: Resource
domain: Thing
range: Resource

scrollbar
type: Property
comment: A graphical object that controls the scrolling of content within a viewing area, regardless of whether the content is fully displayed within the viewing area.

Format
Has Version: formatT-001
type: Property
description: Examples of dimensions include size and duration. Recommended best practice is to use a controlled vocabulary such as the list of Internet Media Types [MIME].
Date Modified: 2008-01-14
comment: The file format, physical medium, or dimensions of the resource.
issued: 2008-01-14
sub property of: format
range: Media Type or Extent
Relation: formatT-001
relation: formatT-001
date: 2008-01-14
range: Resource

LCSH
Has Version: LCSH-003
issued: 2000-07-11
Date Modified: 2008-01-14
type: VocabularyEncodingScheme
comment: The set of labeled concepts specified by the Library of Congress Subject Headings.
Relation: LCSH-003
relation: LCSH-003
date: 2008-01-14
date: 2000-07-11

age
type: Property
type: FunctionalProperty
type: DatatypeProperty
comment: The age in years of some agent.
domain: Agent
range: Literal
term status: unstable
domain: Resource
domain: Thing
range: Resource

start
type: Property
member: relrev-properties
term: start
comment: start refers to the first resource in a collection of resources.

next
type: Property
member: relrev-properties
term: next
comment: next refers to the next resource (after the current one) in an ordered collection of resources.

separator
type: Property
comment: A divider that separates and distinguishes sections of content or groups of menuitems.

firstName
type: Property
type: DatatypeProperty
comment: The first name of a person.
domain: Person
range: Literal
term status: testing
domain: Agent
domain: Resource
domain: Thing
domain: Human Agent
domain: SpatialThing
range: Resource

License
comment: A legal document giving official permission to do something with the resource.
type: Property
range: License Document
sub property of: rights
issued: 2004-06-14
Date Modified: 2008-01-14
Has Version: license-002
sub property of: Rights
Relation: license-002
relation: license-002
date: 2008-01-14
date: 2004-06-14
range: Rights Statement
range: Resource

Type
Has Version: typeT-001
sub property of: type
description: Recommended best practice is to use a controlled vocabulary such as the DCMI Type Vocabulary [DCMITYPE]. To describe the file format, physical medium, or dimensions of the resource, use the Format element.
Date Modified: 2008-01-14
range: Class
type: Property
comment: The nature or genre of the resource.
issued: 2008-01-14
Relation: typeT-001
relation: typeT-001
date: 2008-01-14
range: Resource

ISO 3166
Has Version: ISO3166-004
issued: 2000-07-11
Date Modified: 2008-01-14
type: Datatype
comment: The set of codes listed in ISO 3166-1 for the representation of names of countries.
Relation: ISO3166-004
relation: ISO3166-004
date: 2008-01-14
date: 2000-07-11
type: Class

alertdialog
type: Property
comment: A type of dialog that contains an alert message, where initial focus goes an element within the dialog. Also see alert and dialog.

Contributor
comment: An entity responsible for making contributions to the resource.
description: Examples of a Contributor include a person, an organization, or a service.
type: Property
Date Modified: 2010-10-11
issued: 2008-01-14
sub property of: contributor
range: Agent
Has Version: contributorT-001
Relation: contributorT-001
relation: contributorT-001
date: 2010-10-11
date: 2008-01-14
range: Resource
range: Thing

status
type: Property
type: DatatypeProperty
comment: A string expressing what the user is happy for the general public (normally) to know about their current activity.
domain: Agent
range: Literal
term status: unstable
domain: Resource
domain: Thing
range: Resource

tree
type: Property
comment: A type of list that may contain sub-level nested groups that can be collapsed and expanded.

dateOfDistbn
type: DataProperty
comment: dateOfDistbn indicates a particular date when shelter/NFI items are distributed.
range: When3W
range: date
type: Property
range: Resource
range: Thing

distributingPartner
type: DataProperty
comment: distributingPartner indicates the name of an organisation that is responsible to distribute relief items in a disaster.
range: ShelterAgency
range: Literal
type: Property
range: Resource
range: Thing

gender
type: Property
type: FunctionalProperty
type: DatatypeProperty
comment: The gender of this Agent (typically but not necessarily 'male' or 'female').
domain: Agent
range: Literal
term status: testing
domain: Resource
domain: Thing
range: Resource

math
type: Property
comment: Content that represents a mathematical expression.

first
type: Property
member: relrev-properties
term: first
comment: first refers the first item in a collection (see also start and top).

myersBriggs
type: Property
type: DatatypeProperty
comment: A Myers Briggs (MBTI) personality classification.
domain: Person
range: Literal
term status: testing
domain: Agent
domain: Resource
domain: Thing
domain: Human Agent
domain: SpatialThing
range: Resource

hasOrganisationID
type: DataProperty
comment: hasOrganisationID is a unique identification number given to relief agency.
range: ShelterAgency
range: moac:Who3W
range: string
type: Property
range: Resource
range: Thing

DCMI Period
Has Version: Period-003
issued: 2000-07-11
Date Modified: 2008-01-14
type: Datatype
comment: The set of time intervals defined by their limits according to the DCMI Period Encoding Scheme.
Relation: Period-003
relation: Period-003
date: 2008-01-14
date: 2000-07-11
type: Class

Date Modified
type: DatatypeProperty
Date Modified: 2008-01-14
sub property of: Date
type: Property
range: Literal
issued: 2000-07-11
sub property of: date
comment: Date on which the resource was changed.
Has Version: modified-003
Relation: modified-003
relation: modified-003
date: 2008-01-14
date: 2000-07-11
range: Resource

organizationName
type: DataProperty
comment: organizationName indicates the name of the organisation for a specific IASC cluster like emergency Shelter cluster or Food Cluster.
range: IASCCluster
range: ShelterAgency
range: Who3W
type: Property
range: Resource
range: Thing

row
type: Property
comment: A row of cells in a grid.

Date Accepted
Date Modified: 2008-01-14
range: Literal
sub property of: date
comment: Date of acceptance of the resource.
type: Property
description: Examples of resources to which a Date Accepted may be relevant are a thesis (accepted by a university department) or an article (accepted by a journal).
Has Version: dateAccepted-002
sub property of: Date
issued: 2002-07-13
Relation: dateAccepted-002
relation: dateAccepted-002
date: 2008-01-14
date: 2002-07-13
range: Resource

Audience Education Level
Has Version: educationLevel-002
issued: 2002-07-13
Date Modified: 2008-01-14
type: Property
comment: A class of entity, defined in terms of progression through an educational or training context, for which the described resource is intended.
range: Agent Class
sub property of: Audience
Relation: educationLevel-002
relation: educationLevel-002
date: 2008-01-14
date: 2002-07-13
range: Resource
range: Class

meta
type: Property
member: relrev-properties
term: meta
comment: meta refers to a resource that provides metadata.

Has Version
Has Version: hasVersion-003
sub property of: relation
comment: A related resource that is a version, edition, or adaptation of the described resource.
Date Modified: 2008-01-14
note: This term is intended to be used with non-literal values as defined in the DCMI Abstract Model (http://dublincore.org/documents/abstract-model/). As of December 2007, the DCMI Usage Board is seeking a way to express this intention with a formal range declaration.
issued: 2000-07-11
type: Property
sub property of: Relation
Relation: hasVersion-003
relation: hasVersion-003
date: 2008-01-14
date: 2000-07-11