WaterShortage
subclass of: Resource
subclass of: Thing
type: Class
comment: Abstract term to describe the collection of which agency is doing what activities and where.

What3W
subclass of: Resource
subclass of: Thing
type: Class
comment: Specific activities in relation to humanitarian response.

ShelterNFIItems
subclass of: Resource
subclass of: Thing
type: Class
comment: ShelterNFIItems define Shelter Cluster related humanitarian relief items (e.g. tents, tarpulins).

ShelterOffered
subclass of: Thing
subclass of: Resource
type: Class
comment: ShelterOffered indicates a location where internally displace people have been offered termporary/transitional shelters.
comment: ShelterOffered relates shelter activities when a humanitarian relief agencies provide shelter (e.g. tents, tarps) materials as a part of a relief distribution.

Response3W
subclass of: Resource
subclass of: Thing
type: Class
comment: Cluster Specific humanitarian response information.

PriceGouging
subclass of: Resource
subclass of: Thing
type: Class
comment: PriceGouging is a pejorative term referring to a situation in which a seller prices goods or commodities much higher than is considered reasonable or fair.

VitalLines
subclass of: Resource
subclass of: Thing
type: Class
comment: Vitallines is an abstract term that refer to particulars that could directly impact human lives.

AidManipulation
subclass of: Resource
subclass of: Thing
type: Class
comment: AidManipulation.

ShelterItems
subclass of: Thing
subclass of: Resource
type: Class
comment: ShelterItems include, but are not limited to, tents, tarpulins distributed or stocked by shelter response humanitarian agencies.

Cluster2Food
subclass of: Resource
subclass of: Thing
type: Class
comment: Inter Agency Standing Committee Emergency Food related agency specific activities. World Food Programme (WFP) is the global cluster lead for Food.

SecurityConcern
subclass of: Resource
subclass of: Thing
type: Class
comment: SecurityConcern is a abstract term related to the worries of protection against danger, damage, loss, and criminal activity.

RubbleRemoval
subclass of: Resource
subclass of: Thing
type: Class
comment: RubbleRemoval is a term about the agreed upon and systamatic disopsal of of broken stone, of irregular size, shape and texture from a locaktion with totally damaged or partially damaged infrastructures.

CollapsedStructure
subclass of: Resource
subclass of: Thing
type: Class
comment: A CollapsedStructure is a term that defines a totally damaged state of a structure resulting from human or natural phenomenon.

Others
subclass of: Resource
subclass of: Thing
type: Class
comment: Others is the class that is used when certain instance does not fit any of the classes. (Source:Ushahidi Haiti)

IASCCluster
subclass of: Thing
subclass of: Resource
type: Class
comment: Humanitarian sectors and categories of population for achieving more strategic responses and better prioritization of available resources by clarifying the division of labour among organizations, better defining the roles and responsibilities of humanitarian organizations within the sectors, and providing the Humanitarian Coordinator with both a first point of call and a provider of last resort in all the key sectors or areas of activity.

UshahidiReport
subclass of: Resource
subclass of: Thing
type: Class
comment: UshahidiReport is a report from Ushahidi, contains simultaneously temporal and geospatial archive of events, based on the local observers' reports.

HumanRemainsManagement
subclass of: Resource
subclass of: Thing
type: Class
comment: HumanRemainsManagement is an abstract term used to define morgues or other locations where dead bodies can be properlay managed.

CommunicationLinesDown
subclass of: Resource
subclass of: Thing
type: Class
comment: CommunicationLinesDown indicates that a mobile or a landline phone in ceratain area will not work because of the problem in the communication wired poles.

Where3W
subclass of: Resource
subclass of: Thing
type: Class
comment: Specific location(s) in relation to humanitarian response.

NaturalHazards
subclass of: Resource
subclass of: Thing
type: Class
comment: NaturalHazards is a term represent a threat of a naturally occurring event that will have a negative effect on people or the environment .

Menaces
subclass of: Resource
subclass of: Thing
type: Class
comment: A Menace is a threat or danger that causes intimidation.

ShelterNeeded
subclass of: Resource
subclass of: Thing
type: Class
comment: ShelterNeeded is a term used to indicate number of emergency life saving basic structures like tents and tarpaulins.
comment: ShelterNeeded records information regarding additional shelter needs as a part of planned relief distribution processes.

Riot
subclass of: Resource
subclass of: Thing
type: Class
comment: A riot is a form of civil disorder characterized often by disorganized groups lashing out in a sudden and intense rash of violence against authority, property or people.

FoodDistributionPoint
subclass of: Resource
subclass of: Thing
type: Class
comment: FoodDistributionPoint is a pre-identified location for distributing or transporting food or drink to the affected communities.

ChronicCareNeeds
subclass of: Resource
subclass of: Thing
type: Class
comment: ChronicCareNeeds refers to the requirement of medical care which addresses preexisting or long term illness.

ContaminatedWater
subclass of: Resource
subclass of: Thing
type: Class
comment: Undrinkable Water is water that is regarded unfit/unhealthy to drink for both humans and animals.

Needs3W
subclass of: Resource
subclass of: Thing
type: Class
comment: Cluster Specific humanitarian response information.

Floods
subclass of: Resource
subclass of: Thing
type: Class
comment: A flood is an overflow of an expanse of water that submerges land.

PublicHealth
subclass of: Resource
subclass of: Thing
type: Class
comment: PublicHealth is a term that deals with overall health related issues, conerns and initiatives for or in a community .

TheftOfAid
subclass of: Resource
subclass of: Thing
type: Class
comment: TheftOfAid is a term that indicate a form of criminal activity when unknown person(s) steal the relief distribution materials either from gowdown or relief distribution points.

Incident
subclass of: Resource
subclass of: Thing
type: Class
comment: Incident is a distinct or definite event.

InternetAccess
subclass of: Resource
subclass of: Thing
type: Class
comment: InternetAccess refers to certain place that can provide internet services.

AskingToFowardAMessage
subclass of: Resource
subclass of: Thing
type: Class
comment: AskingToFowardAMessage is the term used to forward certain community directed messages using third party sources.

AffectedPopulation
subclass of: Thing
subclass of: Resource
type: Class
comment: AffectedPopulation is a group of disaster affecgted people in need of humanitarian support.

SearchAndRescue
subclass of: Resource
subclass of: Thing
type: Class
comment: SearchAndRescue is a part of humanitarian relief effort on the immediate on set of disaster where a team of experts try and locate missing persons.

UnstableStructure
subclass of: Resource
subclass of: Thing
type: Class
comment: UnstableStructure is a term that describe a partially damaged bulidings/structures which is still standing but uninhabitable.

Looting
subclass of: Resource
subclass of: Thing
type: Class
comment: Looting is term that indicate a form of criminal activity when disaster affected people forcefully take away the relief distribution materials.

MedicalEquipmentAndSupplyNeeds
subclass of: Resource
subclass of: Thing
type: Class
comment: MedicalEquipmentAndSupplyNeeds is a term describe the demand for Medical Equipment and Supplies.

WaterSanitationAndHygienePromotion
subclass of: Resource
subclass of: Thing
type: Class
comment: WaterSanitationAndHygienePromotion is a term refers to a concept that improving access to safe water and sanitation facilities leads to healthier families and communities. (UNICEF)

MissingPersons
subclass of: Resource
subclass of: Thing
type: Class
comment: MissingPersons are persons whose whereabouts are unknown after sudden onset of disaster.

WaterShortage
subclass of: Resource
subclass of: Thing
type: Class
comment: Watershortage is a term used to refer to the situations that water resources can not meet human demand.

When3W
subclass of: Resource
subclass of: Thing
type: Class
comment: Specific time in relation to humanitarian response.

ShelterAgency
subclass of: Resource
subclass of: Thing
type: Class
comment: ShelterAgency is a Shelter Cluster related humanitarian partner or a specific organization involved in shelter related humanitarian response.

MedicalEmergency
subclass of: Resource
subclass of: Thing
type: Class
comment: A medical emergency is an injury that is acute and poses an immediate risk to a person's life or long term health.

HospitalOperating
subclass of: Resource
subclass of: Thing
type: Class
comment: HospitalOperating describes still functioning hospital after a disaster.

PortOpen
subclass of: Resource
subclass of: Thing
type: Class
comment: PortOpen is the term that indicate a port opening of regular business for receiving humanitarian relief materials.

PeopleTrapped
subclass of: Resource
subclass of: Thing
type: Class
comment: People found in dangerous stituation might not be able to escape from the place they are.

FinancialServicesAvailable
subclass of: Resource
subclass of: Thing
type: Class
comment: FinancialServicesAvailabe refers to services provided by the certain Non Government Organizations or finance industry as a part of recovery packages to the disaster affected communities.

AnimalIllnessOrDeath
subclass of: Resource
subclass of: Thing
type: Class
comment: AnimalIllnessOrDeath refers to the illness or death of animals caused by a disaster highlighting the possibility of spread of disease because of direct or indirect contamination.

Cluster3WASH
subclass of: Resource
subclass of: Thing
type: Class
comment: Inter Agency Standing Committee Emergency Water Sanitation and Hygine related agency specific activities. UNICEF is the global cluster lead for WASH.

WaterDistributionPoint
subclass of: Resource
subclass of: Thing
type: Class
comment: WaterDistributionPoint is a location for distributing or transporting daily water to the disaster affected communities.

ShelterResponse
subclass of: Thing
subclass of: Resource
type: Class
comment: ShelterResponse is related to activities defining Shelter Clusters' humanitarian response in an emergency.

Emergency
subclass of: Resource
subclass of: Thing
type: Class
comment: Emergency is a situation that poses an immediate crisis to human, life, health, property or environment.

MedicalEmergency
subclass of: Resource
subclass of: Thing
type: Class
comment: High possibility of loss resulting from the occurrence of the phenomenon.

FuelShortage
subclass of: Resource
subclass of: Thing
type: Class
comment: FuelShortage is a lack of minimal cooking or other fuel that a person need on a daily basis.

FeedingCentersAvailable
subclass of: Resource
subclass of: Thing
type: Class
comment: FeedingCentersAvailable is a term that defines a location of a facility which supports providing basic life saving foods to infants and lactating mothers.

ShelterDistributionPoint
subclass of: Resource
subclass of: Thing
type: Class
comment: ShelterDistributionPoint is a specific location where humanitarian relief agencies provide shelter assistances as a part of relief distribution.

HealthOfWomen
subclass of: Resource
subclass of: Thing
type: Class
comment: HealthOfWomen is a term used to include all the health issues related to female gender.

Fire
subclass of: Resource
subclass of: Thing
type: Class
comment: Fire is an uncontrolled burning that has the potential to cause physical damage on human life, health, property or ecology.

Who3W
subclass of: Thing
subclass of: Resource
type: Class
comment: Specific agency or Organisation humanitarian response information.

Landslides
subclass of: Resource
subclass of: Thing
type: Class
comment: A landslide is a geological phenomenon which includes a wide range of ground movement.

PersonsNews
subclass of: Resource
subclass of: Thing
type: Class
comment: PersonNews is the information about a person's status, e.g. death, injured, alive etc.

NFIItems
subclass of: Thing
subclass of: Resource
type: Class
comment: NFIItems also known as Non Food Items include, but are not limited to, jerry cans, kots, mats distributed or stocked by shelter response humanitarian agencies.

ShelterActivity
subclass of: Resource
subclass of: Thing
type: Class
comment: ShelterActivity is a term that describes Shelter Cluster related humanitarian response.

InfectiousHumanDisease
subclass of: Resource
subclass of: Thing
type: Class
comment: InfectiousHumanDisease comprise of clinically evident illness resulting from the infection, presence and growth of pathogenic biological agents in an individual host organism that could also infect others.

PsychiatricNeed
subclass of: Resource
subclass of: Thing
type: Class
comment: PsychiatricNeed is a term indicate that people need medical care for mental disorders.

InfrastructureDamage
subclass of: Thing
subclass of: Resource
type: Class
comment: InfrastureDamage is about the damage of physically existing basic facilities, services, and installations needed for the functioning of a community or society.

ServiceAvailable
subclass of: Resource
subclass of: Thing
type: Class
comment: ServiceAvailable is an abstract term that indicates availability of different life saving and sustaining services in a disaster struck location/place.

PowerOutage
subclass of: Resource
subclass of: Thing
type: Class
comment: A PowerOutage is a term which refers to electrical power failure, which means a short- or long-term loss of the electric power to an area.

EarthquakeAndAftershock
subclass of: Resource
subclass of: Thing
type: Class
comment: An earthquake is the result of a sudden release of energy in the Earth's crust that creates seismic waves, and an aftershock is an earthquake that occurs after a previous earthquake, the mainshock.

GroupViolence
subclass of: Resource
subclass of: Thing
type: Class
comment: GroupViolence is a term used to describe more than one individual engaging in some form of criminal activities.

Deaths
subclass of: Resource
subclass of: Thing
type: Class
comment: Deaths are the termination of the biological functions that sustain a living organism.

NonfoodAidDistributionPoint
subclass of: Resource
subclass of: Thing
type: Class
comment: NonfoodAidDistributionPoint is a location for distributing or transporting life saving Non Food Item other than food items, also known as NFIs in humaniatarian sphere.

CompromisedBridge
subclass of: Resource
subclass of: Thing
type: Class
comment: CompromisedBridge is a partially or completely damaged bridge that can no longer be used for transporting people or relief materials.

FoodShortage
subclass of: Resource
subclass of: Thing
type: Class
comment: FoodShortage is a widespread scarcity of food that may apply to any faunal species.

Agency
subclass of: Resource
subclass of: Thing
type: Class
comment: Agency is an organization that aims to manage a crisis.

RoadBlocked
subclass of: Resource
subclass of: Thing
type: Class
comment: RoadBlocked indicate a road is blocked by a barricade caused by natural disaster or set up by human.

NeedsResponse3W
subclass of: Resource
subclass of: Thing
type: Class
comment: Humanitarian needs and response related activities.

IDPConcentration
subclass of: Resource
subclass of: Thing
type: Class
comment: IDPConcentration refers to the act of internally displaced people gathering in a certain location, which could eventually turn into an IDP camp.

Cluster1Shelter
subclass of: Resource
subclass of: Thing
type: Class
comment: Inter Agency Standing Committee Emergency Shelter related agency specific activities. The Shelter Cluster is co-chaired by IFRC and UNHCR at the global level. IFRC is convener of the Emergency Shelter Cluster in disaster situations while UNHCR leads the Emergency Shelter Cluster in the area of conflict generated IDPs (Internally Displaced Persons). In addition to IFRC and UNHCR, participants in the Global Shelter Cluster include: ACTED, Archi-Urgent, Article 25, Care UK, CHF, CRS, DFID, Habitat for Humanity, IOM, Medair, NRC, OFDA, Oxfam GB, ProAct, ProVention, RedR, Relief International, RICS, Save The Children UK, Shelter Centre, SKAT, UN Habitat, UN OCHA, UNRWA and World Vision. (source: sheltercluster.org, accessed on 12 Feb 2012)

ContaminatedWaterSupply
subclass of: Resource
subclass of: Thing
type: Class
comment: The source and delivery system provides water but polluted. It could result in outbreaks of diseases and other health realted issues.

atLocation
type: DataProperty
comment: clusterActivity is a property to relate humanitarian Clusters with ongoing humanitarian response to meet the needs of affected population.
domain: IASCCluster
domain: NeedsResponse3W
type: Property
domain: Thing
domain: Resource

countInStock
type: DataProperty
comment: countInStock indicates the number of items currently stockpiled either at a store or at a distribution location.
range: ShelterNFIItems
range: int
type: Property
range: Resource
range: Thing

atLocation
type: DataProperty
comment: atLocation is a data property to attest agency to a certain location.
domain: Who3W
range: string
type: Property
range: Resource
domain: Thing
domain: Resource

has3Wcomponent
type: DataProperty
comment: has3Wcomponent indicates the four saparate components of 3W i.e Who What Where and When.
range: WaterShortage
type: Property
range: Resource
range: Thing

title
type: DataProperty
comment: description is about the content of an incident.
domain: Incident
range: string
type: Property
range: Resource
domain: Thing
domain: Resource

countInPipeline
type: DataProperty
comment: countInPipeline indicates the number of relief items that are "in the process" of arriving from a different location.
range: ShelterNFIItems
range: int
type: Property
range: Resource
range: Thing

distributingPartner
type: DataProperty
comment: distributingPartner indicates the name of an organisation that is responsible to distribute relief items in a disaster.
range: ShelterAgency
range: Literal
type: Property
range: Resource
range: Thing

shelterNeededAt
type: DataProperty
comment: shelterNeededAt relates "where" shelter response might be necessary.
range: AffectedPopulation
range: Where3W
range: Location
type: Property
range: Resource

dateOfDistbn
type: DataProperty
comment: dateOfDistbn indicates a particular date when shelter/NFI items are distributed.
range: When3W
range: date
type: Property
range: Resource
range: Thing

http://lodlaundromat.org/.well-known/genid/fe8d8faed6702d7784e1ccba87e71ab5#1
performed at: 2012-01-29T20:30:00Z
performed by: Tomi Kauppinen
type: DataCreation

countofAffectedHH
type: DataProperty
comment: countofAffectedHH indicates total number of House Holds affected by a certain disaster.
range: AffectedPopulation
range: int
type: Property
range: Resource
range: Thing

atLocation
type: DataProperty
comment: atGeoLocationLatitude is a data property used to link location or "Where" with specific latitude in the form of decimal degree.
domain: Where3W
range: float
type: Property
range: Resource
domain: Thing
domain: Resource

title
type: DataProperty
comment: Title is an identifying name given to an incident.
domain: Incident
range: string
type: Property
range: Resource
domain: Thing
domain: Resource

verified
type: DataProperty
comment: verified is a property used in describing if certain information/data has been checked with more than one sources.
domain: Agency
range: boolean
type: Property
range: Resource
domain: Thing
domain: Resource

Management of a Crisis (MOAC) Vocabulary Specification
conforms to: rdfa-syntax
description: Efforts have been made to involve a number of international humanitarian and crowdsourcing volunteering communities to authenticate MOAC usability, functionality and structures. Since, the vocabulary is still evolving, necessary changes based on expert recommendations will be carefully documented and necessary changes will be continuously updated in the same platform.
type: Document
alternate: moac-2012-01-29.rdf
stylesheet: main.css
label: Document that defines the Management of a Crisis Vocabulary
primary topic: Management of a Crisis Vocabulary namespace

shelterOfferedAt
type: DataProperty
comment: shelterOfferedAt relates "where" shelter relief agencies provided relief items.
range: ShelterAgency
range: Where3W
range: Location
type: Property
range: Resource

supplyingAgency
type: DataProperty
comment: supplyingAgency indicates the name of an organisation that is responsible to provide humanitarian relief items.
range: ShelterAgency
range: moac:Who3W
range: string
type: Property
range: Resource
range: Thing

Tomi Kauppinen
type: Person

title
type: DataProperty
comment: category is about the sort of an incident.
domain: Incident
range: string
type: Property
range: Resource
domain: Thing
domain: Resource

affectedby
type: DataProperty
comment: affectedby indicates disaster which has influence on population.
comment: affectedby indicates the relation of people being affected by certain disaster.
range: AffectedPopulation
range: NaturalHazard
range: NaturalHazards
range: ShelterOffered
type: Property
range: Thing
range: Resource

involvedIn
type: DataProperty
comment: involvedIn indicates the agency that is involved with humanitarian activities/response in a disaster.
range: ShelterActivity
range: ShelterAgency
range: ShelterResponse
type: Property
range: Resource
range: Thing

hasOrganisationID
type: DataProperty
comment: hasOrganisationID is a unique identification number given to relief agency.
range: ShelterAgency
range: moac:Who3W
range: string
type: Property
range: Resource
range: Thing

date
type: DataProperty
comment: date indicates a particular date.
range: date
type: Property
range: Resource

approved
type: DataProperty
comment: approved is a data property to attest a event or incident or document is true or not.
domain: Agency
range: boolean
type: Property
range: Resource
domain: Thing
domain: Resource

belongsToCluster
type: DataProperty
comment: belongsToCluster indicates the organisation which belongs to a specific IASC cluster for example, emergency Shelter cluster or Food Cluster.
range: IASCCluster
range: moac:Who3W
type: Property
range: Resource
range: Thing

atLocation
type: DataProperty
comment: GeoLocationLatitude is a data property used to link location or "Where" with specific longitude in the form of decimal degree.
domain: Where3W
range: float
type: Property
range: Resource
domain: Thing
domain: Resource

hasShelterItems
type: DataProperty
comment: hasShelterItems indicates the name or a type of shelter related items.
range: ShelterItems
range: string
type: Property
range: Resource
range: Thing

Management of a Crisis Vocabulary namespace
created: 2012-01-29T20:30:00Z
creator: Tomi Kauppinen
created by: http://lodlaundromat.org/.well-known/genid/fe8d8faed6702d7784e1ccba87e71ab5#1
type: DataItem
type: Ontology

countOfAffectedPopulation
type: DataProperty
comment: countOfAffectedPopulation indicates the total number of people affected by a certain disaster.
range: AffectedPopulation
range: int
type: Property
range: Resource
range: Thing

organizationName
type: DataProperty
comment: organizationName indicates the name of the organisation for a specific IASC cluster like emergency Shelter cluster or Food Cluster.
range: IASCCluster
range: ShelterAgency
range: Who3W
type: Property
range: Resource
range: Thing

NFINeededAt
type: DataProperty
comment: NFINeededAt relates "where" Non Food Items response might be necessary.
range: AffectedPopulation
range: Where3W
range: Location
type: Property
range: Resource

ns#
description: MOAC, the Management of a Crisis Vocabulary, is a lightweight vocabulary aiming to provide terms to enable practitioners to relate different "things" in crisis management activities together as Linked Data. The initial MOAC terms originated from the Inter Agency Standing Committee (IASC), Emergency Shelter Cluster in Haiti, UNOCHA 3W Who What Where Contact Database and

hasNFIItems
type: DataProperty
comment: hasNFIItems indicates the name or a type of Non Food Items.
range: NFIItems
range: string
type: Property
range: Resource
range: Thing

tentDistbn
type: DataProperty
comment: tentDistbn relates the amount (count) of shelter items being offered.
range: ShelterOffered
range: int
type: Property
range: Resource

impact
type: DataProperty
comment: Impact is the effect or impression of disaster on population or infrastructure
range: AffectedPopulation
range: InfrastructureDamage
range: NaturalHazard
type: Property
range: Resource
range: Thing