Community Fisheries Control Agency
based near: Vigo
alternative label: CFCA
lat: 42.231358
description: The Community Fisheries Control Agency (CFCA)'s goals are to co-ordinate the operational activities of Member States in the area of fisheries, and provide assistance to the Member States in their application of the CFP.
type: Policy Agency
long: -8.712447
point: 42.231356 -8.712447
subject: Executive (government)
type: Regulatory Agency
type: Thing
type: organización
type: Organization
type: Decentralised body of the European Union
type: http://lodlaundromat.org/.well-known/genid/samples/jena///class//fb392f1f41dc748adcc2dbd6019e71b4/218f3af31162c0199ca266130c18209c#14
type: Agent
type: http://lodlaundromat.org/.well-known/genid/samples/jena///class//fb392f1f41dc748adcc2dbd6019e71b4/218f3af31162c0199ca266130c18209c#11
different from: directora ejecutiva

European Parliament
long: 7.769092
alternative label: EP
point: 48.597512 7.769092
type: Institution of the European Union
lat: 48.59751
based near: Strasbourg
description: The European Parliament (EP) is elected by the citizens of the European Union to represent their interests.
subject: Legislature
type: Thing
type: organización
type: http://lodlaundromat.org/.well-known/genid/samples/jena///class//fb392f1f41dc748adcc2dbd6019e71b4/218f3af31162c0199ca266130c18209c#14
type: Organization
type: Agent
type: http://lodlaundromat.org/.well-known/genid/samples/jena///class//fb392f1f41dc748adcc2dbd6019e71b4/218f3af31162c0199ca266130c18209c#11
different from: directora ejecutiva

es condición de miembro sobre organización
range: Thing
domain: Thing
range: organización
comment: Indica l'Organization in cui l'Agent è un membro. @it
comment: Indique l'Organization dont l'agent est membre. @fr
domain: membresía
comment: Organización a la que pertenece el agente en calidad de miembro.
comment: Indicates Organization in which the Agent is a member. @en
type: FunctionalProperty
type: Property
label: organization @en
label: organizzazione @it
comment: エージェントがメンバーである組織を示します。 @ja
type: ObjectProperty
label: organisation @fr
range: Resource
range: Organization
range: http://lodlaundromat.org/.well-known/genid/samples/jena///class//fb392f1f41dc748adcc2dbd6019e71b4/218f3af31162c0199ca266130c18209c#11
range: Agent
range: http://lodlaundromat.org/.well-known/genid/samples/jena///class//fb392f1f41dc748adcc2dbd6019e71b4/218f3af31162c0199ca266130c18209c#14
domain: Resource
domain: http://lodlaundromat.org/.well-known/genid/samples/jena///class//fb392f1f41dc748adcc2dbd6019e71b4/218f3af31162c0199ca266130c18209c#17

European Defence Agency
alternative label: EDA
type: Common Security and Defence Policy Agency
based near: Brussels
description: The European Defence Agency (EDA) is an agency of the European Union based in Brussels. It is a Common Foreign and Security Policy (CFSP) body set up on 12 July 2004, reporting to the Council of the European Union.
long: 4.38393
point: 50.83924 4.38393
subject: Executive (government)
lat: 50.83924
type: Thing
type: Decentralised body of the European Union
type: Regulatory Agency
type: http://lodlaundromat.org/.well-known/genid/samples/jena///class//fb392f1f41dc748adcc2dbd6019e71b4/218f3af31162c0199ca266130c18209c#14
type: organización
type: Organization
type: Agent
type: http://lodlaundromat.org/.well-known/genid/samples/jena///class//fb392f1f41dc748adcc2dbd6019e71b4/218f3af31162c0199ca266130c18209c#11
different from: directora ejecutiva

Office for Harmonisation in the Internal Market (Trade Marks and Designs)
type: Regulatory Agency
type: Thing
based near: Alicante
subject: Executive (government)
point: 38.345278 -0.483056
long: -0.483056
description: The OHIM is the official authority carrying out the procedures for the Community trade marks since 1996 and for the Community registered design from 2003.
alternative label: OHIM
type: Policy Agency
lat: 38.34528
type: Decentralised body of the European Union
type: http://lodlaundromat.org/.well-known/genid/samples/jena///class//fb392f1f41dc748adcc2dbd6019e71b4/218f3af31162c0199ca266130c18209c#14
type: organización
type: Organization
type: Agent
type: http://lodlaundromat.org/.well-known/genid/samples/jena///class//fb392f1f41dc748adcc2dbd6019e71b4/218f3af31162c0199ca266130c18209c#11
different from: directora ejecutiva

European Joint Undertaking for ITER and the Development of Fusion Energy
type: Thing
type: http://lodlaundromat.org/.well-known/genid/samples/jena///class//fb392f1f41dc748adcc2dbd6019e71b4/218f3af31162c0199ca266130c18209c#14
type: Decentralised body of the European Union
type: organización
type: Organization
type: Agent
type: http://lodlaundromat.org/.well-known/genid/samples/jena///class//fb392f1f41dc748adcc2dbd6019e71b4/218f3af31162c0199ca266130c18209c#11
alternative label: F4E
description: Fusion for Energy (F4E) was established in April 2007 for a period of 35 years. It primarily manages Europe’s contribution to ITER, the international fusion energy project. One of its main tasks is to work together with European industry and research organisations to develop and provide a wide range of high technology components for the ITER project.
subject: Executive (government)
lat: 41.40722
point: 41.40722 2.21823
type: EURATOM Agency
alternative label: Fusion for Energy
long: 2.21823
based near: Barcelona
different from: directora ejecutiva

European Economic and Social Committee
long: 4.377222
type: Consultative body of the European Union
alternative label: EESC
subject: Executive (government)
point: 50.840556 4.377222
lat: 50.840557
based near: Brussels
description: The European Economic and Social Committee (EESC) is an advisory body representing employers, trade unions, farmers, consumers and the other interest groups that collectively make up 'organised civil society'. It presents their views and defends their interests in policy discussions with the Commission, the Council and the European Parliament.
type: Thing
type: organización
type: Organization
type: http://lodlaundromat.org/.well-known/genid/samples/jena///class//fb392f1f41dc748adcc2dbd6019e71b4/218f3af31162c0199ca266130c18209c#14
type: Agent
type: http://lodlaundromat.org/.well-known/genid/samples/jena///class//fb392f1f41dc748adcc2dbd6019e71b4/218f3af31162c0199ca266130c18209c#11
different from: directora ejecutiva

European Environment Agency
type: Regulatory Agency
type: Thing
type: organización
type: Organization
lat: 55.67611
subject: Executive (government)
point: 55.676111 12.568333
based near: Copenhagen
type: Policy Agency
alternative label: EEA
long: 12.568333
description: The European Environment Agency (EEA) is devoted to establishing a monitoring network for the monitoring of the European environment.
type: Decentralised body of the European Union
type: http://lodlaundromat.org/.well-known/genid/samples/jena///class//fb392f1f41dc748adcc2dbd6019e71b4/218f3af31162c0199ca266130c18209c#14
type: Agent
type: http://lodlaundromat.org/.well-known/genid/samples/jena///class//fb392f1f41dc748adcc2dbd6019e71b4/218f3af31162c0199ca266130c18209c#11
different from: directora ejecutiva

European Medicines Agency
type: Regulatory Agency
type: Thing
type: organización
type: Organization
type: http://lodlaundromat.org/.well-known/genid/samples/jena///class//fb392f1f41dc748adcc2dbd6019e71b4/218f3af31162c0199ca266130c18209c#14
type: http://lodlaundromat.org/.well-known/genid/samples/jena///class//fb392f1f41dc748adcc2dbd6019e71b4/218f3af31162c0199ca266130c18209c#11
type: Decentralised body of the European Union
type: Agent
type: Policy Agency
subject: Executive (government)
long: -0.1275
based near: London
description: The European Medicines Agency is a decentralised body of the European Union with headquarters in London. Its main responsibility is the protection and promotion of public and animal health, through the evaluation and supervision of medicines for human and veterinary use.
lat: 51.50722
point: 51.507222 -0.1275
alternative label: EMA
different from: directora ejecutiva

European Foundation for the Improvement of Living and Working Conditions
point: 53.347778 -6.259722
description: The European Foundation for the Improvement of Living and Working Conditions contributes to the planning and establishment of better living and working conditions in Europe. It provides findings, knowledge and advice from independent and comparative research, to governments, employers, trade unions and the European Commission.
long: -6.259722
based near: Dublin, Ireland
type: Policy Agency
subject: Executive (government)
alternative label: EUROFOUND
lat: 53.34778
type: Regulatory Agency
type: Thing
type: organización
type: Organization
type: Decentralised body of the European Union
type: http://lodlaundromat.org/.well-known/genid/samples/jena///class//fb392f1f41dc748adcc2dbd6019e71b4/218f3af31162c0199ca266130c18209c#14
type: Agent
type: http://lodlaundromat.org/.well-known/genid/samples/jena///class//fb392f1f41dc748adcc2dbd6019e71b4/218f3af31162c0199ca266130c18209c#11
different from: directora ejecutiva

European Police College
description: CEPOL - European Police College brings together senior police officers across Europe with the aim to encourage cross-border cooperation in the fight against crime, maintenance of public security and law and order.
alternative label: CEPOL
based near: Bramshill
long: -0.923435
lat: 51.34528
type: Police and judicial cooperation in criminal matters Agency
point: 51.34528, -0.923435
subject: Executive (government)
type: Thing
type: Decentralised body of the European Union
type: http://lodlaundromat.org/.well-known/genid/samples/jena///class//fb392f1f41dc748adcc2dbd6019e71b4/218f3af31162c0199ca266130c18209c#14
type: organización
type: Organization
type: Agent
type: Regulatory Agency
type: http://lodlaundromat.org/.well-known/genid/samples/jena///class//fb392f1f41dc748adcc2dbd6019e71b4/218f3af31162c0199ca266130c18209c#11
different from: directora ejecutiva

European Central Bank
type: Thing
description: The European Central Bank's job is to manage the euro - the EU's single currency. The ECB is also responsible for framing and implementing the EU's economic and monetary policy.
long: 8.674
subject: Executive (government)
point: 50.1095 8.674
lat: 50.1095
type: Financial body of the European Union
based near: Frankfurt
alternative label: ECB
type: organización
type: http://lodlaundromat.org/.well-known/genid/samples/jena///class//fb392f1f41dc748adcc2dbd6019e71b4/218f3af31162c0199ca266130c18209c#14
type: Organization
type: Agent
type: http://lodlaundromat.org/.well-known/genid/samples/jena///class//fb392f1f41dc748adcc2dbd6019e71b4/218f3af31162c0199ca266130c18209c#11
different from: directora ejecutiva

European GNSS Supervisory Authority
description: The European GNSS Agency (GSA; formerly European GNSS Supervisory Authority) is an agency of the European Union based in Brussels, Belgium. Its objective is to ensure that essential public interests are properly defended and represented in connection with European Union's satellite navigation programmes (GALILEO and EGNOS).
alternative label: GSA
type: Policy Agency
lat: 50.83924
based near: Brussels
long: 4.38393
point: 50.83924 4.38393
subject: Executive (government)
type: Regulatory Agency
type: Thing
type: Decentralised body of the European Union
type: http://lodlaundromat.org/.well-known/genid/samples/jena///class//fb392f1f41dc748adcc2dbd6019e71b4/218f3af31162c0199ca266130c18209c#14
type: organización
type: Organization
type: Agent
type: http://lodlaundromat.org/.well-known/genid/samples/jena///class//fb392f1f41dc748adcc2dbd6019e71b4/218f3af31162c0199ca266130c18209c#11
different from: directora ejecutiva

Agency for the Cooperation of Energy Regulators
subject: Executive (government)
lat: 46.062
alternative label: ACER
description: ACER's mission is to assist National Regulatory Authorities in exercising, at Community level, the regulatory tasks that they perform in the Member States and, where necessary, to coordinate their action.
based near: Ljubljana
type: Policy Agency
point: 46.062 14.509
long: 14.509
type: Regulatory Agency
type: Thing
type: organización
type: Organization
type: http://lodlaundromat.org/.well-known/genid/samples/jena///class//fb392f1f41dc748adcc2dbd6019e71b4/218f3af31162c0199ca266130c18209c#14
type: http://lodlaundromat.org/.well-known/genid/samples/jena///class//fb392f1f41dc748adcc2dbd6019e71b4/218f3af31162c0199ca266130c18209c#11
type: Decentralised body of the European Union
type: Agent
different from: directora ejecutiva

European Police College
type: Thing
type: Decentralised body of the European Union
type: http://lodlaundromat.org/.well-known/genid/samples/jena///class//fb392f1f41dc748adcc2dbd6019e71b4/218f3af31162c0199ca266130c18209c#14
type: organización
type: Organization
type: Agent
type: Regulatory Agency
type: http://lodlaundromat.org/.well-known/genid/samples/jena///class//fb392f1f41dc748adcc2dbd6019e71b4/218f3af31162c0199ca266130c18209c#11
description: CEPOL - European Police College brings together senior police officers across Europe with the aim to encourage cross-border cooperation in the fight against crime, maintenance of public security and law and order.
alternative label: CEPOL
based near: Bramshill
long: -0.923435
lat: 51.34528
type: Police and judicial cooperation in criminal matters Agency
point: 51.34528, -0.923435
subject: Executive (government)
different from: directora ejecutiva

European Institute for Gender Equality
type: Regulatory Agency
type: Thing
type: organización
type: Organization
alternative label: EIGE
lat: 54.683334
long: 25.283333
based near: Vilnius
type: Policy Agency
point: 54.683333 25.283333
subject: Executive (government)
description: The European Institute for Gender Equality supports the EU institutions and the Member States in promoting equality between women and men and combating sex discrimination.
type: Decentralised body of the European Union
type: http://lodlaundromat.org/.well-known/genid/samples/jena///class//fb392f1f41dc748adcc2dbd6019e71b4/218f3af31162c0199ca266130c18209c#14
type: Agent
type: http://lodlaundromat.org/.well-known/genid/samples/jena///class//fb392f1f41dc748adcc2dbd6019e71b4/218f3af31162c0199ca266130c18209c#11
different from: directora ejecutiva

The European Union’s Judicial Cooperation Unit
description: Eurojust is a European Union body established in 2002 to stimulate and improve the co-ordination of investigations and prosecutions among the competent judicial authorities of the European Union Member States when they deal with serious cross-border and organised crime.
based near: The Hague
point: 52.083333 4.316667
type: Police and judicial cooperation in criminal matters Agency
alternative label: EUROJUST
lat: 52.083332
subject: Executive (government)
long: 4.316667
type: Regulatory Agency
type: Thing
type: organización
type: Organization
type: http://lodlaundromat.org/.well-known/genid/samples/jena///class//fb392f1f41dc748adcc2dbd6019e71b4/218f3af31162c0199ca266130c18209c#14
type: http://lodlaundromat.org/.well-known/genid/samples/jena///class//fb392f1f41dc748adcc2dbd6019e71b4/218f3af31162c0199ca266130c18209c#11
type: Decentralised body of the European Union
type: Agent
different from: directora ejecutiva

Consultative body of the European Union
subclass of: Organization
subclass of: organización
type: Class

Research Executive Agency
subject: Executive (government)
based near: Brussels
lat: 50.83924
point: 50.83924 4.38393
long: 4.38393
description: The Research Executive Agency (REA), located in Brussels, was created in December 2007. Managing over €6.5 billion, it started its work in 2008, and became fully autonomous on 15 June 2009.
type: Executive Agency
alternative label: REA
type: Thing
type: Decentralised body of the European Union
type: http://lodlaundromat.org/.well-known/genid/samples/jena///class//fb392f1f41dc748adcc2dbd6019e71b4/218f3af31162c0199ca266130c18209c#14
type: organización
type: Organization
type: Agent
type: http://lodlaundromat.org/.well-known/genid/samples/jena///class//fb392f1f41dc748adcc2dbd6019e71b4/218f3af31162c0199ca266130c18209c#11
different from: directora ejecutiva

Executive Agency for Competitiveness and Innovation
type: Thing
type: organización
type: Organization
type: Decentralised body of the European Union
type: http://lodlaundromat.org/.well-known/genid/samples/jena///class//fb392f1f41dc748adcc2dbd6019e71b4/218f3af31162c0199ca266130c18209c#14
type: http://lodlaundromat.org/.well-known/genid/samples/jena///class//fb392f1f41dc748adcc2dbd6019e71b4/218f3af31162c0199ca266130c18209c#11
type: Agent
description: Executive Agency for Competitiveness and Innovation (EACI) manages high-quality European funding schemes and initiatives in several areas.
alternative label: EACI
based near: Brussels
subject: Executive (government)
type: Executive Agency
long: 4.38393
lat: 50.83924
point: 50.83924 4.38393
different from: directora ejecutiva

European Chemicals Agency
type: Regulatory Agency
type: Thing
type: Decentralised body of the European Union
type: http://lodlaundromat.org/.well-known/genid/samples/jena///class//fb392f1f41dc748adcc2dbd6019e71b4/218f3af31162c0199ca266130c18209c#14
type: organización
type: Organization
type: Agent
type: http://lodlaundromat.org/.well-known/genid/samples/jena///class//fb392f1f41dc748adcc2dbd6019e71b4/218f3af31162c0199ca266130c18209c#11
subject: Executive (government)
based near: Helsinki
long: 24.9375
alternative label: ECHA
type: Policy Agency
description: The European Chemicals Agency (ECHA) manages the technical, scientific and administrative aspects of the Registration, Evaluation, Authorisation and Restriction of Chemicals (REACH) system.
point: 60.170833 24.9375
lat: 60.170834
different from: directora ejecutiva

European GNSS Supervisory Authority
type: Regulatory Agency
description: The European GNSS Agency (GSA; formerly European GNSS Supervisory Authority) is an agency of the European Union based in Brussels, Belgium. Its objective is to ensure that essential public interests are properly defended and represented in connection with European Union's satellite navigation programmes (GALILEO and EGNOS).
alternative label: GSA
type: Policy Agency
lat: 50.83924
based near: Brussels
long: 4.38393
point: 50.83924 4.38393
subject: Executive (government)
type: Thing
type: Decentralised body of the European Union
type: http://lodlaundromat.org/.well-known/genid/samples/jena///class//fb392f1f41dc748adcc2dbd6019e71b4/218f3af31162c0199ca266130c18209c#14
type: organización
type: Organization
type: Agent
type: http://lodlaundromat.org/.well-known/genid/samples/jena///class//fb392f1f41dc748adcc2dbd6019e71b4/218f3af31162c0199ca266130c18209c#11
different from: directora ejecutiva

European Monitoring Centre for Drugs and Drug Addiction
subject: Executive (government)
long: -9.139386
lat: 38.71381
based near: Lisbon
description: The European Monitoring Centre for Drugs and Drug Addiction (EMCDDA) is the hub of drug-related information in the European Union. Its role is to gather, analyse and disseminate ‘objective, reliable and comparable information’ on drugs and drug addiction and, in so doing, provide its audiences with a sound and evidence-based picture of the drug phenomenon at European level.
alternative label: EMCDDA
type: Policy Agency
point: 38.713811 -9.139386
type: Regulatory Agency
type: Thing
type: organización
type: Organization
type: Decentralised body of the European Union
type: http://lodlaundromat.org/.well-known/genid/samples/jena///class//fb392f1f41dc748adcc2dbd6019e71b4/218f3af31162c0199ca266130c18209c#14
type: Agent
type: http://lodlaundromat.org/.well-known/genid/samples/jena///class//fb392f1f41dc748adcc2dbd6019e71b4/218f3af31162c0199ca266130c18209c#11
different from: directora ejecutiva

European Union Satellite Centre
type: Thing
type: Decentralised body of the European Union
type: Regulatory Agency
type: http://lodlaundromat.org/.well-known/genid/samples/jena///class//fb392f1f41dc748adcc2dbd6019e71b4/218f3af31162c0199ca266130c18209c#14
type: organización
type: Organization
type: Agent
type: http://lodlaundromat.org/.well-known/genid/samples/jena///class//fb392f1f41dc748adcc2dbd6019e71b4/218f3af31162c0199ca266130c18209c#11
type: Common Security and Defence Policy Agency
long: -3.483333
based near: Torrejón de Ardoz
alternative label: EUSC
lat: 40.45
description: The European Union Satellite Centre (EUSC) is an agency of the European Union's (EU) Council of Ministers which gathers information through satellite images.
subject: Executive (government)
point: 40.45 -3.483333
different from: directora ejecutiva

organización formal
subclass of: Resource
subclass of: Thing
comment: Organización reconocida a nivel mundial, en particular en jurisdicciones legales, con derechos y responsabilidades asociadas. Algunos ejemplos son: organización corporativa, organización benéfica, organización gubernamental, organización religiosa. Se debe tener en cuenta que ésta es una superclase de `gr:BusinessEntity` y que se recomienda el uso del vocabulario GoodRelations para referirse a clasificaciones de negocios tales como DUNS o NAICS.
label: Organisation Formelle @fr
comment: 関連する権利と責任を有する（特に法的管轄区域において）世界中に広く認識されている組織。例には、企業、慈善団体、政府や教会が含まれます。 @ja
type: Class
subclass of: organización
subclass of: Organization
comment: Un'organizzazione che è riconosciuta a livello mondiale o, in generale, all'interno di una qualche giurisdizione, e che quindi possiede diritti e responsabilità. Ad esempio aziende, enti governativi, associazioni di volontariato. Si noti che questa è una superclasse di `gr:BusinessEntity` e che quindi è raccomandabile usare il vocabolario GoodRelations per esprimere classificazioni di tipo industriale e commerciale come DUNS e NAICS. @it
comment: Une Organisation reconnue, en particulier par les juridictions locales, ayant des droits et des responsabilités. Exemples : entreprises, association à but non-lucratif, collectivité, église. Notez que c'est une super-classe de `gr:BusinessEntity` et qu'il est recommandé d'utiliser le vocabulaire GoodRelations pour indiquer les classifications économiques comme le code NACE. @fr
label: Formal Organization @en
label: Organizzazione formale @it
comment: An Organization which is recognized in the world at large, in particular in legal jurisdictions, with associated rights and responsibilities. Examples include a Corporation, Charity, Government or Church. Note that this is a super class of `gr:BusinessEntity` and it is recommended to use the GoodRelations vocabulary to denote Business classifications such as DUNS or NAICS. @en
subclass of: http://lodlaundromat.org/.well-known/genid/samples/jena///class//fb392f1f41dc748adcc2dbd6019e71b4/218f3af31162c0199ca266130c18209c#14
subclass of: http://lodlaundromat.org/.well-known/genid/samples/jena///class//fb392f1f41dc748adcc2dbd6019e71b4/218f3af31162c0199ca266130c18209c#11
subclass of: Agent

pertenece a la clasificación
range: Thing
domain: Thing
type: ObjectProperty
comment: Indica una classificazione per questa Organization all'interno di un qualche schema di classificazione. Alcuni vocabolari potrebbero voler specializzare questa proprietà per avere un codominio corrispondente a uno specifico `skos:ConceptScheme`. Si noti che la presenza di questa proprietà è ancora in fase di discussione e potrebbe essere revisionata o rimossa. @it
type: Property
comment: ある分類表内のこの組織に対する分類を示します。 アプリケーションがorg:Organizationのサブクラスを組織的なカテゴリーを表わす手段として定義することも許容されることに注意してください。 @ja
label: classificazione @it
comment: Indique une classification pour cette Organisation dans le cadre d'un schéma de classification. Il est possible de spécialiser cette propriété en utilisant un vocabulaire spécialisé pour que le champ corresponde à un concept spécifique `skos:ConceptScheme`. Cette propriété est en discussion est pourrait être révisée ou supprimée - dans de nombreux cas, les organisations sont mieux catégorisées par une hiérarchie de sous-classe dans un vocabulaire externe. @fr
range: Concept
comment: Ordenación jerárquica que se hace de una organización dentro de un esquema de clasificación. Es posible que algunos vocabularios especifiquen esta propiedad de forma que el rango se corresponda con un `skos:ConceptScheme` específico. La conveniencia de incluir esta propiedad se está debatiendo y puede que se revise o elimine (en muchos casos las organizaciones se clasifican mejor si se define una jerarquía de subclases en un vocabulario aparte)
label: classification @en
comment: Indicates a classification for this Organization within some classification scheme. Extension vocabularies may wish to specialize this property to have a range corresponding to a specific `skos:ConceptScheme`. This property is under discussion and may be revised or removed - in many cases organizations are best categorized by defining a sub-class hierarchy in an extension vocabulary. @en
domain: organización
range: Resource
domain: Resource
domain: http://lodlaundromat.org/.well-known/genid/samples/jena///class//fb392f1f41dc748adcc2dbd6019e71b4/218f3af31162c0199ca266130c18209c#14
domain: http://lodlaundromat.org/.well-known/genid/samples/jena///class//fb392f1f41dc748adcc2dbd6019e71b4/218f3af31162c0199ca266130c18209c#11
domain: Agent
domain: Organization

Education, Audiovisual and Culture Executive Agency
type: Executive Agency
alternative label: EACEA
lat: 50.83924
description: The Executive Agency Education, Audiovisual and Culture (EACEA) implements a number of strands of more than 15 Community funded programmes and actions in the fields of education and training, active citizenship, youth, audiovisual and culture.
based near: Brussels
long: 4.38393
point: 50.83924 4.38393
subject: Executive (government)
type: Thing
type: organización
type: Organization
type: Decentralised body of the European Union
type: http://lodlaundromat.org/.well-known/genid/samples/jena///class//fb392f1f41dc748adcc2dbd6019e71b4/218f3af31162c0199ca266130c18209c#14
type: Agent
type: http://lodlaundromat.org/.well-known/genid/samples/jena///class//fb392f1f41dc748adcc2dbd6019e71b4/218f3af31162c0199ca266130c18209c#11
different from: directora ejecutiva

European Food Safety Authority
type: Regulatory Agency
type: Thing
type: organización
type: Organization
type: http://lodlaundromat.org/.well-known/genid/samples/jena///class//fb392f1f41dc748adcc2dbd6019e71b4/218f3af31162c0199ca266130c18209c#14
type: http://lodlaundromat.org/.well-known/genid/samples/jena///class//fb392f1f41dc748adcc2dbd6019e71b4/218f3af31162c0199ca266130c18209c#11
type: Decentralised body of the European Union
subject: Executive (government)
based near: Parma
alternative label: EFSA
description: The European Food Safety Authority (EFSA) provides independent scientific advice on all matters with a direct or indirect impact on food safety — including animal health and welfare and plant protection. EFSA is also consulted on nutrition in relation to Community legislation.
lat: 44.8
type: Policy Agency
point: 44.8 10.333333
long: 10.333333
type: Agent
different from: directora ejecutiva

Executive Agency for Health and Consumers
type: Thing
type: organización
type: Organization
type: Decentralised body of the European Union
alternative label: EAHC
type: Executive Agency
based near: Luxembourg (city)
description: The Executive Agency for the Public Health Programme (PHEA) was established in 2005 to improve the implementation of the Community public health programme. In 2008, the European Commission transformed PHEA into the Executive Agency for Health and Consumers. The agency was entrusted with new tasks in the field of consumer protection and food safety training, and its mandate was extended until the end of 2015.
point: 49.62297 6.1472
lat: 49.62297
subject: Executive (government)
long: 6.1472
type: http://lodlaundromat.org/.well-known/genid/samples/jena///class//fb392f1f41dc748adcc2dbd6019e71b4/218f3af31162c0199ca266130c18209c#14
type: Agent
type: http://lodlaundromat.org/.well-known/genid/samples/jena///class//fb392f1f41dc748adcc2dbd6019e71b4/218f3af31162c0199ca266130c18209c#11
different from: directora ejecutiva

European Foundation for the Improvement of Living and Working Conditions
type: Regulatory Agency
type: Thing
type: organización
type: Organization
point: 53.347778 -6.259722
description: The European Foundation for the Improvement of Living and Working Conditions contributes to the planning and establishment of better living and working conditions in Europe. It provides findings, knowledge and advice from independent and comparative research, to governments, employers, trade unions and the European Commission.
long: -6.259722
based near: Dublin, Ireland
type: Policy Agency
subject: Executive (government)
alternative label: EUROFOUND
lat: 53.34778
type: Decentralised body of the European Union
type: http://lodlaundromat.org/.well-known/genid/samples/jena///class//fb392f1f41dc748adcc2dbd6019e71b4/218f3af31162c0199ca266130c18209c#14
type: Agent
type: http://lodlaundromat.org/.well-known/genid/samples/jena///class//fb392f1f41dc748adcc2dbd6019e71b4/218f3af31162c0199ca266130c18209c#11
different from: directora ejecutiva

Office for Harmonisation in the Internal Market (Trade Marks and Designs)
based near: Alicante
subject: Executive (government)
point: 38.345278 -0.483056
long: -0.483056
description: The OHIM is the official authority carrying out the procedures for the Community trade marks since 1996 and for the Community registered design from 2003.
alternative label: OHIM
type: Policy Agency
lat: 38.34528
type: Regulatory Agency
type: Thing
type: Decentralised body of the European Union
type: http://lodlaundromat.org/.well-known/genid/samples/jena///class//fb392f1f41dc748adcc2dbd6019e71b4/218f3af31162c0199ca266130c18209c#14
type: organización
type: Organization
type: Agent
type: http://lodlaundromat.org/.well-known/genid/samples/jena///class//fb392f1f41dc748adcc2dbd6019e71b4/218f3af31162c0199ca266130c18209c#11
different from: directora ejecutiva

European Ombudsman
type: Thing
type: organización
type: Organization
type: http://lodlaundromat.org/.well-known/genid/samples/jena///class//fb392f1f41dc748adcc2dbd6019e71b4/218f3af31162c0199ca266130c18209c#14
type: http://lodlaundromat.org/.well-known/genid/samples/jena///class//fb392f1f41dc748adcc2dbd6019e71b4/218f3af31162c0199ca266130c18209c#11
subject: Executive (government)
point: 48.597512 7.769092
type: Specialised body of the European Union
based near: Strasbourg
lat: 48.59751
alternative label: Ombudsman
long: 7.769092
description: The European Ombudsman acts as an intermediary between the citizen and the EU authorities. He is entitled to receive and investigate complaints from EU citizens, businesses and organisations, and from anyone residing or having their registered office in an EU country.
type: Agent
different from: directora ejecutiva

Court of Auditors
lat: 49.62297
alternative label: ECA
type: Institution of the European Union
description: The Court of Auditor's job is to check that EU funds, which come from the taxpayers, are properly collected and that they are spent legally, economically and for the intended purpose. Its aim is to ensure that the taxpayers get maximum value for their money, and it has the right to audit any person or organisation handling EU funds.
subject: Executive (government)
based near: Luxembourg (city)
point: 49.62297 6.1472
long: 6.1472
type: Thing
type: organización
type: http://lodlaundromat.org/.well-known/genid/samples/jena///class//fb392f1f41dc748adcc2dbd6019e71b4/218f3af31162c0199ca266130c18209c#14
type: Organization
type: Agent
type: http://lodlaundromat.org/.well-known/genid/samples/jena///class//fb392f1f41dc748adcc2dbd6019e71b4/218f3af31162c0199ca266130c18209c#11
different from: directora ejecutiva

Education, Audiovisual and Culture Executive Agency
type: Thing
type: organización
type: Organization
type: Decentralised body of the European Union
type: http://lodlaundromat.org/.well-known/genid/samples/jena///class//fb392f1f41dc748adcc2dbd6019e71b4/218f3af31162c0199ca266130c18209c#14
type: Agent
type: http://lodlaundromat.org/.well-known/genid/samples/jena///class//fb392f1f41dc748adcc2dbd6019e71b4/218f3af31162c0199ca266130c18209c#11
type: Executive Agency
alternative label: EACEA
lat: 50.83924
description: The Executive Agency Education, Audiovisual and Culture (EACEA) implements a number of strands of more than 15 Community funded programmes and actions in the fields of education and training, active citizenship, youth, audiovisual and culture.
based near: Brussels
long: 4.38393
point: 50.83924 4.38393
subject: Executive (government)
different from: directora ejecutiva

European Investment Fund
type: Thing
type: organización
type: http://lodlaundromat.org/.well-known/genid/samples/jena///class//fb392f1f41dc748adcc2dbd6019e71b4/218f3af31162c0199ca266130c18209c#14
type: http://lodlaundromat.org/.well-known/genid/samples/jena///class//fb392f1f41dc748adcc2dbd6019e71b4/218f3af31162c0199ca266130c18209c#11
type: Organization
based near: Luxembourg (city)
type: Financial body of the European Union
lat: 49.62151
point: 49.62151 6.1396
subject: Executive (government)
alternative label: EIF
long: 6.1396
description: The European Investment Fund (EIF) was set up to help small businesses.
type: Agent
different from: directora ejecutiva

Publications Office of the European Union
description: The Publications Office of the European Union acts as the publishing house for the EU institutions, producing and distributing all official European Union publications, on paper and in digital form.
lat: 49.59906
long: 6.13147
type: Interinstitutional body of the European Union
based near: Luxembourg (city)
alternative label: Publications Office
subject: Executive (government)
point: 49.59906 6.13147
type: Thing
type: organización
type: http://lodlaundromat.org/.well-known/genid/samples/jena///class//fb392f1f41dc748adcc2dbd6019e71b4/218f3af31162c0199ca266130c18209c#14
type: Organization
type: Agent
type: http://lodlaundromat.org/.well-known/genid/samples/jena///class//fb392f1f41dc748adcc2dbd6019e71b4/218f3af31162c0199ca266130c18209c#11
different from: directora ejecutiva

Research Executive Agency
subject: Executive (government)
based near: Brussels
lat: 50.83924
point: 50.83924 4.38393
long: 4.38393
description: The Research Executive Agency (REA), located in Brussels, was created in December 2007. Managing over €6.5 billion, it started its work in 2008, and became fully autonomous on 15 June 2009.
type: Executive Agency
alternative label: REA
type: Thing
type: organización
type: Organization
type: Decentralised body of the European Union
type: http://lodlaundromat.org/.well-known/genid/samples/jena///class//fb392f1f41dc748adcc2dbd6019e71b4/218f3af31162c0199ca266130c18209c#14
type: http://lodlaundromat.org/.well-known/genid/samples/jena///class//fb392f1f41dc748adcc2dbd6019e71b4/218f3af31162c0199ca266130c18209c#11
type: Agent
different from: directora ejecutiva

es organización original
range: Thing
domain: Thing
sub property of: used
range: organización
label: organizzazione originale @it
comment: Indica una o più organizzazioni pregresse rispetto a un evento di cambiamento. A seconda dell'evento, queste organizzazioni potrebbero essere esistenti dopo l'evento o aver cessato la loro esistenza. È l'inverso di `org:changedBy`. @it
type: ObjectProperty
comment: Una o más organizaciones que existían antes de que sucediera el cambio en la organización. Dependiendo del tipo de cambio, dichas organizaciones pueden haber dejado de existir o no. Es la relación inversa de `org:changedBy`.
type: Property
inverse of: es modificado por
label: original organization @en
domain: evento de cambio
comment: Indique une ou plusieurs organisations qui ont existé avant un évènement de changement. Selon l'évènement, ces organisations ont pu continuer à exister ou non. Inverse de `org:changedBy`. @fr
label: organisation originelle @fr
comment: Indicates one or more organizations that existed before the change event. Depending on the event they may or may not have continued to exist after the event. Inverse of `org:changedBy`. @en
comment: 変更のきっかけとなった出来事以前に存在した1つ以上の組織を示します。出来事によって、出来事の後にそれらは存在し続けたかも、存在し続けなかったかもしれません。 @ja
range: Resource
range: Organization
range: http://lodlaundromat.org/.well-known/genid/samples/jena///class//fb392f1f41dc748adcc2dbd6019e71b4/218f3af31162c0199ca266130c18209c#11
range: Agent
range: http://lodlaundromat.org/.well-known/genid/samples/jena///class//fb392f1f41dc748adcc2dbd6019e71b4/218f3af31162c0199ca266130c18209c#14
domain: Resource
domain: Activity

European Maritime Safety Agency
type: Regulatory Agency
type: Thing
type: organización
type: Organization
alternative label: EMSA
description: The European Maritime Safety Agency (EMSA) is a European Union agency charged with reducing the risk of maritime accidents, marine pollution from ships and the loss of human lives at sea by helping to enforce the pertinent EU legislation.
subject: Executive (government)
point: 38.713811 -9.139386
long: -9.139386
lat: 38.71381
type: Policy Agency
based near: Lisbon
type: Decentralised body of the European Union
type: http://lodlaundromat.org/.well-known/genid/samples/jena///class//fb392f1f41dc748adcc2dbd6019e71b4/218f3af31162c0199ca266130c18209c#14
type: Agent
type: http://lodlaundromat.org/.well-known/genid/samples/jena///class//fb392f1f41dc748adcc2dbd6019e71b4/218f3af31162c0199ca266130c18209c#11
different from: directora ejecutiva

tiene sede principal en
range: Thing
domain: Thing
comment: Indicates a primary site for the Organization, this is the default means by which an Organization can be contacted and is not necessarily the formal headquarters. @en
type: Property
comment: Oficina principal de la organización, la opción por defecto para ponerse en contacto con una organización, aunque no corresponde necesariamente con las oficinas centrales de la organización.
comment: 組織の主要サイトを示します。組織の窓口となりえるデフォルトの手段ですが、正式な本部とは限りません。 @ja
comment: Indica la sede principale per l'Organization. È da considerarsi come la sede di default in cui l'Organization deve essere contattata pur non essendo necessariamente il quartier generale. @it
range: sede
label: site principal @fr
label: primary Site @en
sub property of: tiene sede en
type: ObjectProperty
domain: organización
comment: Indique le site principal d'une Organisation, le moyen par défaut par lequel l'Organisation peut être contactée et pas nécessairement le siège social légal. @fr
label: sede principale @it
range: Resource
domain: Resource
domain: Organization
domain: Agent
domain: http://lodlaundromat.org/.well-known/genid/samples/jena///class//fb392f1f41dc748adcc2dbd6019e71b4/218f3af31162c0199ca266130c18209c#14
domain: http://lodlaundromat.org/.well-known/genid/samples/jena///class//fb392f1f41dc748adcc2dbd6019e71b4/218f3af31162c0199ca266130c18209c#11

Publications Office of the European Union
type: Thing
description: The Publications Office of the European Union acts as the publishing house for the EU institutions, producing and distributing all official European Union publications, on paper and in digital form.
lat: 49.59906
long: 6.13147
type: Interinstitutional body of the European Union
based near: Luxembourg (city)
alternative label: Publications Office
subject: Executive (government)
point: 49.59906 6.13147
type: organización
type: http://lodlaundromat.org/.well-known/genid/samples/jena///class//fb392f1f41dc748adcc2dbd6019e71b4/218f3af31162c0199ca266130c18209c#14
type: Organization
type: Agent
type: http://lodlaundromat.org/.well-known/genid/samples/jena///class//fb392f1f41dc748adcc2dbd6019e71b4/218f3af31162c0199ca266130c18209c#11
different from: directora ejecutiva

es suborganización de manera transitiva de
range: Thing
domain: Thing
label: transitive sub-organization @en
comment: subOrganizationOfの推移閉包で、これを含むすべての組織の表現を与える。技術的に、これが推移閉包のスーパープロパティーであるため、追加の言明を含むことができますが、そのような使用法はお勧めできないことに注意してください。 @ja
type: TransitiveProperty
domain: organización
comment: È la chiusura transitiva di subOrganizationOf, quindi rappresenta tutte le organizzazioni che la contengono. Tecnicamente, essendo una chiusura transitiva, può contenere asserzioni che non la riguardano e quindi il suo uso è sconsigliato. @it
comment: La versión transitiva de la propiedad “subOrganizationOf”, es decir, la representación de todas las organizaciones en las que esta está contenida. Téngase en cuenta que desde el punto de vista técnico esta es una propiedad que contiene a todas las propiedades transitivas, de forma que podría contener afirmaciones adicionales, aunque su uso no está aconsejado.
label: es suborganización de (transitiva)
comment: La version transitive de la propriété subOrganizationOf, renvoie une représentation de toutes les organisations qui contiennent celle-ci. Notez que ceci est une super-propriété de la relation transitive donc elle pourrait contenir des assertions additionnelles mais cet usage n'est pas recommandé. @fr
label: sotto-Organization transitiva @it
comment: The transitive closure of subOrganizationOf, giving a representation of all organizations that contain this one. Note that technically this is a super property of the transitive closure so it could contain additional assertions but such usage is discouraged. @en
type: ObjectProperty
label: sous-Organization transitive de @fr
type: Property
range: organización
range: Resource
range: Organization
range: http://lodlaundromat.org/.well-known/genid/samples/jena///class//fb392f1f41dc748adcc2dbd6019e71b4/218f3af31162c0199ca266130c18209c#11
range: Agent
range: http://lodlaundromat.org/.well-known/genid/samples/jena///class//fb392f1f41dc748adcc2dbd6019e71b4/218f3af31162c0199ca266130c18209c#14
domain: Resource
domain: http://lodlaundromat.org/.well-known/genid/samples/jena///class//fb392f1f41dc748adcc2dbd6019e71b4/218f3af31162c0199ca266130c18209c#14
domain: http://lodlaundromat.org/.well-known/genid/samples/jena///class//fb392f1f41dc748adcc2dbd6019e71b4/218f3af31162c0199ca266130c18209c#11
domain: Agent
domain: Organization

European Investment Fund
based near: Luxembourg (city)
type: Financial body of the European Union
lat: 49.62151
point: 49.62151 6.1396
subject: Executive (government)
alternative label: EIF
long: 6.1396
description: The European Investment Fund (EIF) was set up to help small businesses.
type: Thing
type: organización
type: http://lodlaundromat.org/.well-known/genid/samples/jena///class//fb392f1f41dc748adcc2dbd6019e71b4/218f3af31162c0199ca266130c18209c#14
type: http://lodlaundromat.org/.well-known/genid/samples/jena///class//fb392f1f41dc748adcc2dbd6019e71b4/218f3af31162c0199ca266130c18209c#11
type: Organization
type: Agent
different from: directora ejecutiva

European Police Office
point: 52.083333 4.316667
type: Police and judicial cooperation in criminal matters Agency
description: Europol is the European Union law enforcement agency that handles the exchange and analysis of criminal intelligence. Its mission is to improve the effectiveness and cooperation between EU law enforcement authorities in preventing and combating serious international crime and terrorism, with the aim of achieving a safer Europe for all EU citizens.
alternative label: EUROPOL
based near: The Hague
subject: Executive (government)
long: 4.316667
lat: 52.083332
type: Regulatory Agency
type: Thing
type: organización
type: Organization
type: Decentralised body of the European Union
type: http://lodlaundromat.org/.well-known/genid/samples/jena///class//fb392f1f41dc748adcc2dbd6019e71b4/218f3af31162c0199ca266130c18209c#14
type: Agent
type: http://lodlaundromat.org/.well-known/genid/samples/jena///class//fb392f1f41dc748adcc2dbd6019e71b4/218f3af31162c0199ca266130c18209c#11
different from: directora ejecutiva

Committee of the Regions
subject: Executive (government)
based near: Brussels
point: 50.840556 4.377222
type: Consultative body of the European Union
alternative label: CoR
long: 4.377222
description: The Committee of the Regions (CoR) is an advisory body composed of representatives of Europe's regional and local authorities. The CoR has to be consulted before EU decisions are taken on matters such as regional policy, the environment, education and transport - all of which concern local and regional government.
lat: 50.840557
type: Thing
type: http://lodlaundromat.org/.well-known/genid/samples/jena///class//fb392f1f41dc748adcc2dbd6019e71b4/218f3af31162c0199ca266130c18209c#14
type: organización
type: Organization
type: Agent
type: http://lodlaundromat.org/.well-known/genid/samples/jena///class//fb392f1f41dc748adcc2dbd6019e71b4/218f3af31162c0199ca266130c18209c#11
different from: directora ejecutiva

Executive Agency for Competitiveness and Innovation
description: Executive Agency for Competitiveness and Innovation (EACI) manages high-quality European funding schemes and initiatives in several areas.
alternative label: EACI
based near: Brussels
subject: Executive (government)
type: Executive Agency
long: 4.38393
lat: 50.83924
point: 50.83924 4.38393
type: Thing
type: organización
type: Organization
type: Decentralised body of the European Union
type: http://lodlaundromat.org/.well-known/genid/samples/jena///class//fb392f1f41dc748adcc2dbd6019e71b4/218f3af31162c0199ca266130c18209c#14
type: http://lodlaundromat.org/.well-known/genid/samples/jena///class//fb392f1f41dc748adcc2dbd6019e71b4/218f3af31162c0199ca266130c18209c#11
type: Agent
different from: directora ejecutiva

European Police Office
type: Regulatory Agency
type: Thing
type: organización
type: Organization
point: 52.083333 4.316667
type: Police and judicial cooperation in criminal matters Agency
description: Europol is the European Union law enforcement agency that handles the exchange and analysis of criminal intelligence. Its mission is to improve the effectiveness and cooperation between EU law enforcement authorities in preventing and combating serious international crime and terrorism, with the aim of achieving a safer Europe for all EU citizens.
alternative label: EUROPOL
based near: The Hague
subject: Executive (government)
long: 4.316667
lat: 52.083332
type: Decentralised body of the European Union
type: http://lodlaundromat.org/.well-known/genid/samples/jena///class//fb392f1f41dc748adcc2dbd6019e71b4/218f3af31162c0199ca266130c18209c#14
type: Agent
type: http://lodlaundromat.org/.well-known/genid/samples/jena///class//fb392f1f41dc748adcc2dbd6019e71b4/218f3af31162c0199ca266130c18209c#11
different from: directora ejecutiva

European Chemicals Agency
subject: Executive (government)
based near: Helsinki
long: 24.9375
alternative label: ECHA
type: Policy Agency
description: The European Chemicals Agency (ECHA) manages the technical, scientific and administrative aspects of the Registration, Evaluation, Authorisation and Restriction of Chemicals (REACH) system.
point: 60.170833 24.9375
lat: 60.170834
type: Regulatory Agency
type: Thing
type: Decentralised body of the European Union
type: http://lodlaundromat.org/.well-known/genid/samples/jena///class//fb392f1f41dc748adcc2dbd6019e71b4/218f3af31162c0199ca266130c18209c#14
type: organización
type: Organization
type: Agent
type: http://lodlaundromat.org/.well-known/genid/samples/jena///class//fb392f1f41dc748adcc2dbd6019e71b4/218f3af31162c0199ca266130c18209c#11
different from: directora ejecutiva

European Union Satellite Centre
type: Common Security and Defence Policy Agency
long: -3.483333
based near: Torrejón de Ardoz
alternative label: EUSC
lat: 40.45
description: The European Union Satellite Centre (EUSC) is an agency of the European Union's (EU) Council of Ministers which gathers information through satellite images.
subject: Executive (government)
point: 40.45 -3.483333
type: Thing
type: Decentralised body of the European Union
type: Regulatory Agency
type: http://lodlaundromat.org/.well-known/genid/samples/jena///class//fb392f1f41dc748adcc2dbd6019e71b4/218f3af31162c0199ca266130c18209c#14
type: organización
type: Organization
type: Agent
type: http://lodlaundromat.org/.well-known/genid/samples/jena///class//fb392f1f41dc748adcc2dbd6019e71b4/218f3af31162c0199ca266130c18209c#11
different from: directora ejecutiva

ocupa
range: Thing
domain: Thing
inverse of: ocupado por
comment: Puesto ocupado por algún agente.
label: holds @en
label: ricopre @it
range: puesto
comment: Indica un Impiego ricoperto da un Agent. @it
label: occupe @fr
domain: Agent
comment: あるエージェントによって保持されているポストを示します。 @ja
type: ObjectProperty
comment: Indicate un Poste occupé par un Agent. @fr
type: Property
comment: Indicates a Post held by some Agent. @en
range: Resource
range: http://lodlaundromat.org/.well-known/genid/samples/jena///class//fb392f1f41dc748adcc2dbd6019e71b4/218f3af31162c0199ca266130c18209c#14
range: http://lodlaundromat.org/.well-known/genid/samples/jena///class//fb392f1f41dc748adcc2dbd6019e71b4/218f3af31162c0199ca266130c18209c#11
range: http://lodlaundromat.org/.well-known/genid/samples/jena///class//fb392f1f41dc748adcc2dbd6019e71b4/218f3af31162c0199ca266130c18209c#17
domain: http://lodlaundromat.org/.well-known/genid/samples/jena///class//fb392f1f41dc748adcc2dbd6019e71b4/218f3af31162c0199ca266130c18209c#14
domain: http://lodlaundromat.org/.well-known/genid/samples/jena///class//fb392f1f41dc748adcc2dbd6019e71b4/218f3af31162c0199ca266130c18209c#11
domain: Resource

European Railway Agency
point: 50.358056 3.523333
based near: Valenciennes
lat: 50.358055
type: Policy Agency
subject: Executive (government)
long: 3.523333
description: The European Railway Agency (ERA) is helping to integrate European railway systems by making trains safer and able to cross national borders without stopping.
alternative label: ERA
type: Regulatory Agency
type: Thing
type: organización
type: Organization
type: Decentralised body of the European Union
type: http://lodlaundromat.org/.well-known/genid/samples/jena///class//fb392f1f41dc748adcc2dbd6019e71b4/218f3af31162c0199ca266130c18209c#14
type: Agent
type: http://lodlaundromat.org/.well-known/genid/samples/jena///class//fb392f1f41dc748adcc2dbd6019e71b4/218f3af31162c0199ca266130c18209c#11
different from: directora ejecutiva

European Food Safety Authority
subject: Executive (government)
based near: Parma
alternative label: EFSA
description: The European Food Safety Authority (EFSA) provides independent scientific advice on all matters with a direct or indirect impact on food safety — including animal health and welfare and plant protection. EFSA is also consulted on nutrition in relation to Community legislation.
lat: 44.8
type: Policy Agency
point: 44.8 10.333333
long: 10.333333
type: Regulatory Agency
type: Thing
type: organización
type: Organization
type: http://lodlaundromat.org/.well-known/genid/samples/jena///class//fb392f1f41dc748adcc2dbd6019e71b4/218f3af31162c0199ca266130c18209c#14
type: http://lodlaundromat.org/.well-known/genid/samples/jena///class//fb392f1f41dc748adcc2dbd6019e71b4/218f3af31162c0199ca266130c18209c#11
type: Decentralised body of the European Union
type: Agent
different from: directora ejecutiva

Court of Justice
type: Thing
long: 6.140616
alternative label: Court of Justice of the European Communities
based near: Luxembourg (city)
alternative label: Court
lat: 49.62105
subject: Judicial branch
point: 49.62105 6.140616
description: The Court of Justice's job is to make sure that EU legislation is interpreted and applied in the same way in all EU countries, so that the law is equal for everyone. It ensures, for example, that national courts do not give different rulings on the same issue.
type: Institution of the European Union
type: organización
type: http://lodlaundromat.org/.well-known/genid/samples/jena///class//fb392f1f41dc748adcc2dbd6019e71b4/218f3af31162c0199ca266130c18209c#14
type: Organization
type: Agent
type: http://lodlaundromat.org/.well-known/genid/samples/jena///class//fb392f1f41dc748adcc2dbd6019e71b4/218f3af31162c0199ca266130c18209c#11
different from: directora ejecutiva

European Administrative School
lat: 50.83924
subject: Executive (government)
point: 50.83924 4.38393
type: Interinstitutional body of the European Union
alternative label: EAS
description: The European Administrative School (EAS) was set up on 10 February 2005. Its task is to provide training in specific areas for members of EU staff. Its courses are open to staff of all the EU institutions, thereby helping spread common values, promoting better understanding among EU staff and achieving economies of scale. It works in close cooperation with the training departments of all the institutions to avoid any duplication of effort.
long: 4.38393
based near: Brussels
type: Thing
type: organización
type: http://lodlaundromat.org/.well-known/genid/samples/jena///class//fb392f1f41dc748adcc2dbd6019e71b4/218f3af31162c0199ca266130c18209c#14
type: Organization
type: Agent
type: http://lodlaundromat.org/.well-known/genid/samples/jena///class//fb392f1f41dc748adcc2dbd6019e71b4/218f3af31162c0199ca266130c18209c#11
different from: directora ejecutiva

European Aviation Safety Agency
type: Regulatory Agency
subject: Executive (government)
alternative label: EASA
description: The European Aviation Safety Agency (EASA) is an agency of the European Unionwith offices in Cologne, Germany, which has been given regulatory and executive tasks in the field of civilian aviation safety.
type: Policy Agency
point: 50.95 6.966667
long: 6.966667
lat: 50.95
based near: Cologne
type: Thing
type: Decentralised body of the European Union
type: http://lodlaundromat.org/.well-known/genid/samples/jena///class//fb392f1f41dc748adcc2dbd6019e71b4/218f3af31162c0199ca266130c18209c#14
type: organización
type: Organization
type: Agent
type: http://lodlaundromat.org/.well-known/genid/samples/jena///class//fb392f1f41dc748adcc2dbd6019e71b4/218f3af31162c0199ca266130c18209c#11
different from: directora ejecutiva

European Monitoring Centre for Drugs and Drug Addiction
type: Regulatory Agency
type: Thing
type: organización
type: Organization
subject: Executive (government)
long: -9.139386
lat: 38.71381
based near: Lisbon
description: The European Monitoring Centre for Drugs and Drug Addiction (EMCDDA) is the hub of drug-related information in the European Union. Its role is to gather, analyse and disseminate ‘objective, reliable and comparable information’ on drugs and drug addiction and, in so doing, provide its audiences with a sound and evidence-based picture of the drug phenomenon at European level.
alternative label: EMCDDA
type: Policy Agency
point: 38.713811 -9.139386
type: Decentralised body of the European Union
type: http://lodlaundromat.org/.well-known/genid/samples/jena///class//fb392f1f41dc748adcc2dbd6019e71b4/218f3af31162c0199ca266130c18209c#14
type: Agent
type: http://lodlaundromat.org/.well-known/genid/samples/jena///class//fb392f1f41dc748adcc2dbd6019e71b4/218f3af31162c0199ca266130c18209c#11
different from: directora ejecutiva

Education, Audiovisual and Culture Executive Agency
type: Thing
type: organización
type: Organization
type: Executive Agency
alternative label: EACEA
lat: 50.83924
description: The Executive Agency Education, Audiovisual and Culture (EACEA) implements a number of strands of more than 15 Community funded programmes and actions in the fields of education and training, active citizenship, youth, audiovisual and culture.
based near: Brussels
long: 4.38393
point: 50.83924 4.38393
subject: Executive (government)
type: Decentralised body of the European Union
type: http://lodlaundromat.org/.well-known/genid/samples/jena///class//fb392f1f41dc748adcc2dbd6019e71b4/218f3af31162c0199ca266130c18209c#14
type: Agent
type: http://lodlaundromat.org/.well-known/genid/samples/jena///class//fb392f1f41dc748adcc2dbd6019e71b4/218f3af31162c0199ca266130c18209c#11
different from: directora ejecutiva

membresía
subclass of: http://lodlaundromat.org/.well-known/genid/samples/jena///class//fb392f1f41dc748adcc2dbd6019e71b4/218f3af31162c0199ca266130c18209c#17
subclass of: Resource
subclass of: Thing
disjoint with: evento de cambio
label: Membership @en
comment: Indicates the nature of an Agent's membership of an organization. Represents an n-ary relation between an Agent, an Organization and a Role. It is possible to directly indicate membership, independent of the specific Role, through use of the `org:memberOf` property. @en
label: Appartenenza @it
label: Engagement @fr
type: Class
comment: Pertenencia o afiliación de un agente a una organización. Es una relación n-aria entre un agente, una organización y una actividad. Es posible indicar pertenencia mediante el uso de la propiedad `org:memberOf`, independientemente de la actividad específica que se desempeñe.
comment: Indica la natura della relazione di appartenenza di un Agent in un'organizzazione. Rappresenta una relazione n-aria tra un'Agent, un Organization e un Role. È possibile indicare direttamente la membership, indipendentemente dallo specifico Role, attraverso l'uso della proprietà `org:memberOf` @it
comment: 組織のエージェントの構成員の本質を示します。 @ja
disjoint with: sede
comment: Indique la nature de l'engagement d'un Agent dans une Organisation. Représente une relation n-aire entre un Agent, une Organisation et un Role. Il est possible d'indiquer directement l'appartenance à une organisation, independemment d'un rôle spécifique, à travers l'usage de la propriété `org:memberOf`. @fr
disjoint with: organización
disjoint with: actividad

es la dirección de la sede
range: Thing
domain: Thing
type: Property
comment: Dirección de la sede según una codificación adecuada. Se recomienda el uso de vCard (que utiliza el vocabulario en http://www.w3.org/TR/vcard-rdf/), pero el rango no se restringe únicamente al uso de este vocabulario sino que se permite el uso de otros códigos. La dirección puede constar de una dirección de correo electrónico, un número de teléfono o información de geo-localización, y no se limita a una dirección postal física.
comment: Indicates an address for the site in a suitable encoding. Use of vCard (using the http://www.w3.org/TR/vcard-rdf/ vocabulary) is encouraged but the range is left open to allow other encodings to be used. The address may include email, telephone, and geo-location information and is not restricted to a physical address. @en
label: site Address @en
comment: Indique une adresse pour le site dans un encodage approprié. L'usage du vocabulaire vCard ( http://www.w3.org/TR/vcard-rdf/) est encouragé, mais le range est ouvert pour permettre l'utilisation d'autres vocabulaires. L'adresse peut comporter le courriel, le téléphone, et l'information de géolocalisation; et n'est donc pas seulement limitée à une adresse physique. @fr
comment: Indica un indirizzo per la sede in una codifica appropriata. Il codominio è lasciato libero ma è consigliabile l'uso del vocabolario vCard (http://www.w3.org/TR/vcard-rdf/). L'indirizzo può includere email, numero di telefono e informazioni di geolocalizzazione e non è vincolato ad essere un indirizzo fisico. @it
type: ObjectProperty
label: indirizzo della sede @it
domain: sede
label: adresse du Site @fr
comment: 適切にコード化されたサイトのアドレスを示します。vCard[vcard-rdf]語彙などの有名なアドレスのコード化の使用が奨励されますが、他の符号化の使用を可能とするために値域はオープンのままにされます。アドレスには、電子メール、電話およびジオロケーション情報を含むことができ、物理的なアドレスに制限されません。 @ja
range: Resource
domain: Resource

European Centre for Disease Prevention and Control
type: Regulatory Agency
type: Thing
type: organización
type: Organization
lat: 59.35
subject: Executive (government)
alternative label: ECDC
long: 18.0
description: The European Centre for Disease Prevention and Control (ECDC) is an independent agency of the European Union aimed at strengthening Europe's defences against infectious diseases.
type: Policy Agency
based near: Solna Municipality
point: 59.35 18
type: Decentralised body of the European Union
type: http://lodlaundromat.org/.well-known/genid/samples/jena///class//fb392f1f41dc748adcc2dbd6019e71b4/218f3af31162c0199ca266130c18209c#14
type: Agent
type: http://lodlaundromat.org/.well-known/genid/samples/jena///class//fb392f1f41dc748adcc2dbd6019e71b4/218f3af31162c0199ca266130c18209c#11
different from: directora ejecutiva

European Maritime Safety Agency
alternative label: EMSA
description: The European Maritime Safety Agency (EMSA) is a European Union agency charged with reducing the risk of maritime accidents, marine pollution from ships and the loss of human lives at sea by helping to enforce the pertinent EU legislation.
subject: Executive (government)
point: 38.713811 -9.139386
long: -9.139386
lat: 38.71381
type: Policy Agency
based near: Lisbon
type: Regulatory Agency
type: Thing
type: organización
type: Organization
type: Decentralised body of the European Union
type: http://lodlaundromat.org/.well-known/genid/samples/jena///class//fb392f1f41dc748adcc2dbd6019e71b4/218f3af31162c0199ca266130c18209c#14
type: Agent
type: http://lodlaundromat.org/.well-known/genid/samples/jena///class//fb392f1f41dc748adcc2dbd6019e71b4/218f3af31162c0199ca266130c18209c#11
different from: directora ejecutiva

tiene sede registrada en
range: Thing
domain: Thing
sub property of: tiene sede en
comment: 組織の法律上登録されたサイトを示し、多くの法的管轄区域では、会社や慈善団体などのFormalOrganizations（正式な組織）がそのような主要サイトを持っているという要件があります。 @ja
type: ObjectProperty
label: sede legale @it
range: sede
comment: Indica la sede legale per l'Organization. In molte giurisdizioni è richiesto che una FormalOrganization abbia una sede di questo tipo. @it
comment: Indique l'établissement principal légalement enregistré pour l'Organisation. Dans de nombreuses juridictions existe l'obligation pour une Organisation Formelle d'avoir un tel site principal. @fr
comment: Indicates the legally registered site for the organization, in many legal jurisdictions there is a requirement that FormalOrganizations such as Companies or Charities have such a primary designed site. @en
comment: Oficina o sede legalmente registrada de la organización. En muchas jurisdicciones legales existe el requisito de que organizaciones formales tales como empresas u organizaciones de beneficencia tengan una sede principal de este tipo.
sub property of: tiene sede principal en
type: Property
label: registered Site @en
domain: organización formal
label: siège social @fr
range: Resource
domain: organización
domain: Resource
domain: Organization
domain: Agent
domain: http://lodlaundromat.org/.well-known/genid/samples/jena///class//fb392f1f41dc748adcc2dbd6019e71b4/218f3af31162c0199ca266130c18209c#14
domain: http://lodlaundromat.org/.well-known/genid/samples/jena///class//fb392f1f41dc748adcc2dbd6019e71b4/218f3af31162c0199ca266130c18209c#11

European Economic and Social Committee
type: Thing
type: organización
type: Organization
long: 4.377222
type: Consultative body of the European Union
alternative label: EESC
subject: Executive (government)
point: 50.840556 4.377222
lat: 50.840557
based near: Brussels
description: The European Economic and Social Committee (EESC) is an advisory body representing employers, trade unions, farmers, consumers and the other interest groups that collectively make up 'organised civil society'. It presents their views and defends their interests in policy discussions with the Commission, the Council and the European Parliament.
type: http://lodlaundromat.org/.well-known/genid/samples/jena///class//fb392f1f41dc748adcc2dbd6019e71b4/218f3af31162c0199ca266130c18209c#14
type: Agent
type: http://lodlaundromat.org/.well-known/genid/samples/jena///class//fb392f1f41dc748adcc2dbd6019e71b4/218f3af31162c0199ca266130c18209c#11
different from: directora ejecutiva

Translation Centre for the Bodies of the European Union
description: The Translation Centre for the Bodies of the European Union was set up in 1994 to provide the translation services required by the specialised decentralised agencies of the European Union.
alternative label: CdT
long: 6.1472
point: 49.62297 6.1472
based near: Luxembourg (city)
subject: Executive (government)
type: Policy Agency
lat: 49.62297
type: Regulatory Agency
type: Thing
type: organización
type: Organization
type: Decentralised body of the European Union
type: http://lodlaundromat.org/.well-known/genid/samples/jena///class//fb392f1f41dc748adcc2dbd6019e71b4/218f3af31162c0199ca266130c18209c#14
type: Agent
type: http://lodlaundromat.org/.well-known/genid/samples/jena///class//fb392f1f41dc748adcc2dbd6019e71b4/218f3af31162c0199ca266130c18209c#11
different from: directora ejecutiva

contiene unidad
range: Thing
domain: Thing
domain: organización formal
type: ObjectProperty
inverse of: es unidad de
sub property of: tiene suborganización
comment: 例えば、より大きな組織内の部局など、この組織の一部である単位を示します。 @ja
comment: Indica un'unità che è parte di questa Organization, come ad esempio un dipartimento facente parte di una più ampia FormalOrganization. È l'inverso di `org:unitOf`. @it
label: ha Unit @it
label: possède une Unité @fr
comment: Indique une Unité qui fait partie d'une Organisation, par exemple un Départment au sein d'une Organisation Formelle plus large. Inverse de `org:unitOf`. @fr
comment: Indicates a unit which is part of this Organization, e.g. a Department within a larger FormalOrganization. Inverse of `org:unitOf`. @en
type: Property
comment: Unidad que es parte de la organización, como, por ejemplo, un departamento incluido en una organización formal más amplia.
range: unidad organizativa
label: has Unit @en
range: organización
range: Resource
range: Organization
range: Agent
range: http://lodlaundromat.org/.well-known/genid/samples/jena///class//fb392f1f41dc748adcc2dbd6019e71b4/218f3af31162c0199ca266130c18209c#14
range: http://lodlaundromat.org/.well-known/genid/samples/jena///class//fb392f1f41dc748adcc2dbd6019e71b4/218f3af31162c0199ca266130c18209c#11
domain: organización
domain: Resource
domain: Organization
domain: Agent
domain: http://lodlaundromat.org/.well-known/genid/samples/jena///class//fb392f1f41dc748adcc2dbd6019e71b4/218f3af31162c0199ca266130c18209c#14
domain: http://lodlaundromat.org/.well-known/genid/samples/jena///class//fb392f1f41dc748adcc2dbd6019e71b4/218f3af31162c0199ca266130c18209c#11

European Centre for the Development of Vocational Training
type: Regulatory Agency
type: Thing
long: 22.9
lat: 40.65
type: Policy Agency
point: 40.65 22.9
based near: Thessaloniki
description: The European Centre for the Development of Vocational Training (Cedefop) aims at underpinning the development of vocational education and training policy in the European Union.
alternative label: Cedefop
subject: Executive (government)
type: Decentralised body of the European Union
type: http://lodlaundromat.org/.well-known/genid/samples/jena///class//fb392f1f41dc748adcc2dbd6019e71b4/218f3af31162c0199ca266130c18209c#14
type: organización
type: Organization
type: Agent
type: http://lodlaundromat.org/.well-known/genid/samples/jena///class//fb392f1f41dc748adcc2dbd6019e71b4/218f3af31162c0199ca266130c18209c#11
different from: directora ejecutiva

European Railway Agency
type: Regulatory Agency
type: Thing
type: organización
type: Organization
type: Decentralised body of the European Union
type: http://lodlaundromat.org/.well-known/genid/samples/jena///class//fb392f1f41dc748adcc2dbd6019e71b4/218f3af31162c0199ca266130c18209c#14
type: Agent
type: http://lodlaundromat.org/.well-known/genid/samples/jena///class//fb392f1f41dc748adcc2dbd6019e71b4/218f3af31162c0199ca266130c18209c#11
point: 50.358056 3.523333
based near: Valenciennes
lat: 50.358055
type: Policy Agency
subject: Executive (government)
long: 3.523333
description: The European Railway Agency (ERA) is helping to integrate European railway systems by making trains safer and able to cross national borders without stopping.
alternative label: ERA
different from: directora ejecutiva

European Commission
type: Thing
point: 50.843611 4.382778
subject: Executive (government)
type: Institution of the European Union
alternative label: Commission
based near: Brussels
lat: 50.843613
long: 4.382778
description: The European Commission is independent of national governments. Its job is to represent and uphold the interests of the EU as a whole. It drafts proposals for new European laws, which it presents to the European Parliament and the Council.
type: organización
type: http://lodlaundromat.org/.well-known/genid/samples/jena///class//fb392f1f41dc748adcc2dbd6019e71b4/218f3af31162c0199ca266130c18209c#14
type: Organization
type: Agent
type: http://lodlaundromat.org/.well-known/genid/samples/jena///class//fb392f1f41dc748adcc2dbd6019e71b4/218f3af31162c0199ca266130c18209c#11
different from: directora ejecutiva

Trans-European Transport Network Executive Agency
type: Thing
type: organización
type: Organization
alternative label: TEN-T EA
lat: 50.83924
type: Executive Agency
based near: Brussels
description: The Trans-European Transport Network Executive Agency (TEN-T EA) assures the technical and financial implementation and management of the Trans-European Transport Network (TEN-T) programme.
point: 50.83924 4.38393
subject: Executive (government)
long: 4.38393
type: Decentralised body of the European Union
type: http://lodlaundromat.org/.well-known/genid/samples/jena///class//fb392f1f41dc748adcc2dbd6019e71b4/218f3af31162c0199ca266130c18209c#14
type: Agent
type: http://lodlaundromat.org/.well-known/genid/samples/jena///class//fb392f1f41dc748adcc2dbd6019e71b4/218f3af31162c0199ca266130c18209c#11
different from: directora ejecutiva

European Maritime Safety Agency
type: Regulatory Agency
type: Thing
type: organización
type: Organization
type: Decentralised body of the European Union
type: http://lodlaundromat.org/.well-known/genid/samples/jena///class//fb392f1f41dc748adcc2dbd6019e71b4/218f3af31162c0199ca266130c18209c#14
type: Agent
type: http://lodlaundromat.org/.well-known/genid/samples/jena///class//fb392f1f41dc748adcc2dbd6019e71b4/218f3af31162c0199ca266130c18209c#11
alternative label: EMSA
description: The European Maritime Safety Agency (EMSA) is a European Union agency charged with reducing the risk of maritime accidents, marine pollution from ships and the loss of human lives at sea by helping to enforce the pertinent EU legislation.
subject: Executive (government)
point: 38.713811 -9.139386
long: -9.139386
lat: 38.71381
type: Policy Agency
based near: Lisbon
different from: directora ejecutiva

es un puesto en
range: Thing
domain: Thing
inverse of: tiene puesto
label: poste chez @fr
comment: Indicates the Organization in which the Post exists. @en
type: ObjectProperty
label: post in @en
comment: ポストが存在する組織を示します。 @ja
range: organización
comment: Organización en la que existe el puesto.
type: Property
comment: Indica l'Organization in cui il Post è presente. @it
domain: puesto
label: impiego in @it
comment: Indicate l'Organisation dans laquelle le Poste existe. @fr
range: Resource
range: Organization
range: http://lodlaundromat.org/.well-known/genid/samples/jena///class//fb392f1f41dc748adcc2dbd6019e71b4/218f3af31162c0199ca266130c18209c#11
range: Agent
range: http://lodlaundromat.org/.well-known/genid/samples/jena///class//fb392f1f41dc748adcc2dbd6019e71b4/218f3af31162c0199ca266130c18209c#14
domain: Resource
domain: http://lodlaundromat.org/.well-known/genid/samples/jena///class//fb392f1f41dc748adcc2dbd6019e71b4/218f3af31162c0199ca266130c18209c#17
domain: http://lodlaundromat.org/.well-known/genid/samples/jena///class//fb392f1f41dc748adcc2dbd6019e71b4/218f3af31162c0199ca266130c18209c#14
domain: http://lodlaundromat.org/.well-known/genid/samples/jena///class//fb392f1f41dc748adcc2dbd6019e71b4/218f3af31162c0199ca266130c18209c#11

European Railway Agency
type: Regulatory Agency
type: Thing
type: organización
type: Organization
point: 50.358056 3.523333
based near: Valenciennes
lat: 50.358055
type: Policy Agency
subject: Executive (government)
long: 3.523333
description: The European Railway Agency (ERA) is helping to integrate European railway systems by making trains safer and able to cross national borders without stopping.
alternative label: ERA
type: Decentralised body of the European Union
type: http://lodlaundromat.org/.well-known/genid/samples/jena///class//fb392f1f41dc748adcc2dbd6019e71b4/218f3af31162c0199ca266130c18209c#14
type: Agent
type: http://lodlaundromat.org/.well-known/genid/samples/jena///class//fb392f1f41dc748adcc2dbd6019e71b4/218f3af31162c0199ca266130c18209c#11
different from: directora ejecutiva

European Administrative School
type: Thing
lat: 50.83924
subject: Executive (government)
point: 50.83924 4.38393
type: Interinstitutional body of the European Union
alternative label: EAS
description: The European Administrative School (EAS) was set up on 10 February 2005. Its task is to provide training in specific areas for members of EU staff. Its courses are open to staff of all the EU institutions, thereby helping spread common values, promoting better understanding among EU staff and achieving economies of scale. It works in close cooperation with the training departments of all the institutions to avoid any duplication of effort.
long: 4.38393
based near: Brussels
type: organización
type: http://lodlaundromat.org/.well-known/genid/samples/jena///class//fb392f1f41dc748adcc2dbd6019e71b4/218f3af31162c0199ca266130c18209c#14
type: Organization
type: Agent
type: http://lodlaundromat.org/.well-known/genid/samples/jena///class//fb392f1f41dc748adcc2dbd6019e71b4/218f3af31162c0199ca266130c18209c#11
different from: directora ejecutiva

es director ejecutivo de
range: Thing
domain: Thing
type: ObjectProperty
comment: 人（または他のエージェント）が組織のリーダーや正式なトップであることを示します。 @ja
comment: Indique qu'une personne est le directeur ou le responsable formel d'une Organisation. Ceci indique souvent qu'il est au sommet de du graphe acyclique des `org:reportsTo`, même si une organisation peut avoir plus d'un responsable. @fr
sub property of: es miembro de
comment: Persona que es jefe o jefa, representante ,,director o directora de la organización. Esto significa que dicha persona es el rango de la relación `org:reportsTo` en el organigrama de la organización (acíclico), aunque una organización puede tener más de un jefe.
label: responsabile di @it
type: Property
label: responsable de @fr
comment: Indicates that a person is the leader or formal head of the Organization. This will normally mean that they are the root of the `org:reportsTo` (acyclic) graph, though an organization may have more than one head. @en
domain: Person
label: head of @en
range: organización
comment: Indica che una persona è leader o responsabile formale di una Organization. Questo significa che la persona è alla radice del grafo (aciclico) creato dalle `org:reportsTo`, sebbene un'organizzazione possa avere più di un responsabile. @it
range: Resource
range: Organization
range: Agent
range: http://lodlaundromat.org/.well-known/genid/samples/jena///class//fb392f1f41dc748adcc2dbd6019e71b4/218f3af31162c0199ca266130c18209c#14
range: http://lodlaundromat.org/.well-known/genid/samples/jena///class//fb392f1f41dc748adcc2dbd6019e71b4/218f3af31162c0199ca266130c18209c#11
domain: Agent
domain: Resource
domain: http://lodlaundromat.org/.well-known/genid/samples/jena///class//fb392f1f41dc748adcc2dbd6019e71b4/218f3af31162c0199ca266130c18209c#11
domain: http://lodlaundromat.org/.well-known/genid/samples/jena///class//fb392f1f41dc748adcc2dbd6019e71b4/218f3af31162c0199ca266130c18209c#14

Executive Agency for Health and Consumers
type: Thing
type: organización
type: Organization
type: Decentralised body of the European Union
type: http://lodlaundromat.org/.well-known/genid/samples/jena///class//fb392f1f41dc748adcc2dbd6019e71b4/218f3af31162c0199ca266130c18209c#14
type: Agent
type: http://lodlaundromat.org/.well-known/genid/samples/jena///class//fb392f1f41dc748adcc2dbd6019e71b4/218f3af31162c0199ca266130c18209c#11
alternative label: EAHC
type: Executive Agency
based near: Luxembourg (city)
description: The Executive Agency for the Public Health Programme (PHEA) was established in 2005 to improve the implementation of the Community public health programme. In 2008, the European Commission transformed PHEA into the Executive Agency for Health and Consumers. The agency was entrusted with new tasks in the field of consumer protection and food safety training, and its mandate was extended until the end of 2015.
point: 49.62297 6.1472
lat: 49.62297
subject: Executive (government)
long: 6.1472
different from: directora ejecutiva

Community Plant Variety Office
type: Regulatory Agency
type: Thing
type: organización
type: Organization
lat: 47.473614
long: -0.554167
based near: Angers
subject: Executive (government)
alternative label: CPVO
point: 47.473612 -0.554167
description: The Community Plant Variety Office (CPVO)'s task is to administer a system of plant variety rights, also known as plant breeders' rights, a form of intellectual property right relating to plants.
type: Policy Agency
type: Decentralised body of the European Union
type: http://lodlaundromat.org/.well-known/genid/samples/jena///class//fb392f1f41dc748adcc2dbd6019e71b4/218f3af31162c0199ca266130c18209c#14
type: Agent
type: http://lodlaundromat.org/.well-known/genid/samples/jena///class//fb392f1f41dc748adcc2dbd6019e71b4/218f3af31162c0199ca266130c18209c#11
different from: directora ejecutiva

tiene sede en
range: Thing
domain: Thing
inverse of: es sede de
domain: organización
comment: Indica la sede in cui l'Organization ha una qualche presenza anche in modo indiretto (ad esempio un ufficio virtuale). È l'inverso di `org:siteOf`. @it
type: ObjectProperty
comment: Lugar en donde la organización tiene algún tipo de presencia, incluso si es de forma indirecta (por ejemplo, una oficina virtual o servicio profesional que hagan la función de dirección registrada de la compañía). Es la relación inversa de `org:siteOf`.
comment: Indique un site sur lequel l'Organisation possède une présence, même indirecte (domiciliation, boite postale). Inverse de `org:siteOf`. @fr
label: a un site @fr
label: ha sede @it
range: sede
type: Property
label: has site @en
comment: Indicates a site at which the Organization has some presence even if only indirect (e.g. virtual office or a professional service which is acting as the registered address for a company). Inverse of `org:siteOf`. @en
comment: 組織が、間接（例えば、会社の登録住所として機能しているバーチャル・オフィスやプロフェッショナル・サービス）のみであったとしても、ある存在感を持っているサイトを示します。 @ja
range: Resource
domain: Resource
domain: http://lodlaundromat.org/.well-known/genid/samples/jena///class//fb392f1f41dc748adcc2dbd6019e71b4/218f3af31162c0199ca266130c18209c#14
domain: http://lodlaundromat.org/.well-known/genid/samples/jena///class//fb392f1f41dc748adcc2dbd6019e71b4/218f3af31162c0199ca266130c18209c#11
domain: Agent
domain: Organization

Translation Centre for the Bodies of the European Union
type: Regulatory Agency
type: Thing
type: organización
type: Organization
type: Decentralised body of the European Union
type: http://lodlaundromat.org/.well-known/genid/samples/jena///class//fb392f1f41dc748adcc2dbd6019e71b4/218f3af31162c0199ca266130c18209c#14
type: Agent
type: http://lodlaundromat.org/.well-known/genid/samples/jena///class//fb392f1f41dc748adcc2dbd6019e71b4/218f3af31162c0199ca266130c18209c#11
description: The Translation Centre for the Bodies of the European Union was set up in 1994 to provide the translation services required by the specialised decentralised agencies of the European Union.
alternative label: CdT
long: 6.1472
point: 49.62297 6.1472
based near: Luxembourg (city)
subject: Executive (government)
type: Policy Agency
lat: 49.62297
different from: directora ejecutiva

European Agency for Safety and Health at Work
type: Regulatory Agency
type: Thing
type: organización
type: Organization
description: The European Agency for Safety and Health at Work (EU-OSHA) was set up in 1996 in Bilbao, Spain. Its mission is to make Europe's workplaces safer, healthier and more productive.
subject: Executive (government)
point: 43.256944 -2.923611
alternative label: EU-OSHA
type: Policy Agency
based near: Bilbao
long: -2.923611
lat: 43.256943
type: Decentralised body of the European Union
type: http://lodlaundromat.org/.well-known/genid/samples/jena///class//fb392f1f41dc748adcc2dbd6019e71b4/218f3af31162c0199ca266130c18209c#14
type: Agent
type: http://lodlaundromat.org/.well-known/genid/samples/jena///class//fb392f1f41dc748adcc2dbd6019e71b4/218f3af31162c0199ca266130c18209c#11
different from: directora ejecutiva

Trans-European Transport Network Executive Agency
alternative label: TEN-T EA
lat: 50.83924
type: Executive Agency
based near: Brussels
description: The Trans-European Transport Network Executive Agency (TEN-T EA) assures the technical and financial implementation and management of the Trans-European Transport Network (TEN-T) programme.
point: 50.83924 4.38393
subject: Executive (government)
long: 4.38393
type: Thing
type: organización
type: Organization
type: Decentralised body of the European Union
type: http://lodlaundromat.org/.well-known/genid/samples/jena///class//fb392f1f41dc748adcc2dbd6019e71b4/218f3af31162c0199ca266130c18209c#14
type: Agent
type: http://lodlaundromat.org/.well-known/genid/samples/jena///class//fb392f1f41dc748adcc2dbd6019e71b4/218f3af31162c0199ca266130c18209c#11
different from: directora ejecutiva

European Defence Agency
type: Thing
type: Decentralised body of the European Union
type: Regulatory Agency
type: http://lodlaundromat.org/.well-known/genid/samples/jena///class//fb392f1f41dc748adcc2dbd6019e71b4/218f3af31162c0199ca266130c18209c#14
type: organización
type: Organization
type: Agent
type: http://lodlaundromat.org/.well-known/genid/samples/jena///class//fb392f1f41dc748adcc2dbd6019e71b4/218f3af31162c0199ca266130c18209c#11
alternative label: EDA
type: Common Security and Defence Policy Agency
based near: Brussels
description: The European Defence Agency (EDA) is an agency of the European Union based in Brussels. It is a Common Foreign and Security Policy (CFSP) body set up on 12 July 2004, reporting to the Council of the European Union.
long: 4.38393
point: 50.83924 4.38393
subject: Executive (government)
lat: 50.83924
different from: directora ejecutiva

organización
subclass of: Resource
subclass of: Organization
subclass of: Thing
type: Class
comment: Représente un groupe de personnes organisées en communauté où tout autre forme de structure sociale, commerciale ou politique. Le groupe a un but commun ou une raison d'être qui va au-delà de la somme des personnes qui en font partie et peut agir en tant que "Agent". Les organisations sont souvent décomposables en structures hiérarchisées. Il est recommandé que des labels lexicaux SKOS soient utilisés pour nommer l'Organisation. En particulier `skos:prefLabel` pour le nom principal (en général le nom légal), `skos:altLabel` pour les noms alternatifs (marques, sigles, appellations familières) et `skos:notation` pour indiquer un code provenant d'une liste de code. @fr
subclass of: Agent
disjoint with: actividad
label: Organizzazione @it
label: Organisation @fr
label: Organization @en
comment: Grupo de personas que se organiza en una comunidad u otro tipo de estructura social, comercial o política. Dicho grupo tiene un objetivo o motivo común para su existencia que va más allá del conjunto de personas que lo forman y que puede actuar como “agente”. A menudo las organizaciones se pueden agrupar en estructuras jerárquicas. Se recomienda el uso de etiquetas de SKOS para denominar a cada “organización”. En concreto, `skos:prefLabel` para la denominación principal o recomendada (aquella reconocida legalmente, siempre que sea posible), `skos:altLabel` para denominaciones alternativas (nombre comercial, sigla, denominación por la que se conoce a la organización coloquialmente) y `skos:notation` para referirse al código que identifique a la organización en una lista de códigos. Denominaciones alternativas: _colectivo_ _corporación_ _grupo_
comment: Rappresenta una collezione di persone organizzate all'interno di una communità o di una qualche struttura sociale, commerciale o politica. Il gruppo condivide un obiettivo o una ragione d'essere che va oltre gli stessi membri appartenenti al gruppo e può agire come un Agent. Le organizzazioni si possono spesso suddividere in strutture gerarchiche. Si raccomanda di usare le label per l'Organization mediante le proprietà di SKOS. In particolare, `skos:prefLabel` per il nome principale (possibilmente un nome legalmente riconosciuto)”, `skos:altLabel` come nome alternativo (denominazione commerciale, denominazione colloquiale) e `skos:notation` per indicare un codice di una lista di codici. @it
disjoint with: evento de cambio
comment: Represents a collection of people organized together into a community or other social, commercial or political structure. The group has some common purpose or reason for existence which goes beyond the set of people belonging to it and can act as an Agent. Organizations are often decomposable into hierarchical structures. It is recommended that SKOS lexical labels should be used to label the Organization. In particular `skos:prefLabel` for the primary (possibly legally recognized name), `skos:altLabel` for alternative names (trading names, colloquial names) and `skos:notation` to denote a code from a code list. Alternative names: _Collective_ _Body_ _Org_ _Group_ @en
equivalent class: Organization
comment: コミュニティー、その他の社会、商業、政治的な構造に共に編入された人々の集合を表わします。グループには、そこに属する人々を超えた、存在に対するある共通の目的や理由があり、エージェント（代理）を務めることができます。組織は、多くの場合、階層構造に分割できます。 @ja
disjoint with: membresía
has key: http://lodlaundromat.org/.well-known/genid/samples/jena///class//fb392f1f41dc748adcc2dbd6019e71b4/218f3af31162c0199ca266130c18209c#10
disjoint with: sede
subclass of: http://lodlaundromat.org/.well-known/genid/samples/jena///class//fb392f1f41dc748adcc2dbd6019e71b4/218f3af31162c0199ca266130c18209c#14
subclass of: http://lodlaundromat.org/.well-known/genid/samples/jena///class//fb392f1f41dc748adcc2dbd6019e71b4/218f3af31162c0199ca266130c18209c#11

tiene suborganización
range: Thing
domain: Thing
label: has SubOrganization @en
comment: Represents hierarchical containment of Organizations or Organizational Units; indicates an organization which is a sub-part or child of this organization. Inverse of `org:subOrganizationOf`. @en
comment: 組織または組織単位の階層的包含を表わします。この組織のサブパートまたは子である組織を示します。 @ja
inverse of: es suborganización de
type: Property
type: ObjectProperty
label: a une Sous-Organization @fr
domain: organización
range: organización
comment: Indique le statut de dépendance hiérarchique pour des Organisations ou des Unités Opérationnelles; indique une Organisation qui est une sous-partie ou une branche d'une Organisation plus large. C'est la propriété inverse de `org:subOrganizationOf`. @fr
comment: Rappresenta un contenimento gerarchico di una Organization o di una OrganizationalUnit. Indica una organizzazione che è parte di una organizzazione più grande. È l'inverso di `org:subOrganizationOf`. @it
comment: Organización jerárquica de organizaciones o unidades. Indica que una organización es parte de otra organización más amplia o pertenece a ella. Es la relación inversa de `org:subOrganizationOf`.
label: ha sotto-Organization @it
range: Resource
range: Organization
range: http://lodlaundromat.org/.well-known/genid/samples/jena///class//fb392f1f41dc748adcc2dbd6019e71b4/218f3af31162c0199ca266130c18209c#11
range: Agent
range: http://lodlaundromat.org/.well-known/genid/samples/jena///class//fb392f1f41dc748adcc2dbd6019e71b4/218f3af31162c0199ca266130c18209c#14
domain: Resource
domain: http://lodlaundromat.org/.well-known/genid/samples/jena///class//fb392f1f41dc748adcc2dbd6019e71b4/218f3af31162c0199ca266130c18209c#14
domain: http://lodlaundromat.org/.well-known/genid/samples/jena///class//fb392f1f41dc748adcc2dbd6019e71b4/218f3af31162c0199ca266130c18209c#11
domain: Agent
domain: Organization

European Aviation Safety Agency
subject: Executive (government)
alternative label: EASA
description: The European Aviation Safety Agency (EASA) is an agency of the European Unionwith offices in Cologne, Germany, which has been given regulatory and executive tasks in the field of civilian aviation safety.
type: Policy Agency
point: 50.95 6.966667
long: 6.966667
lat: 50.95
based near: Cologne
type: Regulatory Agency
type: Thing
type: Decentralised body of the European Union
type: http://lodlaundromat.org/.well-known/genid/samples/jena///class//fb392f1f41dc748adcc2dbd6019e71b4/218f3af31162c0199ca266130c18209c#14
type: organización
type: Organization
type: Agent
type: http://lodlaundromat.org/.well-known/genid/samples/jena///class//fb392f1f41dc748adcc2dbd6019e71b4/218f3af31162c0199ca266130c18209c#11
different from: directora ejecutiva

Community Plant Variety Office
lat: 47.473614
long: -0.554167
based near: Angers
subject: Executive (government)
alternative label: CPVO
point: 47.473612 -0.554167
description: The Community Plant Variety Office (CPVO)'s task is to administer a system of plant variety rights, also known as plant breeders' rights, a form of intellectual property right relating to plants.
type: Policy Agency
type: Regulatory Agency
type: Thing
type: organización
type: Organization
type: Decentralised body of the European Union
type: http://lodlaundromat.org/.well-known/genid/samples/jena///class//fb392f1f41dc748adcc2dbd6019e71b4/218f3af31162c0199ca266130c18209c#14
type: Agent
type: http://lodlaundromat.org/.well-known/genid/samples/jena///class//fb392f1f41dc748adcc2dbd6019e71b4/218f3af31162c0199ca266130c18209c#11
different from: directora ejecutiva

The European Union’s Judicial Cooperation Unit
type: Regulatory Agency
type: Thing
type: organización
type: Organization
type: http://lodlaundromat.org/.well-known/genid/samples/jena///class//fb392f1f41dc748adcc2dbd6019e71b4/218f3af31162c0199ca266130c18209c#14
type: http://lodlaundromat.org/.well-known/genid/samples/jena///class//fb392f1f41dc748adcc2dbd6019e71b4/218f3af31162c0199ca266130c18209c#11
type: Decentralised body of the European Union
type: Agent
description: Eurojust is a European Union body established in 2002 to stimulate and improve the co-ordination of investigations and prosecutions among the competent judicial authorities of the European Union Member States when they deal with serious cross-border and organised crime.
based near: The Hague
point: 52.083333 4.316667
type: Police and judicial cooperation in criminal matters Agency
alternative label: EUROJUST
lat: 52.083332
subject: Executive (government)
long: 4.316667
different from: directora ejecutiva

The European Union’s Judicial Cooperation Unit
type: Regulatory Agency
type: Thing
type: organización
type: Organization
type: http://lodlaundromat.org/.well-known/genid/samples/jena///class//fb392f1f41dc748adcc2dbd6019e71b4/218f3af31162c0199ca266130c18209c#14
type: http://lodlaundromat.org/.well-known/genid/samples/jena///class//fb392f1f41dc748adcc2dbd6019e71b4/218f3af31162c0199ca266130c18209c#11
description: Eurojust is a European Union body established in 2002 to stimulate and improve the co-ordination of investigations and prosecutions among the competent judicial authorities of the European Union Member States when they deal with serious cross-border and organised crime.
based near: The Hague
point: 52.083333 4.316667
type: Police and judicial cooperation in criminal matters Agency
alternative label: EUROJUST
lat: 52.083332
subject: Executive (government)
long: 4.316667
type: Decentralised body of the European Union
type: Agent
different from: directora ejecutiva

European Data Protection Supervisor
type: Interinstitutional body of the European Union
point: 50.83893 4.37522
lat: 50.83893
subject: Executive (government)
based near: Brussels
long: 4.37522
description: The responsibility of the European Data Protection Supervisor (EDPS) is to make sure that all EU institutions and bodies respect people's right to privacy when processing their personal data.
alternative label: EDPS
type: Thing
type: organización
type: http://lodlaundromat.org/.well-known/genid/samples/jena///class//fb392f1f41dc748adcc2dbd6019e71b4/218f3af31162c0199ca266130c18209c#14
type: Organization
type: Agent
type: http://lodlaundromat.org/.well-known/genid/samples/jena///class//fb392f1f41dc748adcc2dbd6019e71b4/218f3af31162c0199ca266130c18209c#11
different from: directora ejecutiva

European Centre for the Development of Vocational Training
type: Regulatory Agency
type: Thing
type: Decentralised body of the European Union
type: http://lodlaundromat.org/.well-known/genid/samples/jena///class//fb392f1f41dc748adcc2dbd6019e71b4/218f3af31162c0199ca266130c18209c#14
type: organización
type: Organization
type: Agent
type: http://lodlaundromat.org/.well-known/genid/samples/jena///class//fb392f1f41dc748adcc2dbd6019e71b4/218f3af31162c0199ca266130c18209c#11
long: 22.9
lat: 40.65
type: Policy Agency
point: 40.65 22.9
based near: Thessaloniki
description: The European Centre for the Development of Vocational Training (Cedefop) aims at underpinning the development of vocational education and training policy in the European Union.
alternative label: Cedefop
subject: Executive (government)
different from: directora ejecutiva

tiene puesto
inverse of: es un puesto en
range: Thing
domain: Thing
comment: 組織内に存在するポストを示します。 @ja
type: ObjectProperty
domain: organización
label: possède un poste @fr
comment: Indica il Post che è presente in una Organization. @it
comment: Indicates a Post which exists within the Organization. @en
label: post @en
label: impiego @it
range: puesto
type: Property
comment: Indicate un Poste qui existe dans l'Organisation. @fr
comment: Posición que existe en una organización.
range: Resource
range: http://lodlaundromat.org/.well-known/genid/samples/jena///class//fb392f1f41dc748adcc2dbd6019e71b4/218f3af31162c0199ca266130c18209c#14
range: http://lodlaundromat.org/.well-known/genid/samples/jena///class//fb392f1f41dc748adcc2dbd6019e71b4/218f3af31162c0199ca266130c18209c#11
range: http://lodlaundromat.org/.well-known/genid/samples/jena///class//fb392f1f41dc748adcc2dbd6019e71b4/218f3af31162c0199ca266130c18209c#17
domain: Resource
domain: http://lodlaundromat.org/.well-known/genid/samples/jena///class//fb392f1f41dc748adcc2dbd6019e71b4/218f3af31162c0199ca266130c18209c#14
domain: http://lodlaundromat.org/.well-known/genid/samples/jena///class//fb392f1f41dc748adcc2dbd6019e71b4/218f3af31162c0199ca266130c18209c#11
domain: Agent
domain: Organization

European Joint Undertaking for ITER and the Development of Fusion Energy
alternative label: F4E
description: Fusion for Energy (F4E) was established in April 2007 for a period of 35 years. It primarily manages Europe’s contribution to ITER, the international fusion energy project. One of its main tasks is to work together with European industry and research organisations to develop and provide a wide range of high technology components for the ITER project.
subject: Executive (government)
lat: 41.40722
point: 41.40722 2.21823
type: EURATOM Agency
alternative label: Fusion for Energy
long: 2.21823
based near: Barcelona
type: Thing
type: http://lodlaundromat.org/.well-known/genid/samples/jena///class//fb392f1f41dc748adcc2dbd6019e71b4/218f3af31162c0199ca266130c18209c#14
type: Decentralised body of the European Union
type: organización
type: Organization
type: Agent
type: http://lodlaundromat.org/.well-known/genid/samples/jena///class//fb392f1f41dc748adcc2dbd6019e71b4/218f3af31162c0199ca266130c18209c#11
different from: directora ejecutiva

es suborganización de
range: Thing
domain: Thing
comment: Rappresenta un contenimento gerarchico di una Organization o di una OrganizationalUnit. È l'inverso di `org:hasSubOrganization`. Ha nome come nome alternativo hasSubOrg. @it
label: sous-Organization de @fr
comment: Distribución jerárquica de organizaciones o unidades. Indica que una organización contiene a otra organización. Es la relación inversa de `org:hasSubOrganization`
comment: Représente une relation hierarchique des Organisations ou des Unités Opérationnelles; indique une Organisation sujet qui contient cette Organisation. Inverse de `org:hasSubOrganization`. @fr
type: Property
domain: organización
inverse of: tiene suborganización
range: organización
comment: Represents hierarchical containment of Organizations or OrganizationalUnits; indicates an Organization which contains this Organization. Inverse of `org:hasSubOrganization`. @en
type: ObjectProperty
comment: 組織または組織単位の階層的包含を表わします。この組織を含む組織を示します。 @ja
label: sotto-Organization di @it
label: subOrganization of @en
sub property of: es suborganización de manera transitiva de
range: Resource
range: Organization
range: Agent
range: http://lodlaundromat.org/.well-known/genid/samples/jena///class//fb392f1f41dc748adcc2dbd6019e71b4/218f3af31162c0199ca266130c18209c#14
range: http://lodlaundromat.org/.well-known/genid/samples/jena///class//fb392f1f41dc748adcc2dbd6019e71b4/218f3af31162c0199ca266130c18209c#11
domain: Resource
domain: Organization
domain: Agent
domain: http://lodlaundromat.org/.well-known/genid/samples/jena///class//fb392f1f41dc748adcc2dbd6019e71b4/218f3af31162c0199ca266130c18209c#14
domain: http://lodlaundromat.org/.well-known/genid/samples/jena///class//fb392f1f41dc748adcc2dbd6019e71b4/218f3af31162c0199ca266130c18209c#11

Council of the European Union
type: Thing
type: organización
type: Institution of the European Union
subject: Executive (government)
point: 50.841389 4.381389
lat: 50.84139
alternative label: Council
long: 4.381389
description: The Council of the European Union is the EU's main decision-making body. It represents the member states, and its meetings are attended by one minister from each of the EU's national governments.
based near: Brussels
type: http://lodlaundromat.org/.well-known/genid/samples/jena///class//fb392f1f41dc748adcc2dbd6019e71b4/218f3af31162c0199ca266130c18209c#14
type: Organization
type: Agent
type: http://lodlaundromat.org/.well-known/genid/samples/jena///class//fb392f1f41dc748adcc2dbd6019e71b4/218f3af31162c0199ca266130c18209c#11
different from: directora ejecutiva

ocupado por
inverse of: ocupa
range: Thing
domain: Thing
comment: Indicates an Agent which holds a Post. @en
domain: puesto
comment: Indica un Agent che ricopre un Post. @it
type: ObjectProperty
comment: Agente que ocupa un puesto.
label: occupé par @fr
range: Agent
type: Property
label: held by @en
comment: Indicate un Agent qui occupe le Poste. @fr
comment: ポストを保持するエージェントを示します。 @ja
label: ricoperto da @it
range: http://lodlaundromat.org/.well-known/genid/samples/jena///class//fb392f1f41dc748adcc2dbd6019e71b4/218f3af31162c0199ca266130c18209c#11
range: Resource
range: http://lodlaundromat.org/.well-known/genid/samples/jena///class//fb392f1f41dc748adcc2dbd6019e71b4/218f3af31162c0199ca266130c18209c#14
domain: Resource
domain: http://lodlaundromat.org/.well-known/genid/samples/jena///class//fb392f1f41dc748adcc2dbd6019e71b4/218f3af31162c0199ca266130c18209c#17
domain: http://lodlaundromat.org/.well-known/genid/samples/jena///class//fb392f1f41dc748adcc2dbd6019e71b4/218f3af31162c0199ca266130c18209c#14
domain: http://lodlaundromat.org/.well-known/genid/samples/jena///class//fb392f1f41dc748adcc2dbd6019e71b4/218f3af31162c0199ca266130c18209c#11

European Investment Bank
type: Thing
type: organización
long: 6.1396
point: 49.62151 6.1396
subject: Executive (government)
description: The European Investment Bank's job is to lend money for projects of European interest (such as rail and road links, airports, or environmental schemes), particularly in the less well-off regions, candidate countries and the developing world. It also provides credit for investment by small businesses.
lat: 49.62151
based near: Luxembourg (city)
type: Financial body of the European Union
alternative label: EIB
type: http://lodlaundromat.org/.well-known/genid/samples/jena///class//fb392f1f41dc748adcc2dbd6019e71b4/218f3af31162c0199ca266130c18209c#14
type: Organization
type: Agent
type: http://lodlaundromat.org/.well-known/genid/samples/jena///class//fb392f1f41dc748adcc2dbd6019e71b4/218f3af31162c0199ca266130c18209c#11
different from: directora ejecutiva

Executive Agency for Health and Consumers
alternative label: EAHC
type: Executive Agency
based near: Luxembourg (city)
description: The Executive Agency for the Public Health Programme (PHEA) was established in 2005 to improve the implementation of the Community public health programme. In 2008, the European Commission transformed PHEA into the Executive Agency for Health and Consumers. The agency was entrusted with new tasks in the field of consumer protection and food safety training, and its mandate was extended until the end of 2015.
point: 49.62297 6.1472
lat: 49.62297
subject: Executive (government)
long: 6.1472
type: Thing
type: organización
type: Organization
type: Decentralised body of the European Union
type: http://lodlaundromat.org/.well-known/genid/samples/jena///class//fb392f1f41dc748adcc2dbd6019e71b4/218f3af31162c0199ca266130c18209c#14
type: Agent
type: http://lodlaundromat.org/.well-known/genid/samples/jena///class//fb392f1f41dc748adcc2dbd6019e71b4/218f3af31162c0199ca266130c18209c#11
different from: directora ejecutiva

European Ombudsman
subject: Executive (government)
point: 48.597512 7.769092
type: Specialised body of the European Union
based near: Strasbourg
lat: 48.59751
alternative label: Ombudsman
long: 7.769092
description: The European Ombudsman acts as an intermediary between the citizen and the EU authorities. He is entitled to receive and investigate complaints from EU citizens, businesses and organisations, and from anyone residing or having their registered office in an EU country.
type: Thing
type: organización
type: Organization
type: http://lodlaundromat.org/.well-known/genid/samples/jena///class//fb392f1f41dc748adcc2dbd6019e71b4/218f3af31162c0199ca266130c18209c#14
type: http://lodlaundromat.org/.well-known/genid/samples/jena///class//fb392f1f41dc748adcc2dbd6019e71b4/218f3af31162c0199ca266130c18209c#11
type: Agent
different from: directora ejecutiva

European GNSS Supervisory Authority
type: Regulatory Agency
type: Thing
type: Decentralised body of the European Union
type: http://lodlaundromat.org/.well-known/genid/samples/jena///class//fb392f1f41dc748adcc2dbd6019e71b4/218f3af31162c0199ca266130c18209c#14
type: organización
type: Organization
type: Agent
type: http://lodlaundromat.org/.well-known/genid/samples/jena///class//fb392f1f41dc748adcc2dbd6019e71b4/218f3af31162c0199ca266130c18209c#11
description: The European GNSS Agency (GSA; formerly European GNSS Supervisory Authority) is an agency of the European Union based in Brussels, Belgium. Its objective is to ensure that essential public interests are properly defended and represented in connection with European Union's satellite navigation programmes (GALILEO and EGNOS).
alternative label: GSA
type: Policy Agency
lat: 50.83924
based near: Brussels
long: 4.38393
point: 50.83924 4.38393
subject: Executive (government)
different from: directora ejecutiva

European Investment Bank
long: 6.1396
point: 49.62151 6.1396
subject: Executive (government)
description: The European Investment Bank's job is to lend money for projects of European interest (such as rail and road links, airports, or environmental schemes), particularly in the less well-off regions, candidate countries and the developing world. It also provides credit for investment by small businesses.
lat: 49.62151
based near: Luxembourg (city)
type: Financial body of the European Union
alternative label: EIB
type: Thing
type: organización
type: http://lodlaundromat.org/.well-known/genid/samples/jena///class//fb392f1f41dc748adcc2dbd6019e71b4/218f3af31162c0199ca266130c18209c#14
type: Organization
type: Agent
type: http://lodlaundromat.org/.well-known/genid/samples/jena///class//fb392f1f41dc748adcc2dbd6019e71b4/218f3af31162c0199ca266130c18209c#11
different from: directora ejecutiva

Interinstitutional body of the European Union
subclass of: Organization
subclass of: organización
type: Class

European Central Bank
description: The European Central Bank's job is to manage the euro - the EU's single currency. The ECB is also responsible for framing and implementing the EU's economic and monetary policy.
long: 8.674
subject: Executive (government)
point: 50.1095 8.674
lat: 50.1095
type: Financial body of the European Union
based near: Frankfurt
alternative label: ECB
type: Thing
type: organización
type: http://lodlaundromat.org/.well-known/genid/samples/jena///class//fb392f1f41dc748adcc2dbd6019e71b4/218f3af31162c0199ca266130c18209c#14
type: Organization
type: Agent
type: http://lodlaundromat.org/.well-known/genid/samples/jena///class//fb392f1f41dc748adcc2dbd6019e71b4/218f3af31162c0199ca266130c18209c#11
different from: directora ejecutiva

unidad organizativa
subclass of: Organization
subclass of: Resource
subclass of: Thing
subclass of: organización
label: OrganizationalUnit @en
comment: An Organization such as a University Support Unit which is part of some larger FormalOrganization and only has full recognition within the context of that FormalOrganization, it is not a Legal Entity in its own right. Units can be large and complex containing other Units and even FormalOrganizations. Alternative names: _OU_ _Unit_ _Department_ @en
comment: あるより大きな組織の一部であり、その組織の中においてのみ完全に認識される部局や支援部署などの組織です。特に、その単位はそれ自体では法的実体と見なされません。 @ja
comment: Organización que forma parte de una organización formal más amplia, como el servicio de informática o centro de cálculo de una universidad, y que sólo tiene reconocimiento pleno en el contexto de dicha organización formal, pero que no es una entidad legal propiamente dicha. Estas unidades pueden ser amplias y complejas, e incluir a otras unidades o incluso a otras organizaciones formales. Denominaciones alternativas: departamento.
comment: Un'organizzazione come ad esempio l'unità dei sistemi informativi che è parte di una più grande FormalOrganization e che, pur essendo riconosciuta nel contesto della propria organizzazione di riferimento, non è legalmente riconosciuta come entità a sé stante. Le unità possono essere ampie e complesse e contenere al loro interno sia altre unità che addirittura FormalOrganization. @it
comment: Une organisation telle que le support informatique d'une université, qui fait partie d'une Organisation Formelle plus importante et qui ne peut être reconnue qu'en tant que membre de cette organisation supérieure, ce n'est pas une entité légale en elle-même. Les unités opérationnelles peuvent être étendues, complexes et inclure elles-mêmes d'autres branches ou Unités Opérationnelles, voire des Organisations Formelles. @fr
label: Unité opérationnelle @fr
type: Class
label: Unità Organizzativa @it
subclass of: http://lodlaundromat.org/.well-known/genid/samples/jena///class//fb392f1f41dc748adcc2dbd6019e71b4/218f3af31162c0199ca266130c18209c#11
subclass of: http://lodlaundromat.org/.well-known/genid/samples/jena///class//fb392f1f41dc748adcc2dbd6019e71b4/218f3af31162c0199ca266130c18209c#14
subclass of: Agent

European Training Foundation
type: Policy Agency
long: 7.7
based near: Turin
lat: 45.066666
point: 45.066667 7.7
description: The European Training Foundation (ETF) helps transition and developing countries to harness the potential of their human capital through the reform of education, training and labour market systems.
alternative label: ETF
subject: Executive (government)
type: Regulatory Agency
type: Thing
type: organización
type: Organization
type: http://lodlaundromat.org/.well-known/genid/samples/jena///class//fb392f1f41dc748adcc2dbd6019e71b4/218f3af31162c0199ca266130c18209c#14
type: http://lodlaundromat.org/.well-known/genid/samples/jena///class//fb392f1f41dc748adcc2dbd6019e71b4/218f3af31162c0199ca266130c18209c#11
type: Decentralised body of the European Union
type: Agent
different from: directora ejecutiva

está relacionado con
range: Thing
domain: Thing
domain: organización
type: ObjectProperty
comment: Indica una relazione arbitraria tra due organizzazioni. Ad esempio, specializzazioni di questa proprietà possono essere usate per denotare relazioni particolari tipo il finanziamento o la fornitura. @it
label: linked to @en
comment: Indicates an arbitrary relationship between two organizations. Specializations of this can be used to, for example, denote funding or supply chain relationships. @en
label: está relacionada con
type: Property
comment: Indique une relation arbitraire entre deux Organisations. Des spécialisations peuvent être utilisées pour, par exemple, qualifier une relation de fournisseur ou de financeur. @fr
label: collegato a @it
comment: 2つの組織の任意の関係を示します。 @ja
comment: Relación arbitraria entre dos organizaciones. Las especializaciones de esta relación se pueden utilizar para denotar relaciones de financiación o suministro, entre otras.
label: relié à @fr
range: organización
range: Resource
range: Organization
range: http://lodlaundromat.org/.well-known/genid/samples/jena///class//fb392f1f41dc748adcc2dbd6019e71b4/218f3af31162c0199ca266130c18209c#11
range: Agent
range: http://lodlaundromat.org/.well-known/genid/samples/jena///class//fb392f1f41dc748adcc2dbd6019e71b4/218f3af31162c0199ca266130c18209c#14
domain: Resource
domain: http://lodlaundromat.org/.well-known/genid/samples/jena///class//fb392f1f41dc748adcc2dbd6019e71b4/218f3af31162c0199ca266130c18209c#14
domain: http://lodlaundromat.org/.well-known/genid/samples/jena///class//fb392f1f41dc748adcc2dbd6019e71b4/218f3af31162c0199ca266130c18209c#11
domain: Agent
domain: Organization

European Union Institute for Security Studies
alternative label: ISS
type: Common Security and Defence Policy Agency
description: The EU Institute for Security Studies (EUISS) – an autonomous agency based in Paris – is an integral part of the support structures for the EU's common foreign and security policy (CFSP).
lat: 48.856667
long: 2.350833
point: 48.856667 2.350833
subject: Executive (government)
based near: Paris
type: Thing
type: organización
type: Organization
type: Regulatory Agency
type: http://lodlaundromat.org/.well-known/genid/samples/jena///class//fb392f1f41dc748adcc2dbd6019e71b4/218f3af31162c0199ca266130c18209c#14
type: http://lodlaundromat.org/.well-known/genid/samples/jena///class//fb392f1f41dc748adcc2dbd6019e71b4/218f3af31162c0199ca266130c18209c#11
type: Decentralised body of the European Union
type: Agent
different from: directora ejecutiva

European Centre for the Development of Vocational Training
long: 22.9
lat: 40.65
type: Policy Agency
point: 40.65 22.9
based near: Thessaloniki
description: The European Centre for the Development of Vocational Training (Cedefop) aims at underpinning the development of vocational education and training policy in the European Union.
alternative label: Cedefop
subject: Executive (government)
type: Regulatory Agency
type: Thing
type: Decentralised body of the European Union
type: http://lodlaundromat.org/.well-known/genid/samples/jena///class//fb392f1f41dc748adcc2dbd6019e71b4/218f3af31162c0199ca266130c18209c#14
type: organización
type: Organization
type: Agent
type: http://lodlaundromat.org/.well-known/genid/samples/jena///class//fb392f1f41dc748adcc2dbd6019e71b4/218f3af31162c0199ca266130c18209c#11
different from: directora ejecutiva

Community Fisheries Control Agency
type: Regulatory Agency
type: Thing
type: organización
type: Organization
type: Decentralised body of the European Union
type: http://lodlaundromat.org/.well-known/genid/samples/jena///class//fb392f1f41dc748adcc2dbd6019e71b4/218f3af31162c0199ca266130c18209c#14
type: Agent
type: http://lodlaundromat.org/.well-known/genid/samples/jena///class//fb392f1f41dc748adcc2dbd6019e71b4/218f3af31162c0199ca266130c18209c#11
based near: Vigo
alternative label: CFCA
lat: 42.231358
description: The Community Fisheries Control Agency (CFCA)'s goals are to co-ordinate the operational activities of Member States in the area of fisheries, and provide assistance to the Member States in their application of the CFP.
type: Policy Agency
long: -8.712447
point: 42.231356 -8.712447
subject: Executive (government)
different from: directora ejecutiva

proyecto de cooperación empresarial
subclass of: Organization
subclass of: Resource
subclass of: Thing
subclass of: http://lodlaundromat.org/.well-known/genid/samples/jena///class//fb392f1f41dc748adcc2dbd6019e71b4/218f3af31162c0199ca266130c18209c#20
subclass of: organización
comment: プロジェクトなどの2つ以上の組織間のコラボレーション。それは、アイデンティティを有し、その特定のメンバーとは無関係に目的を定めているという点で、組織としての基準を満たしますが、正式に認識された法的実体でも、あるより大きな組織内のサブユニットでもありません。一般的には、その内部の組織よりも存続期間が短いかもしれませんが、必ずしもそうとは限りません。 @ja
comment: Une collaboration entre deux ou plusieurs Organisations, telle qu'un projet commun. Un partenariat peut être considéré comme Organisation dans le sens ou il possède une identité et un But propre indépendant de ceux de ses membres, mais ce n'est ni une entité légale ni une sous-unité d'une Organisation plus grande. Typiquement, elle peut avoir une durée de vie plus courte que les Organisations qui la composent, mais pas nécessairement. Tous les membres sont des `org:Organization`s plutôt que des individus et ces Organisations peuvent jouer des Rôles particuliers au sein du Partenariat. @fr
comment: Colaboración determinada entre dos o más organizaciones, como en el caso de un proyecto común. Cumple con los criterios de ser una organización en sí misma, en la medida en que tiene una identidad y un propósito definido independiente de sus miembros en particular, pero no es una entidad legal formalmente reconocida ni una sub-unidad dentro de una organización más grande. La duración suele ser más corta que la de las organizaciones que lo componen, pero no necesariamente. Todos sus miembros son de tipo `org:Organization` en vez de individuos, y desempeñan una actividad concreta en el marco del proyecto de cooperación.
type: Class
label: Partenariat @fr
comment: È una collaborazione tra due o più Organization come ad esempio un progetto. Consente di rappresentare alcune identità dell'Organization che sono fuori dallo scopo principale e non sono formalmente riconosciute. Potrebbe anche avere un ciclo di vita limitato. @it
label: Collaborazione @it
label: Endeavour @en
equivalent class: http://lodlaundromat.org/.well-known/genid/samples/jena///class//fb392f1f41dc748adcc2dbd6019e71b4/218f3af31162c0199ca266130c18209c#20
comment: A collaboration between two or more Organizations such as a project. It meets the criteria for being an Organization in that it has an identity and defining purpose independent of its particular members but is neither a formally recognized legal entity nor a sub-unit within some larger organization. Might typically have a shorter lifetime than the Organizations within it, but not necessarily. All members are `org:Organization`s rather than individuals and those Organizations can play particular roles within the venture. Alternative names: _Project_ _Venture_ _Endeavour_ _Consortium_ _Endeavour_ @en
subclass of: http://lodlaundromat.org/.well-known/genid/samples/jena///class//fb392f1f41dc748adcc2dbd6019e71b4/218f3af31162c0199ca266130c18209c#23
subclass of: Agent
subclass of: http://lodlaundromat.org/.well-known/genid/samples/jena///class//fb392f1f41dc748adcc2dbd6019e71b4/218f3af31162c0199ca266130c18209c#11
subclass of: http://lodlaundromat.org/.well-known/genid/samples/jena///class//fb392f1f41dc748adcc2dbd6019e71b4/218f3af31162c0199ca266130c18209c#14

Decentralised body of the European Union
subclass of: Organization
subclass of: organización
type: Class

European Union Institute for Security Studies
type: Thing
type: organización
type: Organization
type: Regulatory Agency
type: http://lodlaundromat.org/.well-known/genid/samples/jena///class//fb392f1f41dc748adcc2dbd6019e71b4/218f3af31162c0199ca266130c18209c#14
type: http://lodlaundromat.org/.well-known/genid/samples/jena///class//fb392f1f41dc748adcc2dbd6019e71b4/218f3af31162c0199ca266130c18209c#11
type: Decentralised body of the European Union
alternative label: ISS
type: Common Security and Defence Policy Agency
description: The EU Institute for Security Studies (EUISS) – an autonomous agency based in Paris – is an integral part of the support structures for the EU's common foreign and security policy (CFSP).
lat: 48.856667
long: 2.350833
point: 48.856667 2.350833
subject: Executive (government)
based near: Paris
type: Agent
different from: directora ejecutiva

European Training Foundation
type: Regulatory Agency
type: Thing
type: organización
type: Organization
type: http://lodlaundromat.org/.well-known/genid/samples/jena///class//fb392f1f41dc748adcc2dbd6019e71b4/218f3af31162c0199ca266130c18209c#14
type: http://lodlaundromat.org/.well-known/genid/samples/jena///class//fb392f1f41dc748adcc2dbd6019e71b4/218f3af31162c0199ca266130c18209c#11
type: Decentralised body of the European Union
type: Agent
type: Policy Agency
long: 7.7
based near: Turin
lat: 45.066666
point: 45.066667 7.7
description: The European Training Foundation (ETF) helps transition and developing countries to harness the potential of their human capital through the reform of education, training and labour market systems.
alternative label: ETF
subject: Executive (government)
different from: directora ejecutiva

European Personnel Selection Office
lat: 50.843613
subject: Executive (government)
based near: Brussels
long: 4.382778
alternative label: EPSO
point: 50.843611 4.382778
type: Interinstitutional body of the European Union
description: The European Personnel Selection Office (EPSO) became operational in January 2003. Its task is to set competitive examinations for recruiting staff to work in all the EU institutions. This is more efficient than having each institution organise its own recruitment competitions. EPSO's annual budget of roughly 21 million is 11% less than what the EU institutions used to spend on recruitment.
type: Thing
type: organización
type: http://lodlaundromat.org/.well-known/genid/samples/jena///class//fb392f1f41dc748adcc2dbd6019e71b4/218f3af31162c0199ca266130c18209c#14
type: Organization
type: Agent
type: http://lodlaundromat.org/.well-known/genid/samples/jena///class//fb392f1f41dc748adcc2dbd6019e71b4/218f3af31162c0199ca266130c18209c#11
different from: directora ejecutiva

European Union Institute for Security Studies
type: Thing
type: organización
type: Organization
type: Regulatory Agency
type: http://lodlaundromat.org/.well-known/genid/samples/jena///class//fb392f1f41dc748adcc2dbd6019e71b4/218f3af31162c0199ca266130c18209c#14
type: http://lodlaundromat.org/.well-known/genid/samples/jena///class//fb392f1f41dc748adcc2dbd6019e71b4/218f3af31162c0199ca266130c18209c#11
type: Decentralised body of the European Union
type: Agent
alternative label: ISS
type: Common Security and Defence Policy Agency
description: The EU Institute for Security Studies (EUISS) – an autonomous agency based in Paris – is an integral part of the support structures for the EU's common foreign and security policy (CFSP).
lat: 48.856667
long: 2.350833
point: 48.856667 2.350833
subject: Executive (government)
based near: Paris
different from: directora ejecutiva

Community Fisheries Control Agency
type: Regulatory Agency
type: Thing
type: organización
type: Organization
based near: Vigo
alternative label: CFCA
lat: 42.231358
description: The Community Fisheries Control Agency (CFCA)'s goals are to co-ordinate the operational activities of Member States in the area of fisheries, and provide assistance to the Member States in their application of the CFP.
type: Policy Agency
long: -8.712447
point: 42.231356 -8.712447
subject: Executive (government)
type: Decentralised body of the European Union
type: http://lodlaundromat.org/.well-known/genid/samples/jena///class//fb392f1f41dc748adcc2dbd6019e71b4/218f3af31162c0199ca266130c18209c#14
type: Agent
type: http://lodlaundromat.org/.well-known/genid/samples/jena///class//fb392f1f41dc748adcc2dbd6019e71b4/218f3af31162c0199ca266130c18209c#11
different from: directora ejecutiva

European Agency for Safety and Health at Work
type: Regulatory Agency
type: Thing
type: organización
type: Organization
type: Decentralised body of the European Union
type: http://lodlaundromat.org/.well-known/genid/samples/jena///class//fb392f1f41dc748adcc2dbd6019e71b4/218f3af31162c0199ca266130c18209c#14
type: Agent
type: http://lodlaundromat.org/.well-known/genid/samples/jena///class//fb392f1f41dc748adcc2dbd6019e71b4/218f3af31162c0199ca266130c18209c#11
description: The European Agency for Safety and Health at Work (EU-OSHA) was set up in 1996 in Bilbao, Spain. Its mission is to make Europe's workplaces safer, healthier and more productive.
subject: Executive (government)
point: 43.256944 -2.923611
alternative label: EU-OSHA
type: Policy Agency
based near: Bilbao
long: -2.923611
lat: 43.256943
different from: directora ejecutiva

evento de cambio
subclass of: Resource
subclass of: Thing
label: Change Event @en
comment: Represents an event which resulted in a major change to an organization such as a merger or complete restructuring. It is intended for situations where the resulting organization is sufficient distinct from the original organizations that it has a distinct identity and distinct URI. Extension vocabularies should define sub-classes of this to denote particular categories of event. The instant or interval at which the event occurred should be given by `prov:startAtTime` and `prov:endedAtTime`, a description should be given by `dct:description`. @en
comment: Evento que da como resultado un cambio sustancial en la organización, por ejemplo, una fusión o una reestructuración total. Está pensado para situaciones en las que la organización resultante es lo suficientemente distinta de las organizaciones originales, tiene una identidad distinta y una URI también distinta. Se deberían definir subtipos de eventos mediante vocabularios específicos (Extension vocabularies) para referirse a categorías de eventos específicos. El momento o periodo en el que el evento ocurre se debería expresar mediante las propiedades `prov:startAtTime` y `prov:endedAtTime`, y una descripción del mismo se debería incluir mediante el uso de la propiedad `dct:description`.
comment: Rappresenta un evento risultato essere un importante cambiamento per un'organizzazione come ad esempio una fusione o una riorganizzazione. È pensato per quelle situazioni in cui l'organizzazione risultante si distingue da quella originale sufficientemente da essere rappresentata con una URI differente. Le estensioni del vocabolario dovrebbero definire le sotto-classi per esprimere particolari categorie di eventi. L'istante o l'intervallo in cui l'evento accade dovrebbe essere espresso tramite `prov:startAtTime` e`prov:endedAtTime`. Una descrizione dovrebbe essere fornita attraverso `dct:description`. @it
comment: 合併や完全な再編などの組織に大きな変化をもたらした出来事を表わします。これは、結果として作成される組織と元の組織とが、別のアイデンティティーと別のURIを持つに足るほど異なる状況を対象としています。 @ja
label: Evento di cambiamento @it
label: Évènement @fr
subclass of: Activity
type: Class
comment: Représente un Évènement impliquant un changement majeur dans l'Organisation, comme une fusion ou une restructuration. Prévu pour des situations ou l'organisation finale est suffisamment différente des Organisations originales pour qu'elle ait une identité et une URI distinctes. Des vocabulaires d'extension devraient définir des sous-classes de celle-ci pour annoter les différentes catégories d'Évènemenents. Le moment ou l'intervalle de l'Évènement devrait être indiqué avec `prov:startAtTime` et `prov:endedAtTime`, et une description avec la classe `dct:description`. @fr
disjoint with: actividad
disjoint with: membresía
disjoint with: organización
disjoint with: sede

European Agency for Safety and Health at Work
description: The European Agency for Safety and Health at Work (EU-OSHA) was set up in 1996 in Bilbao, Spain. Its mission is to make Europe's workplaces safer, healthier and more productive.
subject: Executive (government)
point: 43.256944 -2.923611
alternative label: EU-OSHA
type: Policy Agency
based near: Bilbao
long: -2.923611
lat: 43.256943
type: Regulatory Agency
type: Thing
type: organización
type: Organization
type: Decentralised body of the European Union
type: http://lodlaundromat.org/.well-known/genid/samples/jena///class//fb392f1f41dc748adcc2dbd6019e71b4/218f3af31162c0199ca266130c18209c#14
type: Agent
type: http://lodlaundromat.org/.well-known/genid/samples/jena///class//fb392f1f41dc748adcc2dbd6019e71b4/218f3af31162c0199ca266130c18209c#11
different from: directora ejecutiva

es unidad de
sub property of: es suborganización de manera transitiva de
range: Thing
domain: Thing
inverse of: contiene unidad
comment: 例えば、より大きな組織内の部局など、この単位がその一部分である組織を示します。 @ja
label: unit Of @en
comment: Organización de la que es parte esta unidad, por ejemplo, un departamento incluido en una organización formal más amplia.
label: unità di @it
sub property of: es suborganización de
type: ObjectProperty
label: unité de @fr
comment: Indica un Organization di cui questa Unit fa parte, come ad esempio un dipartimento all'interno di una più vasta FormalOrganization. È l'inverso di `org:hasUnit`. @it
range: organización formal
comment: Indique l'Organisation dont cette Organisation ou Unité fait partie, par exemple un Départment au sein d'une Organisation Formelle plus large. Inverse de `org:hasUnit`. @fr
comment: Indicates an Organization of which this Unit is a part, e.g. a Department within a larger FormalOrganization. This is the inverse of `org:hasUnit`. @en
domain: unidad organizativa
type: Property
range: organización
range: Resource
range: Organization
range: Agent
range: http://lodlaundromat.org/.well-known/genid/samples/jena///class//fb392f1f41dc748adcc2dbd6019e71b4/218f3af31162c0199ca266130c18209c#14
range: http://lodlaundromat.org/.well-known/genid/samples/jena///class//fb392f1f41dc748adcc2dbd6019e71b4/218f3af31162c0199ca266130c18209c#11
domain: organización
domain: Resource
domain: Organization
domain: Agent
domain: http://lodlaundromat.org/.well-known/genid/samples/jena///class//fb392f1f41dc748adcc2dbd6019e71b4/218f3af31162c0199ca266130c18209c#14
domain: http://lodlaundromat.org/.well-known/genid/samples/jena///class//fb392f1f41dc748adcc2dbd6019e71b4/218f3af31162c0199ca266130c18209c#11

European Research Council Executive Agency
lat: 50.83924
alternative label: ERC Executive Agency
subject: Executive (government)
based near: Brussels
type: Executive Agency
long: 4.38393
point: 50.83924 4.38393
description: The European Research Council (ERC) is part of the EU's Seventh Research Framework Programme (FP7). It is set up by the European Commission to support investigator-driven frontier research and was established in February 2007 on the basis of the FP7 IDEAS specific programme, with a total budget of 7.5 billion Euro (2007-2013).
type: Thing
type: organización
type: Organization
type: Decentralised body of the European Union
type: http://lodlaundromat.org/.well-known/genid/samples/jena///class//fb392f1f41dc748adcc2dbd6019e71b4/218f3af31162c0199ca266130c18209c#14
type: Agent
type: http://lodlaundromat.org/.well-known/genid/samples/jena///class//fb392f1f41dc748adcc2dbd6019e71b4/218f3af31162c0199ca266130c18209c#11
different from: directora ejecutiva

European Environment Agency
lat: 55.67611
subject: Executive (government)
point: 55.676111 12.568333
based near: Copenhagen
type: Policy Agency
alternative label: EEA
long: 12.568333
description: The European Environment Agency (EEA) is devoted to establishing a monitoring network for the monitoring of the European environment.
type: Regulatory Agency
type: Thing
type: organización
type: Organization
type: Decentralised body of the European Union
type: http://lodlaundromat.org/.well-known/genid/samples/jena///class//fb392f1f41dc748adcc2dbd6019e71b4/218f3af31162c0199ca266130c18209c#14
type: Agent
type: http://lodlaundromat.org/.well-known/genid/samples/jena///class//fb392f1f41dc748adcc2dbd6019e71b4/218f3af31162c0199ca266130c18209c#11
different from: directora ejecutiva

Court of Auditors
type: Thing
type: organización
lat: 49.62297
alternative label: ECA
type: Institution of the European Union
description: The Court of Auditor's job is to check that EU funds, which come from the taxpayers, are properly collected and that they are spent legally, economically and for the intended purpose. Its aim is to ensure that the taxpayers get maximum value for their money, and it has the right to audit any person or organisation handling EU funds.
subject: Executive (government)
based near: Luxembourg (city)
point: 49.62297 6.1472
long: 6.1472
type: http://lodlaundromat.org/.well-known/genid/samples/jena///class//fb392f1f41dc748adcc2dbd6019e71b4/218f3af31162c0199ca266130c18209c#14
type: Organization
type: Agent
type: http://lodlaundromat.org/.well-known/genid/samples/jena///class//fb392f1f41dc748adcc2dbd6019e71b4/218f3af31162c0199ca266130c18209c#11
different from: directora ejecutiva

European Institute for Gender Equality
type: Regulatory Agency
type: Thing
type: organización
type: Organization
type: Decentralised body of the European Union
type: http://lodlaundromat.org/.well-known/genid/samples/jena///class//fb392f1f41dc748adcc2dbd6019e71b4/218f3af31162c0199ca266130c18209c#14
type: Agent
type: http://lodlaundromat.org/.well-known/genid/samples/jena///class//fb392f1f41dc748adcc2dbd6019e71b4/218f3af31162c0199ca266130c18209c#11
alternative label: EIGE
lat: 54.683334
long: 25.283333
based near: Vilnius
type: Policy Agency
point: 54.683333 25.283333
subject: Executive (government)
description: The European Institute for Gender Equality supports the EU institutions and the Member States in promoting equality between women and men and combating sex discrimination.
different from: directora ejecutiva

European Commission
point: 50.843611 4.382778
subject: Executive (government)
type: Institution of the European Union
alternative label: Commission
based near: Brussels
lat: 50.843613
long: 4.382778
description: The European Commission is independent of national governments. Its job is to represent and uphold the interests of the EU as a whole. It drafts proposals for new European laws, which it presents to the European Parliament and the Council.
type: Thing
type: organización
type: http://lodlaundromat.org/.well-known/genid/samples/jena///class//fb392f1f41dc748adcc2dbd6019e71b4/218f3af31162c0199ca266130c18209c#14
type: Organization
type: Agent
type: http://lodlaundromat.org/.well-known/genid/samples/jena///class//fb392f1f41dc748adcc2dbd6019e71b4/218f3af31162c0199ca266130c18209c#11
different from: directora ejecutiva

desempeña la actividad de
range: Thing
domain: Thing
label: rôle @fr
comment: Indica il Role che un Agent ricopre in una relazione di Membership con una Organization @it
label: role @en
domain: http://lodlaundromat.org/.well-known/genid/samples/jena///class//fb392f1f41dc748adcc2dbd6019e71b4/218f3af31162c0199ca266130c18209c#17
type: Property
type: ObjectProperty
comment: Actividad que el agente desempeña en una relación de pertenencia a una organización.
label: ruolo @it
comment: Indicates the Role that the Agent plays in a Membership relationship with an Organization. @en
range: actividad
comment: Indique le Rôle de l'Agent dans son Engagement avec l'Organisation. @fr
comment: エージェントが組織との構成員関係において担う役割を示します。ポストの保持者が担う役割を示すためにorg:Postで用いることもできます。 @ja
range: Resource
range: Concept
domain: Resource

es el resultado de
range: Thing
domain: Thing
type: Property
comment: Indica l'evento che ha permesso all'organizzazione di instaurarsi. È l'inverso di `org:resultingOrganization`. @it
comment: Indique un évènement dont est issue l'Organisation. Inverse de `org:resultingOrganization`. @fr
comment: Indicates an event which resulted in this organization. Inverse of `org:resultingOrganization`. @en
comment: この組織になった（導いた、作成された）きっかけとなった出来事を示します。 @ja
label: resulted from @en
domain: organización
sub property of: wasGeneratedBy
range: evento de cambio
type: ObjectProperty
label: issue de @fr
label: risultato da @it
comment: Evento que tiene como resultado la creación de una organización.
inverse of: resulta en
range: Resource
range: Activity
domain: Resource
domain: http://lodlaundromat.org/.well-known/genid/samples/jena///class//fb392f1f41dc748adcc2dbd6019e71b4/218f3af31162c0199ca266130c18209c#14
domain: http://lodlaundromat.org/.well-known/genid/samples/jena///class//fb392f1f41dc748adcc2dbd6019e71b4/218f3af31162c0199ca266130c18209c#11
domain: Agent
domain: Organization

sede
subclass of: Thing
subclass of: Resource
comment: 組織が位置するオフィスやその他の敷地。多くの組織が複数のサイトに散在しており、多くのサイトが多数の場所を持つでしょう。 @ja
comment: Oficina, local o cualquier otro lugar en el que se encuentra una organización. Muchas organizaciones están distribuidas en varias sedes, que a su vez están repartidas en distintas ubicaciones. En muchos casos una sede será un sitio o local físico. Sin embargo, no se excluye la posibilidad de lugares no físicos como oficinas virtuales con los correspondientes apartados de correo y servicio de atención telefónica. Se pueden añadir más subtipos mediante extensiones para incluir tipos especiales de lugares.
comment: Un ufficio o altra sede dovei l'organizzazione è situata. Molte organizzazione sono distribuite su più sedi e molte sedi ospitano più ubicazioni. Nella maggior parte dei casi un Site è una locazione fisica. Non si esclude la possibilità di indicare sedi non fisiche come ad esempio gli uffici virtuali. Le estensioni dell'ontologia potrebbero usare delle sottoclassi per rappresentare i tipi particolari di sede. @it
comment: An office or other premise at which the organization is located. Many organizations are spread across multiple sites and many sites will host multiple locations. In most cases a Site will be a physical location. However, we don't exclude the possibility of non-physical sites such as a virtual office with an associated post box and phone reception service. Extensions may provide subclasses to denote particular types of site. @en
comment: Un établissement ou tout autre lieu dans lequel une Organisation est localisé. Beaucoup d'organisations sont dispersées à travers plusieurs sites. Dans la plupart des cas un Site sera un lieu physique. Toutefois, nous n'excluons pas la possibilité de sites non-physiques comme un bureau virtuel avec une boîte postale et un service de secrétariat mutualisé. Des extensions pourraient fournir des sous-classes pour décrire des types de sites particuliers. @fr
type: Class
label: Sede @it
label: Site @en
disjoint with: evento de cambio
disjoint with: actividad
disjoint with: membresía
disjoint with: organización

European Training Foundation
type: Regulatory Agency
type: Thing
type: organización
type: Organization
type: http://lodlaundromat.org/.well-known/genid/samples/jena///class//fb392f1f41dc748adcc2dbd6019e71b4/218f3af31162c0199ca266130c18209c#14
type: http://lodlaundromat.org/.well-known/genid/samples/jena///class//fb392f1f41dc748adcc2dbd6019e71b4/218f3af31162c0199ca266130c18209c#11
type: Decentralised body of the European Union
type: Policy Agency
long: 7.7
based near: Turin
lat: 45.066666
point: 45.066667 7.7
description: The European Training Foundation (ETF) helps transition and developing countries to harness the potential of their human capital through the reform of education, training and labour market systems.
alternative label: ETF
subject: Executive (government)
type: Agent
different from: directora ejecutiva

Council of the European Union
type: Institution of the European Union
subject: Executive (government)
point: 50.841389 4.381389
lat: 50.84139
alternative label: Council
long: 4.381389
description: The Council of the European Union is the EU's main decision-making body. It represents the member states, and its meetings are attended by one minister from each of the EU's national governments.
based near: Brussels
type: Thing
type: organización
type: http://lodlaundromat.org/.well-known/genid/samples/jena///class//fb392f1f41dc748adcc2dbd6019e71b4/218f3af31162c0199ca266130c18209c#14
type: Organization
type: Agent
type: http://lodlaundromat.org/.well-known/genid/samples/jena///class//fb392f1f41dc748adcc2dbd6019e71b4/218f3af31162c0199ca266130c18209c#11
different from: directora ejecutiva

tiene membresía
type: InverseFunctionalProperty
range: Thing
domain: Thing
comment: Indicates a membership relationship that the Agent plays. Inverse of `org:member`. @en
type: ObjectProperty
comment: Indica una relazione di appartenenza che coinvolge un Agent. È l'inverso di `org:member`. @it
label: appartenenza @it
comment: Relación de pertenencia o afiliación a una organización en la que el agente desempeña un cargo o función. Es la relación inversa de `org:member`.
label: membership @en
label: engagement @fr
type: Property
inverse of: es condición de miembro sobre agente
range: membresía
domain: Agent
comment: Indique pour cet Agent un engagement dans une Organisation. Inverse de `org:member`. @fr
comment: エージェントが担う構成員関係を示します。 @ja
range: http://lodlaundromat.org/.well-known/genid/samples/jena///class//fb392f1f41dc748adcc2dbd6019e71b4/218f3af31162c0199ca266130c18209c#17
range: Resource
domain: http://lodlaundromat.org/.well-known/genid/samples/jena///class//fb392f1f41dc748adcc2dbd6019e71b4/218f3af31162c0199ca266130c18209c#14
domain: http://lodlaundromat.org/.well-known/genid/samples/jena///class//fb392f1f41dc748adcc2dbd6019e71b4/218f3af31162c0199ca266130c18209c#11
domain: Resource

European Research Council Executive Agency
type: Thing
type: organización
type: Organization
lat: 50.83924
alternative label: ERC Executive Agency
subject: Executive (government)
based near: Brussels
type: Executive Agency
long: 4.38393
point: 50.83924 4.38393
description: The European Research Council (ERC) is part of the EU's Seventh Research Framework Programme (FP7). It is set up by the European Commission to support investigator-driven frontier research and was established in February 2007 on the basis of the FP7 IDEAS specific programme, with a total budget of 7.5 billion Euro (2007-2013).
type: Decentralised body of the European Union
type: http://lodlaundromat.org/.well-known/genid/samples/jena///class//fb392f1f41dc748adcc2dbd6019e71b4/218f3af31162c0199ca266130c18209c#14
type: Agent
type: http://lodlaundromat.org/.well-known/genid/samples/jena///class//fb392f1f41dc748adcc2dbd6019e71b4/218f3af31162c0199ca266130c18209c#11
different from: directora ejecutiva

European Agency for the Management of Operational Cooperation at the External Borders
type: Regulatory Agency
type: Thing
type: organización
type: Organization
type: http://lodlaundromat.org/.well-known/genid/samples/jena///class//fb392f1f41dc748adcc2dbd6019e71b4/218f3af31162c0199ca266130c18209c#14
type: http://lodlaundromat.org/.well-known/genid/samples/jena///class//fb392f1f41dc748adcc2dbd6019e71b4/218f3af31162c0199ca266130c18209c#11
type: Decentralised body of the European Union
type: Agent
subject: Executive (government)
type: Policy Agency
lat: 52.23
description: FRONTEX coordinates operational cooperation between Member States in the field of management of external borders; assists Member States in the training of national border guards, including the establishment of common training standards; carries out risk analyses; follows up the development of research relevant for the control and surveillance of external borders; assists Member States in circumstances requiring increased technical and operational assistance at external borders; and provides Member States with the necessary support in organising joint return operations.
point: 52.23 21.010833
based near: Warsaw
alternative label: FRONTEX
long: 21.010834
different from: directora ejecutiva

European Environment Agency
type: Regulatory Agency
type: Thing
type: organización
type: Organization
type: Decentralised body of the European Union
type: http://lodlaundromat.org/.well-known/genid/samples/jena///class//fb392f1f41dc748adcc2dbd6019e71b4/218f3af31162c0199ca266130c18209c#14
type: Agent
type: http://lodlaundromat.org/.well-known/genid/samples/jena///class//fb392f1f41dc748adcc2dbd6019e71b4/218f3af31162c0199ca266130c18209c#11
lat: 55.67611
subject: Executive (government)
point: 55.676111 12.568333
based near: Copenhagen
type: Policy Agency
alternative label: EEA
long: 12.568333
description: The European Environment Agency (EEA) is devoted to establishing a monitoring network for the monitoring of the European environment.
different from: directora ejecutiva

resulta en
range: Thing
domain: Thing
inverse of: es el resultado de
comment: Organización que ha sido creada o modificada tras un evento específico. Es la relación inversa de `org:resultedFrom`.
label: resulted in @en
label: risultato in @it
comment: 出来事の結果、作成、変更された組織を示します。 @ja
comment: Indique une organisation qui a été créée ou a été modifiée à la suite d'un Évènement de changement. Inverse de `org:resultedFrom`. @fr
comment: Indica l'organizzazione che è stata creata o mutata a seguito dell'evento. È l'inverso di `org:resultedFrom`. @it
range: organización
type: ObjectProperty
label: a donné naissance à @fr
comment: Indicates an organization which was created or changed as a result of the event. Inverse of `org:resultedFrom`. @en
type: Property
domain: evento de cambio
range: Resource
range: Organization
range: http://lodlaundromat.org/.well-known/genid/samples/jena///class//fb392f1f41dc748adcc2dbd6019e71b4/218f3af31162c0199ca266130c18209c#11
range: Agent
range: http://lodlaundromat.org/.well-known/genid/samples/jena///class//fb392f1f41dc748adcc2dbd6019e71b4/218f3af31162c0199ca266130c18209c#14
domain: Resource
domain: Activity

Trans-European Transport Network Executive Agency
type: Thing
type: organización
type: Organization
type: Decentralised body of the European Union
type: http://lodlaundromat.org/.well-known/genid/samples/jena///class//fb392f1f41dc748adcc2dbd6019e71b4/218f3af31162c0199ca266130c18209c#14
type: Agent
type: http://lodlaundromat.org/.well-known/genid/samples/jena///class//fb392f1f41dc748adcc2dbd6019e71b4/218f3af31162c0199ca266130c18209c#11
alternative label: TEN-T EA
lat: 50.83924
type: Executive Agency
based near: Brussels
description: The Trans-European Transport Network Executive Agency (TEN-T EA) assures the technical and financial implementation and management of the Trans-European Transport Network (TEN-T) programme.
point: 50.83924 4.38393
subject: Executive (government)
long: 4.38393
different from: directora ejecutiva

responde ante
range: Thing
domain: Thing
label: riporta a @it
label: est subordonné à @fr
range: http://lodlaundromat.org/.well-known/genid/samples/jena///class//fb392f1f41dc748adcc2dbd6019e71b4/218f3af31162c0199ca266130c18209c#14
label: reports to @en
comment: Relación de subordinación que se representa en los organigramas de las organizaciones. La semántica de la relación de subordinación varía según las organizaciones, pero su intención es abarcar tanto a las relaciones de supervisión directa (por ejemplo, aquellas en las que la autoridad determina los objetivos o el salario) como a las relaciones de subordinación más generales (por ejemplo, las llamadas líneas de autoridad o de mando (y responsabilidad) (http://www.promonegocios.net/organigramas/tipos-de-organigramas.html)).
type: ObjectProperty
comment: 組織図で描かれるかもしれないような上下関係を示します。エージェント間またはエージェントが就くことができるポスト間の上下関係を直接的に示すために使用できます。 @ja
comment: Indica una relazione di subordinazione all'interno dell'organigramma. La semantica precisa può variare a seconda dell'organizzazione, per esempio può essere usata per rappresentare la proprietà di supervisione oppure per le relazioni di rendicontazione. @it
type: Property
comment: Indicates a reporting relationship as might be depicted on an organizational chart. The precise semantics of the reporting relationship will vary by organization but is intended to encompass both direct supervisory relationships (e.g. carrying objective and salary setting authority) and more general reporting or accountability relationships (e.g. so called _dotted line_ reporting). @en
comment: Indique une relation de subordination comme elle pourrait figurer dans un organigramme. La sémantique précise de cette subordination pourra varier selon l'Organisation mais vise à englober aussi bien les relations hiérarchiques directes (définition d'objectifs, montant du salaire) que des relations plus générales ou organisationnelles (les liens en pointillés dans les organigrammes). @fr
domain: http://lodlaundromat.org/.well-known/genid/samples/jena///class//fb392f1f41dc748adcc2dbd6019e71b4/218f3af31162c0199ca266130c18209c#11
range: Resource
domain: Resource

puesto
subclass of: http://lodlaundromat.org/.well-known/genid/samples/jena///class//fb392f1f41dc748adcc2dbd6019e71b4/218f3af31162c0199ca266130c18209c#17
subclass of: http://lodlaundromat.org/.well-known/genid/samples/jena///class//fb392f1f41dc748adcc2dbd6019e71b4/218f3af31162c0199ca266130c18209c#11
subclass of: Thing
subclass of: Resource
subclass of: http://lodlaundromat.org/.well-known/genid/samples/jena///class//fb392f1f41dc748adcc2dbd6019e71b4/218f3af31162c0199ca266130c18209c#14
comment: Un Impiego rappresenta una posizione all'interno dell'organizzazione che esiste indipendentemente dalla persona che la ricopre. Gli impieghi possono essere utilizzati per le situazioni in cui una persona è membro di un'organizzazione o di un ufficio (ad esempio un segretario di stato). Un Impiego può essere ricoperto da più persone. @it
type: Class
comment: Puesto o posición que representa algún tipo de empleo dentro de una organización, que existe independientemente de la persona o personas que lo desempeñan. Esta clase puede utilizarse para representar situaciones en las que una persona es miembro de una organización ex oficio (por ejemplo, el Secretario de Estado escocés es parte del Gabinete del gobierno británico por virtud de ser Secretario de Estado en Escocia, y no como individuo). Un puesto puede ser desempeñado por múltiples individuos y de aquí que sea tratado como una organización en sí misma.
label: Impiego @it
comment: ポストは、それを埋める人（人々）とは無関係に存在する組織内のある位置を表わします。ポストは、人が職権上、組織のメンバーである状況を表わすために使用できます（例えば、スコットランド大臣は、個人としてではなく、スコットランド大臣であることにより、英国内閣の一部です）。ポストは、複数の人々によって保持されることが可能だあるため、それ自体を組織として扱うことができます。 @ja
label: Poste @fr
label: Post @en
comment: A Post represents some position within an organization that exists independently of the person or persons filling it. Posts may be used to represent situations where a person is a member of an organization ex officio (for example the Secretary of State for Scotland is part of UK Cabinet by virtue of being Secretary of State for Scotland, not as an individual person). A post can be held by multiple people and hence can be treated as a organization in its own right. @en
comment: Un Poste représente une position au sein d'une Organisation qui existe indépendamment de la personne ou des personnes qui le remplissent. Les postes peuvent être utilisés pour représenter des situations où une personne est membre d'une Organisation d'office (par exemple, le Secrétaire d'Etat pour l'Ecosse fait partie du Cabinet du Royaume-Uni du fait d'être Secrétaire d'Etat pour l'Ecosse, non pas comme une personne physique). Un poste après peut être occupé par plusieurs personnes et peut donc être considéré comme une Organisation à part entière. @fr

Court of Justice
long: 6.140616
alternative label: Court of Justice of the European Communities
based near: Luxembourg (city)
alternative label: Court
lat: 49.62105
subject: Judicial branch
point: 49.62105 6.140616
description: The Court of Justice's job is to make sure that EU legislation is interpreted and applied in the same way in all EU countries, so that the law is equal for everyone. It ensures, for example, that national courts do not give different rulings on the same issue.
type: Institution of the European Union
type: Thing
type: organización
type: http://lodlaundromat.org/.well-known/genid/samples/jena///class//fb392f1f41dc748adcc2dbd6019e71b4/218f3af31162c0199ca266130c18209c#14
type: Organization
type: Agent
type: http://lodlaundromat.org/.well-known/genid/samples/jena///class//fb392f1f41dc748adcc2dbd6019e71b4/218f3af31162c0199ca266130c18209c#11
different from: directora ejecutiva

European Union Satellite Centre
type: Common Security and Defence Policy Agency
long: -3.483333
based near: Torrejón de Ardoz
alternative label: EUSC
lat: 40.45
description: The European Union Satellite Centre (EUSC) is an agency of the European Union's (EU) Council of Ministers which gathers information through satellite images.
subject: Executive (government)
point: 40.45 -3.483333
type: Thing
type: Decentralised body of the European Union
type: Regulatory Agency
type: http://lodlaundromat.org/.well-known/genid/samples/jena///class//fb392f1f41dc748adcc2dbd6019e71b4/218f3af31162c0199ca266130c18209c#14
type: organización
type: Organization
type: Agent
type: http://lodlaundromat.org/.well-known/genid/samples/jena///class//fb392f1f41dc748adcc2dbd6019e71b4/218f3af31162c0199ca266130c18209c#11
different from: directora ejecutiva

European Institute for Gender Equality
alternative label: EIGE
lat: 54.683334
long: 25.283333
based near: Vilnius
type: Policy Agency
point: 54.683333 25.283333
subject: Executive (government)
description: The European Institute for Gender Equality supports the EU institutions and the Member States in promoting equality between women and men and combating sex discrimination.
type: Regulatory Agency
type: Thing
type: organización
type: Organization
type: Decentralised body of the European Union
type: http://lodlaundromat.org/.well-known/genid/samples/jena///class//fb392f1f41dc748adcc2dbd6019e71b4/218f3af31162c0199ca266130c18209c#14
type: Agent
type: http://lodlaundromat.org/.well-known/genid/samples/jena///class//fb392f1f41dc748adcc2dbd6019e71b4/218f3af31162c0199ca266130c18209c#11
different from: directora ejecutiva

Financial body of the European Union
subclass of: Organization
subclass of: organización
type: Class

European Network and Information Security Agency
long: 25.133333
description: The objective of European Network and Information Security Agency (ENISA) is to improve network and information security in the European Union.
alternative label: ENISA
based near: Heraklion
subject: Executive (government)
point: 35.333333 25.133333
lat: 35.333332
type: Policy Agency
type: Regulatory Agency
type: Thing
type: organización
type: Organization
type: Decentralised body of the European Union
type: http://lodlaundromat.org/.well-known/genid/samples/jena///class//fb392f1f41dc748adcc2dbd6019e71b4/218f3af31162c0199ca266130c18209c#14
type: Agent
type: http://lodlaundromat.org/.well-known/genid/samples/jena///class//fb392f1f41dc748adcc2dbd6019e71b4/218f3af31162c0199ca266130c18209c#11
different from: directora ejecutiva

European Personnel Selection Office
lat: 50.843613
subject: Executive (government)
based near: Brussels
long: 4.382778
alternative label: EPSO
point: 50.843611 4.382778
type: Interinstitutional body of the European Union
description: The European Personnel Selection Office (EPSO) became operational in January 2003. Its task is to set competitive examinations for recruiting staff to work in all the EU institutions. This is more efficient than having each institution organise its own recruitment competitions. EPSO's annual budget of roughly 21 million is 11% less than what the EU institutions used to spend on recruitment.
type: Thing
type: organización
type: Organization
type: http://lodlaundromat.org/.well-known/genid/samples/jena///class//fb392f1f41dc748adcc2dbd6019e71b4/218f3af31162c0199ca266130c18209c#14
type: http://lodlaundromat.org/.well-known/genid/samples/jena///class//fb392f1f41dc748adcc2dbd6019e71b4/218f3af31162c0199ca266130c18209c#11
type: Agent
different from: directora ejecutiva

European Network and Information Security Agency
type: Regulatory Agency
type: Thing
type: organización
type: Organization
long: 25.133333
description: The objective of European Network and Information Security Agency (ENISA) is to improve network and information security in the European Union.
alternative label: ENISA
based near: Heraklion
subject: Executive (government)
point: 35.333333 25.133333
lat: 35.333332
type: Policy Agency
type: Decentralised body of the European Union
type: http://lodlaundromat.org/.well-known/genid/samples/jena///class//fb392f1f41dc748adcc2dbd6019e71b4/218f3af31162c0199ca266130c18209c#14
type: Agent
type: http://lodlaundromat.org/.well-known/genid/samples/jena///class//fb392f1f41dc748adcc2dbd6019e71b4/218f3af31162c0199ca266130c18209c#11
different from: directora ejecutiva

European Foundation for the Improvement of Living and Working Conditions
type: Regulatory Agency
type: Thing
type: organización
type: Organization
type: Decentralised body of the European Union
type: http://lodlaundromat.org/.well-known/genid/samples/jena///class//fb392f1f41dc748adcc2dbd6019e71b4/218f3af31162c0199ca266130c18209c#14
type: Agent
type: http://lodlaundromat.org/.well-known/genid/samples/jena///class//fb392f1f41dc748adcc2dbd6019e71b4/218f3af31162c0199ca266130c18209c#11
point: 53.347778 -6.259722
description: The European Foundation for the Improvement of Living and Working Conditions contributes to the planning and establishment of better living and working conditions in Europe. It provides findings, knowledge and advice from independent and comparative research, to governments, employers, trade unions and the European Commission.
long: -6.259722
based near: Dublin, Ireland
type: Policy Agency
subject: Executive (government)
alternative label: EUROFOUND
lat: 53.34778
different from: directora ejecutiva

European Data Protection Supervisor
type: Thing
type: Interinstitutional body of the European Union
point: 50.83893 4.37522
lat: 50.83893
subject: Executive (government)
based near: Brussels
long: 4.37522
description: The responsibility of the European Data Protection Supervisor (EDPS) is to make sure that all EU institutions and bodies respect people's right to privacy when processing their personal data.
alternative label: EDPS
type: organización
type: http://lodlaundromat.org/.well-known/genid/samples/jena///class//fb392f1f41dc748adcc2dbd6019e71b4/218f3af31162c0199ca266130c18209c#14
type: Organization
type: Agent
type: http://lodlaundromat.org/.well-known/genid/samples/jena///class//fb392f1f41dc748adcc2dbd6019e71b4/218f3af31162c0199ca266130c18209c#11
different from: directora ejecutiva

es miembro de
range: Thing
domain: Thing
comment: Indique qu'une personne est membre de l'Organisation sans précision sur la nature de cet engagement ou du rôle joué. Notez que le choix du nom de cette propriété ne vise pas à la limiter aux seuls engagements formels, elle peut également couvrir des concepts reliés comme l'affiliation ou le bénévolat. Des extensions peuvent spécialiser cette relation pour indiquer des rôles particuliers au sein de l'Organisation or des relations plus nuancées avec elle. Possède une propriété inverse optionnelle, `org:hasmember`. @fr
label: membre de @fr
comment: Indicates that a person is a member of the Organization with no indication of the nature of that membership or the role played. Note that the choice of property name is not meant to limit the property to only formal membership arrangements, it is also indended to cover related concepts such as affilliation or other involvement in the organization. Extensions can specialize this relationship to indicate particular roles within the organization or more nuanced relationships to the organization. Has an optional inverse, `org:hasmember`. @en
comment: エージェント（人または他の組織）が組織のメンバーであることを示します。ただし、その構成員の本質や担う役割は示しません。プロパティー名の選択は、プロパティーを正式な構成員配置のみに制限することが目的ではないことに注意してください。所属や組織へのその他の関与などの関連する概念をカバーすることも意図されています。拡張により、この関係を特殊化し、組織内の特定の役割やよりニュアンスを含んだ組織との関係を示すことができます。 @ja
label: member of @en
type: Property
type: ObjectProperty
comment: Indica che una persona è membro di una Organization senza una precisa indicazione sulla natura di questa appartenenza e sul suo ruolo. Si noti che la scelta del nome di questa proprietà non intende limitarla alla sola rappresentazione formalmente di un'appartenenza. La proprietà può coprire anche altri coinvolgimenti nell'organizzazione. Questa proprietà può essere specializzata per indicare ruoli all'interno organizzazione o relazioni di diverse tipologie. Ha `org:hasmember` come proprietà inversa opzionale. @it
label: membro di @it
range: organización
domain: Agent
inverse of: tiene miembro
comment: Persona que pertenece a la organización o es miembro de la misma, sin que conste la naturaleza de dicha pertenencia o el papel que desempeña. Se debe tener en cuenta que la elección de una denominación para esta propiedad no significa que la propiedad esté limitada a ciertos tipos de pertenencia formales, sino que pretende cubrir conceptos relacionados como el de afiliación u otras formas de participación en la organización. Se puede hacer uso de extensiones para especializar esta relación de forma que incluya tipos específicos de pertenencia a las organizaciones o relaciones especiales con la organización.
range: Resource
range: Organization
range: http://lodlaundromat.org/.well-known/genid/samples/jena///class//fb392f1f41dc748adcc2dbd6019e71b4/218f3af31162c0199ca266130c18209c#11
range: Agent
range: http://lodlaundromat.org/.well-known/genid/samples/jena///class//fb392f1f41dc748adcc2dbd6019e71b4/218f3af31162c0199ca266130c18209c#14
domain: http://lodlaundromat.org/.well-known/genid/samples/jena///class//fb392f1f41dc748adcc2dbd6019e71b4/218f3af31162c0199ca266130c18209c#14
domain: http://lodlaundromat.org/.well-known/genid/samples/jena///class//fb392f1f41dc748adcc2dbd6019e71b4/218f3af31162c0199ca266130c18209c#11
domain: Resource

Community Plant Variety Office
type: Regulatory Agency
type: Thing
type: organización
type: Organization
type: Decentralised body of the European Union
type: http://lodlaundromat.org/.well-known/genid/samples/jena///class//fb392f1f41dc748adcc2dbd6019e71b4/218f3af31162c0199ca266130c18209c#14
type: Agent
type: http://lodlaundromat.org/.well-known/genid/samples/jena///class//fb392f1f41dc748adcc2dbd6019e71b4/218f3af31162c0199ca266130c18209c#11
lat: 47.473614
long: -0.554167
based near: Angers
subject: Executive (government)
alternative label: CPVO
point: 47.473612 -0.554167
description: The Community Plant Variety Office (CPVO)'s task is to administer a system of plant variety rights, also known as plant breeders' rights, a form of intellectual property right relating to plants.
type: Policy Agency
different from: directora ejecutiva

European Police College
description: CEPOL - European Police College brings together senior police officers across Europe with the aim to encourage cross-border cooperation in the fight against crime, maintenance of public security and law and order.
alternative label: CEPOL
based near: Bramshill
long: -0.923435
lat: 51.34528
type: Police and judicial cooperation in criminal matters Agency
point: 51.34528, -0.923435
subject: Executive (government)
type: Thing
type: Decentralised body of the European Union
type: http://lodlaundromat.org/.well-known/genid/samples/jena///class//fb392f1f41dc748adcc2dbd6019e71b4/218f3af31162c0199ca266130c18209c#14
type: organización
type: Organization
type: Agent
type: Regulatory Agency
type: http://lodlaundromat.org/.well-known/genid/samples/jena///class//fb392f1f41dc748adcc2dbd6019e71b4/218f3af31162c0199ca266130c18209c#11
different from: directora ejecutiva

es sede de
range: Thing
domain: Thing
comment: Indicates an Organization which has some presence at the given site. This is the inverse of `org:hasSite`. @en
comment: Indica un'Organization che ha una qualche presenza nella data sede. È l'inverso di `org:hasSite`. @it
comment: Organización que tiene ubicación en un lugar. Es la relación inversa de `org:hasSite`.
type: Property
type: ObjectProperty
domain: sede
label: sede di @it
comment: Indique une Organisation qui a une présence sur le site en question. Inverse de `org:hasSite`. @fr
range: organización
inverse of: tiene sede en
label: site de @fr
label: site Of @en
comment: あるサイトである存在感を持っている組織を示します。 @ja
range: Resource
range: Organization
range: http://lodlaundromat.org/.well-known/genid/samples/jena///class//fb392f1f41dc748adcc2dbd6019e71b4/218f3af31162c0199ca266130c18209c#11
range: Agent
range: http://lodlaundromat.org/.well-known/genid/samples/jena///class//fb392f1f41dc748adcc2dbd6019e71b4/218f3af31162c0199ca266130c18209c#14
domain: Resource

European Centre for Disease Prevention and Control
type: Regulatory Agency
type: Thing
type: organización
type: Organization
type: Decentralised body of the European Union
type: http://lodlaundromat.org/.well-known/genid/samples/jena///class//fb392f1f41dc748adcc2dbd6019e71b4/218f3af31162c0199ca266130c18209c#14
type: Agent
type: http://lodlaundromat.org/.well-known/genid/samples/jena///class//fb392f1f41dc748adcc2dbd6019e71b4/218f3af31162c0199ca266130c18209c#11
lat: 59.35
subject: Executive (government)
alternative label: ECDC
long: 18.0
description: The European Centre for Disease Prevention and Control (ECDC) is an independent agency of the European Union aimed at strengthening Europe's defences against infectious diseases.
type: Policy Agency
based near: Solna Municipality
point: 59.35 18
different from: directora ejecutiva

European Union Agency for Fundamental Rights
point: 48.208333 16.373056
type: Policy Agency
alternative label: FRA
based near: Vienna
long: 16.373056
lat: 48.208332
description: The European Union Agency for Fundamental Rights (FRA) is an EU body tasked with collecting and analysing data on fundamental rights with reference to, in principle, all rights listed in the Charter; however, it is intended to focus particularly on the thematic areas within the scope of EU law.
subject: Judicial branch
type: Regulatory Agency
type: Thing
type: organización
type: Organization
type: Decentralised body of the European Union
type: http://lodlaundromat.org/.well-known/genid/samples/jena///class//fb392f1f41dc748adcc2dbd6019e71b4/218f3af31162c0199ca266130c18209c#14
type: Agent
type: http://lodlaundromat.org/.well-known/genid/samples/jena///class//fb392f1f41dc748adcc2dbd6019e71b4/218f3af31162c0199ca266130c18209c#11
different from: directora ejecutiva

Specialised body of the European Union
subclass of: Organization
subclass of: organización
type: Class

Translation Centre for the Bodies of the European Union
type: Regulatory Agency
type: Thing
type: organización
type: Organization
description: The Translation Centre for the Bodies of the European Union was set up in 1994 to provide the translation services required by the specialised decentralised agencies of the European Union.
alternative label: CdT
long: 6.1472
point: 49.62297 6.1472
based near: Luxembourg (city)
subject: Executive (government)
type: Policy Agency
lat: 49.62297
type: Decentralised body of the European Union
type: http://lodlaundromat.org/.well-known/genid/samples/jena///class//fb392f1f41dc748adcc2dbd6019e71b4/218f3af31162c0199ca266130c18209c#14
type: Agent
type: http://lodlaundromat.org/.well-known/genid/samples/jena///class//fb392f1f41dc748adcc2dbd6019e71b4/218f3af31162c0199ca266130c18209c#11
different from: directora ejecutiva

Institution of the European Union
subclass of: Organization
subclass of: organización
type: Class

European Food Safety Authority
type: Regulatory Agency
type: Thing
type: organización
type: Organization
type: http://lodlaundromat.org/.well-known/genid/samples/jena///class//fb392f1f41dc748adcc2dbd6019e71b4/218f3af31162c0199ca266130c18209c#14
type: http://lodlaundromat.org/.well-known/genid/samples/jena///class//fb392f1f41dc748adcc2dbd6019e71b4/218f3af31162c0199ca266130c18209c#11
type: Decentralised body of the European Union
type: Agent
subject: Executive (government)
based near: Parma
alternative label: EFSA
description: The European Food Safety Authority (EFSA) provides independent scientific advice on all matters with a direct or indirect impact on food safety — including animal health and welfare and plant protection. EFSA is also consulted on nutrition in relation to Community legislation.
lat: 44.8
type: Policy Agency
point: 44.8 10.333333
long: 10.333333
different from: directora ejecutiva

es condición de miembro sobre agente
range: Thing
domain: Thing
label: member @en
type: ObjectProperty
label: membre @fr
type: FunctionalProperty
range: Agent
inverse of: tiene membresía
comment: Indicates the Person (or other Agent including Organization) involved in the Membership relationship. Inverse of `org:hasMembership` @en
label: membro @it
comment: Persona (u otro agente, incluyendo una organización) que participa en la relación de membresía. Es la relación inversa de `org:hasMembership`.
domain: membresía
comment: Indica la Person (o un altro Agent) coinvolto in una relazione di Membership. È l'inverso di `org:hasMembership`. @it
comment: 構成員関係に含まれている人（または、組織を含んでいる他のエージェント）を示します。 @ja
type: Property
comment: Indique une personne (ou tout autre Agent, y compris une Organisation) impliqué dans la relation d'Engagement. Inverse de `org:hasMembership` @fr
range: http://lodlaundromat.org/.well-known/genid/samples/jena///class//fb392f1f41dc748adcc2dbd6019e71b4/218f3af31162c0199ca266130c18209c#11
range: Resource
range: http://lodlaundromat.org/.well-known/genid/samples/jena///class//fb392f1f41dc748adcc2dbd6019e71b4/218f3af31162c0199ca266130c18209c#14
domain: Resource
domain: http://lodlaundromat.org/.well-known/genid/samples/jena///class//fb392f1f41dc748adcc2dbd6019e71b4/218f3af31162c0199ca266130c18209c#17

Committee of the Regions
subject: Executive (government)
based near: Brussels
point: 50.840556 4.377222
type: Consultative body of the European Union
alternative label: CoR
long: 4.377222
description: The Committee of the Regions (CoR) is an advisory body composed of representatives of Europe's regional and local authorities. The CoR has to be consulted before EU decisions are taken on matters such as regional policy, the environment, education and transport - all of which concern local and regional government.
lat: 50.840557
type: Thing
type: organización
type: Organization
type: http://lodlaundromat.org/.well-known/genid/samples/jena///class//fb392f1f41dc748adcc2dbd6019e71b4/218f3af31162c0199ca266130c18209c#11
type: http://lodlaundromat.org/.well-known/genid/samples/jena///class//fb392f1f41dc748adcc2dbd6019e71b4/218f3af31162c0199ca266130c18209c#14
type: Agent
different from: directora ejecutiva

European Parliament
long: 7.769092
alternative label: EP
point: 48.597512 7.769092
type: Institution of the European Union
lat: 48.59751
based near: Strasbourg
description: The European Parliament (EP) is elected by the citizens of the European Union to represent their interests.
subject: Legislature
type: Thing
type: Organization
type: http://lodlaundromat.org/.well-known/genid/samples/jena///class//fb392f1f41dc748adcc2dbd6019e71b4/218f3af31162c0199ca266130c18209c#11
type: http://lodlaundromat.org/.well-known/genid/samples/jena///class//fb392f1f41dc748adcc2dbd6019e71b4/218f3af31162c0199ca266130c18209c#14
type: organización
type: Agent
different from: directora ejecutiva

tiene miembro
range: Thing
domain: Thing
sub property of: member
comment: Indicates a person who is a member of the subject Organization. Inverse of `org:memberOf`, see that property for further clarification. Provided for compatibility with `foaf:member`. @en
type: ObjectProperty
label: ha membro @it
domain: organización
inverse of: es miembro de
equivalent property: member
label: has member @en
type: Property
comment: 対象組織のメンバーであるエージェント（人または他の組織）を示します。org:memberOfの逆。さらに明確な説明については、そのプロパティーを参照してください。 @ja
range: Agent
comment: Indique une personne membre de l'Organisation sujet. Inverse de `org:memberOf`, voyez la description de cette propriété pour plus de précisions. Fourni pour la compatibilité avec `foaf:member`. @fr
label: possède un membre @fr
comment: Persona que es miembro de la organización en cuestión. Es la relación inversa de `org:memberOf`, véase la descripción de esa propiedad para más detalles. Se prevé compatibilidad con foaf:member`.
comment: Indica una persona che è membro della data Organization. È l'inverso di `org:memberOf` ed è fornita per compatibilità con `foaf:member`. @it
range: Resource
range: http://lodlaundromat.org/.well-known/genid/samples/jena///class//fb392f1f41dc748adcc2dbd6019e71b4/218f3af31162c0199ca266130c18209c#11
range: http://lodlaundromat.org/.well-known/genid/samples/jena///class//fb392f1f41dc748adcc2dbd6019e71b4/218f3af31162c0199ca266130c18209c#14
domain: Resource
domain: Organization
domain: Agent
domain: http://lodlaundromat.org/.well-known/genid/samples/jena///class//fb392f1f41dc748adcc2dbd6019e71b4/218f3af31162c0199ca266130c18209c#14
domain: http://lodlaundromat.org/.well-known/genid/samples/jena///class//fb392f1f41dc748adcc2dbd6019e71b4/218f3af31162c0199ca266130c18209c#11

European Union Agency for Fundamental Rights
type: Regulatory Agency
type: Thing
type: organización
type: Organization
type: Decentralised body of the European Union
type: http://lodlaundromat.org/.well-known/genid/samples/jena///class//fb392f1f41dc748adcc2dbd6019e71b4/218f3af31162c0199ca266130c18209c#14
type: Agent
type: http://lodlaundromat.org/.well-known/genid/samples/jena///class//fb392f1f41dc748adcc2dbd6019e71b4/218f3af31162c0199ca266130c18209c#11
point: 48.208333 16.373056
type: Policy Agency
alternative label: FRA
based near: Vienna
long: 16.373056
lat: 48.208332
description: The European Union Agency for Fundamental Rights (FRA) is an EU body tasked with collecting and analysing data on fundamental rights with reference to, in principle, all rights listed in the Charter; however, it is intended to focus particularly on the thematic areas within the scope of EU law.
subject: Judicial branch
different from: directora ejecutiva

trabaja en la sede
range: Thing
domain: Thing
comment: Indicates the site at which a person is based. We do not restrict the possibility that a person is based at multiple sites. @en
domain: Person
label: basé à @fr
comment: 人が基礎としているサイトを示します。人が複数のサイトを基礎としている可能性を制限しません。 @ja
comment: Lugar en el que trabaja una persona. No se restringe el hecho de que una persona pueda estar adscrita a múltiples ubicaciones.
comment: Indique le site sur lequel une personne est basée. Nous ne limitons pas le nombre de sites sur lesquels une personne peut être basée. @fr
label: based At @en
label: basata a @it
comment: Indica la sede in cui una è stabilita una persona. Non esclude la possibilità che una persona sia allocata su più sedi. @it
range: sede
type: ObjectProperty
type: Property
range: Resource
domain: Resource

European Chemicals Agency
type: Regulatory Agency
subject: Executive (government)
based near: Helsinki
long: 24.9375
alternative label: ECHA
type: Policy Agency
description: The European Chemicals Agency (ECHA) manages the technical, scientific and administrative aspects of the Registration, Evaluation, Authorisation and Restriction of Chemicals (REACH) system.
point: 60.170833 24.9375
lat: 60.170834
type: Thing
type: Decentralised body of the European Union
type: http://lodlaundromat.org/.well-known/genid/samples/jena///class//fb392f1f41dc748adcc2dbd6019e71b4/218f3af31162c0199ca266130c18209c#14
type: organización
type: Organization
type: Agent
type: http://lodlaundromat.org/.well-known/genid/samples/jena///class//fb392f1f41dc748adcc2dbd6019e71b4/218f3af31162c0199ca266130c18209c#11
different from: directora ejecutiva

European Monitoring Centre for Drugs and Drug Addiction
type: Regulatory Agency
type: Thing
type: organización
type: Organization
type: Decentralised body of the European Union
type: http://lodlaundromat.org/.well-known/genid/samples/jena///class//fb392f1f41dc748adcc2dbd6019e71b4/218f3af31162c0199ca266130c18209c#14
type: Agent
type: http://lodlaundromat.org/.well-known/genid/samples/jena///class//fb392f1f41dc748adcc2dbd6019e71b4/218f3af31162c0199ca266130c18209c#11
subject: Executive (government)
long: -9.139386
lat: 38.71381
based near: Lisbon
description: The European Monitoring Centre for Drugs and Drug Addiction (EMCDDA) is the hub of drug-related information in the European Union. Its role is to gather, analyse and disseminate ‘objective, reliable and comparable information’ on drugs and drug addiction and, in so doing, provide its audiences with a sound and evidence-based picture of the drug phenomenon at European level.
alternative label: EMCDDA
type: Policy Agency
point: 38.713811 -9.139386
different from: directora ejecutiva

recibe remuneración
range: Thing
domain: Thing
comment: Indique un salaire ou tout autre compensation associée au Rôle. Typiquement, ceci sera annoté en utilisant un schéma existant comme `gr:PriceSpecification` mais le champ de cette propriété est laissé ouvert afin de permettre aux applications de la spécialiser (par exemple remunerationEuro). @fr
comment: Indicates a salary or other reward associated with the role. Typically this will be denoted using an existing representation scheme such as `gr:PriceSpecification` but the range is left open to allow applications to specialize it (e.g. to remunerationInGBP). @en
comment: Indica il salario o altra forma di remunerazione associata al ruolo. In genere, questo si denota usando uno schema di rappresentazione esistente come il `gr:PriceSpecification` ma il codominio è lasciato libero di essere specializzato a seconda delle applicazioni. @it
label: rémuneration @fr
label: remunerazione @it
comment: Salario o cualquier otra remuneración asociada con la actividad. La forma usual de referirse a dicha remuneración será utilizando un esquema de representación como el propuesto en la ontología GoodRelations `gr:PriceSpecification`, pero el rango se deja abierto a que las distintas aplicaciones lo especialicen (por ejemplo, remunerationInGBP)
domain: actividad
commenet: 役割に関係する給料やその他の報酬を示します。 @ja
type: Property
type: ObjectProperty
label: remuneration @en
range: Resource
domain: Concept
domain: Resource

European Research Council Executive Agency
type: Thing
type: organización
type: Organization
type: Decentralised body of the European Union
type: http://lodlaundromat.org/.well-known/genid/samples/jena///class//fb392f1f41dc748adcc2dbd6019e71b4/218f3af31162c0199ca266130c18209c#14
type: Agent
type: http://lodlaundromat.org/.well-known/genid/samples/jena///class//fb392f1f41dc748adcc2dbd6019e71b4/218f3af31162c0199ca266130c18209c#11
lat: 50.83924
alternative label: ERC Executive Agency
subject: Executive (government)
based near: Brussels
type: Executive Agency
long: 4.38393
point: 50.83924 4.38393
description: The European Research Council (ERC) is part of the EU's Seventh Research Framework Programme (FP7). It is set up by the European Commission to support investigator-driven frontier research and was established in February 2007 on the basis of the FP7 IDEAS specific programme, with a total budget of 7.5 billion Euro (2007-2013).
different from: directora ejecutiva

European Union Agency for Fundamental Rights
type: Regulatory Agency
type: Thing
type: organización
type: Organization
point: 48.208333 16.373056
type: Policy Agency
alternative label: FRA
based near: Vienna
long: 16.373056
lat: 48.208332
description: The European Union Agency for Fundamental Rights (FRA) is an EU body tasked with collecting and analysing data on fundamental rights with reference to, in principle, all rights listed in the Charter; however, it is intended to focus particularly on the thematic areas within the scope of EU law.
subject: Judicial branch
type: Decentralised body of the European Union
type: http://lodlaundromat.org/.well-known/genid/samples/jena///class//fb392f1f41dc748adcc2dbd6019e71b4/218f3af31162c0199ca266130c18209c#14
type: Agent
type: http://lodlaundromat.org/.well-known/genid/samples/jena///class//fb392f1f41dc748adcc2dbd6019e71b4/218f3af31162c0199ca266130c18209c#11
different from: directora ejecutiva

es miembro durante
range: Thing
domain: Thing
domain: membresía
comment: Proprietà opzionale per indicare l'intervallo per il quale l'appartenenza è/è stata valida. @it
comment: Propriété optionnelle pour indiquer l'intervalle durant lequel l'engagemnet est ou était valide. @fr
label: member During @en
type: Property
label: durée d'engagement @fr
label: membro durante @it
comment: Optional property to indicate the interval for which the membership is/was valid. @en
type: ObjectProperty
comment: Propiedad opcional que indica el periodo durante el cual la relación de membresía o pertenencia a una organización se mantiene en vigencia.
comment: 構成員が有効である／であった期間を示すためのオプションのプロパティー。 @ja
range: Resource
domain: Resource
domain: http://lodlaundromat.org/.well-known/genid/samples/jena///class//fb392f1f41dc748adcc2dbd6019e71b4/218f3af31162c0199ca266130c18209c#17

European Police Office
type: Regulatory Agency
type: Thing
type: organización
type: Organization
type: Decentralised body of the European Union
type: http://lodlaundromat.org/.well-known/genid/samples/jena///class//fb392f1f41dc748adcc2dbd6019e71b4/218f3af31162c0199ca266130c18209c#14
type: Agent
type: http://lodlaundromat.org/.well-known/genid/samples/jena///class//fb392f1f41dc748adcc2dbd6019e71b4/218f3af31162c0199ca266130c18209c#11
point: 52.083333 4.316667
type: Police and judicial cooperation in criminal matters Agency
description: Europol is the European Union law enforcement agency that handles the exchange and analysis of criminal intelligence. Its mission is to improve the effectiveness and cooperation between EU law enforcement authorities in preventing and combating serious international crime and terrorism, with the aim of achieving a safer Europe for all EU citizens.
alternative label: EUROPOL
based near: The Hague
subject: Executive (government)
long: 4.316667
lat: 52.083332
different from: directora ejecutiva

EURATOM Supply Agency
description: The Euratom Supply Agency's mission is to ensure a regular and equitable supply of nuclear fuels for Community users.
alternative label: ESA
subject: Executive (government)
lat: 49.58267
type: EURATOM Agency
based near: Luxembourg (city)
long: 6.1183
point: 49.58267 6.1183
type: Thing
type: http://lodlaundromat.org/.well-known/genid/samples/jena///class//fb392f1f41dc748adcc2dbd6019e71b4/218f3af31162c0199ca266130c18209c#14
type: Decentralised body of the European Union
type: organización
type: Organization
type: Agent
type: http://lodlaundromat.org/.well-known/genid/samples/jena///class//fb392f1f41dc748adcc2dbd6019e71b4/218f3af31162c0199ca266130c18209c#11
different from: directora ejecutiva

European Medicines Agency
type: Policy Agency
subject: Executive (government)
long: -0.1275
based near: London
description: The European Medicines Agency is a decentralised body of the European Union with headquarters in London. Its main responsibility is the protection and promotion of public and animal health, through the evaluation and supervision of medicines for human and veterinary use.
lat: 51.50722
point: 51.507222 -0.1275
alternative label: EMA
type: Regulatory Agency
type: Thing
type: organización
type: Organization
type: http://lodlaundromat.org/.well-known/genid/samples/jena///class//fb392f1f41dc748adcc2dbd6019e71b4/218f3af31162c0199ca266130c18209c#14
type: http://lodlaundromat.org/.well-known/genid/samples/jena///class//fb392f1f41dc748adcc2dbd6019e71b4/218f3af31162c0199ca266130c18209c#11
type: Decentralised body of the European Union
type: Agent
different from: directora ejecutiva

es modificado por
range: Thing
domain: Thing
label: cambiata da @it
label: changed by @en
type: Property
type: ObjectProperty
range: evento de cambio
comment: Indique un évènement qui a impliqué un changement dans l'Organisation. Selon l'évènement, l'Organisation a continué à exister après l'évènement, ou pas. Inverse de `org:originalOrganization`. @fr
comment: Evento de cambio que resulta en una modificación en la organización. Dependiendo del evento, la organización puede dejar de existir tras el cambio. Es la relación inversa de `org:originalOrganization`.
label: es modificada por
inverse of: es organización original
comment: Indicates a change event which resulted in a change to this organization. Depending on the event the organization may or may not have continued to exist after the event. Inverse of `org:originalOrganization`. @en
comment: Indica un evento che ha contribuito al cambiamento di questa organizzazione. A seconda dell'evento, l'organizzazione potrebbe essere esistente dopo l'evento o aver cessato la propria esistenza. È l'inverso di `org:originalOrganization`. @it
comment: この組織の変更のきっかけとなった出来事を示します。 @ja
domain: organización
label: modifiée par @fr
range: Resource
range: Activity
domain: Resource
domain: http://lodlaundromat.org/.well-known/genid/samples/jena///class//fb392f1f41dc748adcc2dbd6019e71b4/218f3af31162c0199ca266130c18209c#14
domain: http://lodlaundromat.org/.well-known/genid/samples/jena///class//fb392f1f41dc748adcc2dbd6019e71b4/218f3af31162c0199ca266130c18209c#11
domain: Agent
domain: Organization

European Centre for Disease Prevention and Control
lat: 59.35
subject: Executive (government)
alternative label: ECDC
long: 18.0
description: The European Centre for Disease Prevention and Control (ECDC) is an independent agency of the European Union aimed at strengthening Europe's defences against infectious diseases.
type: Policy Agency
based near: Solna Municipality
point: 59.35 18
type: Regulatory Agency
type: Thing
type: organización
type: Organization
type: Decentralised body of the European Union
type: http://lodlaundromat.org/.well-known/genid/samples/jena///class//fb392f1f41dc748adcc2dbd6019e71b4/218f3af31162c0199ca266130c18209c#14
type: Agent
type: http://lodlaundromat.org/.well-known/genid/samples/jena///class//fb392f1f41dc748adcc2dbd6019e71b4/218f3af31162c0199ca266130c18209c#11
different from: directora ejecutiva

Agency for the Cooperation of Energy Regulators
type: Regulatory Agency
type: Thing
type: organización
type: Organization
type: http://lodlaundromat.org/.well-known/genid/samples/jena///class//fb392f1f41dc748adcc2dbd6019e71b4/218f3af31162c0199ca266130c18209c#14
type: http://lodlaundromat.org/.well-known/genid/samples/jena///class//fb392f1f41dc748adcc2dbd6019e71b4/218f3af31162c0199ca266130c18209c#11
subject: Executive (government)
lat: 46.062
alternative label: ACER
description: ACER's mission is to assist National Regulatory Authorities in exercising, at Community level, the regulatory tasks that they perform in the Member States and, where necessary, to coordinate their action.
based near: Ljubljana
type: Policy Agency
point: 46.062 14.509
long: 14.509
type: Decentralised body of the European Union
type: Agent
different from: directora ejecutiva

European Network and Information Security Agency
type: Regulatory Agency
type: Thing
type: organización
type: Organization
type: Decentralised body of the European Union
type: http://lodlaundromat.org/.well-known/genid/samples/jena///class//fb392f1f41dc748adcc2dbd6019e71b4/218f3af31162c0199ca266130c18209c#14
type: Agent
type: http://lodlaundromat.org/.well-known/genid/samples/jena///class//fb392f1f41dc748adcc2dbd6019e71b4/218f3af31162c0199ca266130c18209c#11
long: 25.133333
description: The objective of European Network and Information Security Agency (ENISA) is to improve network and information security in the European Union.
alternative label: ENISA
based near: Heraklion
subject: Executive (government)
point: 35.333333 25.133333
lat: 35.333332
type: Policy Agency
different from: directora ejecutiva

Agency for the Cooperation of Energy Regulators
type: Regulatory Agency
type: Thing
type: organización
type: Organization
type: http://lodlaundromat.org/.well-known/genid/samples/jena///class//fb392f1f41dc748adcc2dbd6019e71b4/218f3af31162c0199ca266130c18209c#14
type: http://lodlaundromat.org/.well-known/genid/samples/jena///class//fb392f1f41dc748adcc2dbd6019e71b4/218f3af31162c0199ca266130c18209c#11
type: Decentralised body of the European Union
type: Agent
subject: Executive (government)
lat: 46.062
alternative label: ACER
description: ACER's mission is to assist National Regulatory Authorities in exercising, at Community level, the regulatory tasks that they perform in the Member States and, where necessary, to coordinate their action.
based near: Ljubljana
type: Policy Agency
point: 46.062 14.509
long: 14.509
different from: directora ejecutiva

actividad
subclass of: Resource
subclass of: Thing
label: Rôle @fr
disjoint with: evento de cambio
subclass of: Concept
comment: 人またはその他のエージェントが組織で担うことができる役割を表わします。この種のインスタンスは、抽象的な役割を記述します。特定の組織でその役割を担っている人の特定のインスタンスを示すためには、org:Membershipのインスタンスを使用します。 @ja
comment: Indica il ruolo che una Person o un altro Agent può assumere in un'organizzazione. Le istanze di questa classe descrivono un ruolo astratto; per esprimere il ruolo che una precisa persona ricopre in un'organizzazione si usi un'istanza di `org:Membership`. È comune organizzare i ruoli in una qualche struttura tassonomica e quindi si raccomanda SKOS per questo. Altre proprietà descrittive per il Role, come salario, possono essere aggiunte mediante l'uso di altri vocabolari. @it
type: Class
disjoint with: sede
comment: Indique le rôle qu'une Personne ou un autre Agent peut avoir dans une Organisation. Les instances de cette classe décrivent le rôle dans l'absolu; pour indiquer une personne ayant ce rôle spécifique dans une Organisation, utilisez une instance de `org:Membership`. Il est courant que les rôles soient organisés dans une sorte de taxonomie, ce qui peut être représenté avec SKOS. Les propriétés de libellés standards de SKOS devraient être utilisées pour libeller le Rôle. D'autres propriétés additionnelles pour ce rôle, comme une fourchette de Salaire peuvent être ajoutées par une extension de ce vocabulaire. @fr
disjoint with: membresía
label: Role @en
comment: Denotes a role that a Person or other Agent can take in an organization. Instances of this class describe the abstract role; to denote a specific instance of a person playing that role in a specific organization use an instance of `org:Membership`. It is common for roles to be arranged in some taxonomic structure and we use SKOS to represent that. The normal SKOS lexical properties should be used when labelling the Role. Additional descriptive properties for the Role, such as a Salary band, may be added by extension vocabularies. @en
label: Ruolo @it
comment: Función que una persona o agente desempeña en el seno de una organización. Las instancias de esta clase describen la actividad en abstracto; si lo que se pretende es incluir una instancia que refleje la función o actividad que desempeña una persona en concreto en una organización específica, se indica el uso de instancias de la clase `org:Membership`. Es común que dichas actividades se representen en una estructura taxonómica mediante SKOS. Las propiedades léxicas de SKOS deberían utilizarse a la hora de denominar o etiquetar la actividad desempeñada. Para añadir propiedades descriptivas adicionales, como rango salarial, se tendrá que recurrir a vocabularios externos.
disjoint with: organización

European Aviation Safety Agency
type: Regulatory Agency
type: Thing
type: Decentralised body of the European Union
type: http://lodlaundromat.org/.well-known/genid/samples/jena///class//fb392f1f41dc748adcc2dbd6019e71b4/218f3af31162c0199ca266130c18209c#14
type: organización
type: Organization
type: Agent
type: http://lodlaundromat.org/.well-known/genid/samples/jena///class//fb392f1f41dc748adcc2dbd6019e71b4/218f3af31162c0199ca266130c18209c#11
subject: Executive (government)
alternative label: EASA
description: The European Aviation Safety Agency (EASA) is an agency of the European Unionwith offices in Cologne, Germany, which has been given regulatory and executive tasks in the field of civilian aviation safety.
type: Policy Agency
point: 50.95 6.966667
long: 6.966667
lat: 50.95
based near: Cologne
different from: directora ejecutiva

European Defence Agency
alternative label: EDA
type: Common Security and Defence Policy Agency
based near: Brussels
description: The European Defence Agency (EDA) is an agency of the European Union based in Brussels. It is a Common Foreign and Security Policy (CFSP) body set up on 12 July 2004, reporting to the Council of the European Union.
long: 4.38393
point: 50.83924 4.38393
subject: Executive (government)
lat: 50.83924
type: Thing
type: Decentralised body of the European Union
type: Regulatory Agency
type: http://lodlaundromat.org/.well-known/genid/samples/jena///class//fb392f1f41dc748adcc2dbd6019e71b4/218f3af31162c0199ca266130c18209c#14
type: organización
type: Organization
type: Agent
type: http://lodlaundromat.org/.well-known/genid/samples/jena///class//fb392f1f41dc748adcc2dbd6019e71b4/218f3af31162c0199ca266130c18209c#11
different from: directora ejecutiva

Executive Agency for Competitiveness and Innovation
type: Thing
type: organización
type: Organization
type: Decentralised body of the European Union
type: http://lodlaundromat.org/.well-known/genid/samples/jena///class//fb392f1f41dc748adcc2dbd6019e71b4/218f3af31162c0199ca266130c18209c#14
type: http://lodlaundromat.org/.well-known/genid/samples/jena///class//fb392f1f41dc748adcc2dbd6019e71b4/218f3af31162c0199ca266130c18209c#11
description: Executive Agency for Competitiveness and Innovation (EACI) manages high-quality European funding schemes and initiatives in several areas.
alternative label: EACI
based near: Brussels
subject: Executive (government)
type: Executive Agency
long: 4.38393
lat: 50.83924
point: 50.83924 4.38393
type: Agent
different from: directora ejecutiva

EURATOM Supply Agency
type: Thing
description: The Euratom Supply Agency's mission is to ensure a regular and equitable supply of nuclear fuels for Community users.
alternative label: ESA
subject: Executive (government)
lat: 49.58267
type: EURATOM Agency
based near: Luxembourg (city)
long: 6.1183
point: 49.58267 6.1183
type: http://lodlaundromat.org/.well-known/genid/samples/jena///class//fb392f1f41dc748adcc2dbd6019e71b4/218f3af31162c0199ca266130c18209c#14
type: Decentralised body of the European Union
type: organización
type: Organization
type: Agent
type: http://lodlaundromat.org/.well-known/genid/samples/jena///class//fb392f1f41dc748adcc2dbd6019e71b4/218f3af31162c0199ca266130c18209c#11
different from: directora ejecutiva

European Agency for the Management of Operational Cooperation at the External Borders
subject: Executive (government)
type: Policy Agency
lat: 52.23
description: FRONTEX coordinates operational cooperation between Member States in the field of management of external borders; assists Member States in the training of national border guards, including the establishment of common training standards; carries out risk analyses; follows up the development of research relevant for the control and surveillance of external borders; assists Member States in circumstances requiring increased technical and operational assistance at external borders; and provides Member States with the necessary support in organising joint return operations.
point: 52.23 21.010833
based near: Warsaw
alternative label: FRONTEX
long: 21.010834
type: Regulatory Agency
type: Thing
type: organización
type: Organization
type: http://lodlaundromat.org/.well-known/genid/samples/jena///class//fb392f1f41dc748adcc2dbd6019e71b4/218f3af31162c0199ca266130c18209c#14
type: http://lodlaundromat.org/.well-known/genid/samples/jena///class//fb392f1f41dc748adcc2dbd6019e71b4/218f3af31162c0199ca266130c18209c#11
type: Decentralised body of the European Union
type: Agent
different from: directora ejecutiva

Office for Harmonisation in the Internal Market (Trade Marks and Designs)
type: Regulatory Agency
type: Thing
type: Decentralised body of the European Union
type: http://lodlaundromat.org/.well-known/genid/samples/jena///class//fb392f1f41dc748adcc2dbd6019e71b4/218f3af31162c0199ca266130c18209c#14
type: organización
type: Organization
type: Agent
type: http://lodlaundromat.org/.well-known/genid/samples/jena///class//fb392f1f41dc748adcc2dbd6019e71b4/218f3af31162c0199ca266130c18209c#11
based near: Alicante
subject: Executive (government)
point: 38.345278 -0.483056
long: -0.483056
description: The OHIM is the official authority carrying out the procedures for the Community trade marks since 1996 and for the Community registered design from 2003.
alternative label: OHIM
type: Policy Agency
lat: 38.34528
different from: directora ejecutiva

European Joint Undertaking for ITER and the Development of Fusion Energy
alternative label: F4E
description: Fusion for Energy (F4E) was established in April 2007 for a period of 35 years. It primarily manages Europe’s contribution to ITER, the international fusion energy project. One of its main tasks is to work together with European industry and research organisations to develop and provide a wide range of high technology components for the ITER project.
subject: Executive (government)
lat: 41.40722
point: 41.40722 2.21823
type: EURATOM Agency
alternative label: Fusion for Energy
long: 2.21823
based near: Barcelona
type: Thing
type: http://lodlaundromat.org/.well-known/genid/samples/jena///class//fb392f1f41dc748adcc2dbd6019e71b4/218f3af31162c0199ca266130c18209c#14
type: Decentralised body of the European Union
type: organización
type: Organization
type: Agent
type: http://lodlaundromat.org/.well-known/genid/samples/jena///class//fb392f1f41dc748adcc2dbd6019e71b4/218f3af31162c0199ca266130c18209c#11
different from: directora ejecutiva

European Medicines Agency
type: Regulatory Agency
type: Thing
type: organización
type: Organization
type: http://lodlaundromat.org/.well-known/genid/samples/jena///class//fb392f1f41dc748adcc2dbd6019e71b4/218f3af31162c0199ca266130c18209c#14
type: http://lodlaundromat.org/.well-known/genid/samples/jena///class//fb392f1f41dc748adcc2dbd6019e71b4/218f3af31162c0199ca266130c18209c#11
type: Decentralised body of the European Union
type: Policy Agency
subject: Executive (government)
long: -0.1275
based near: London
description: The European Medicines Agency is a decentralised body of the European Union with headquarters in London. Its main responsibility is the protection and promotion of public and animal health, through the evaluation and supervision of medicines for human and veterinary use.
lat: 51.50722
point: 51.507222 -0.1275
alternative label: EMA
type: Agent
different from: directora ejecutiva

European Agency for the Management of Operational Cooperation at the External Borders
type: Regulatory Agency
type: Thing
type: organización
type: Organization
type: http://lodlaundromat.org/.well-known/genid/samples/jena///class//fb392f1f41dc748adcc2dbd6019e71b4/218f3af31162c0199ca266130c18209c#14
type: http://lodlaundromat.org/.well-known/genid/samples/jena///class//fb392f1f41dc748adcc2dbd6019e71b4/218f3af31162c0199ca266130c18209c#11
type: Decentralised body of the European Union
subject: Executive (government)
type: Policy Agency
lat: 52.23
description: FRONTEX coordinates operational cooperation between Member States in the field of management of external borders; assists Member States in the training of national border guards, including the establishment of common training standards; carries out risk analyses; follows up the development of research relevant for the control and surveillance of external borders; assists Member States in circumstances requiring increased technical and operational assistance at external borders; and provides Member States with the necessary support in organising joint return operations.
point: 52.23 21.010833
based near: Warsaw
alternative label: FRONTEX
long: 21.010834
type: Agent
different from: directora ejecutiva

Policy Agency
subclass of: Regulatory Agency
type: Class

Institutions and Bodies of the European Union

Police and judicial cooperation in criminal matters Agency
subclass of: Regulatory Agency
type: Class

desempeña la actividad de (propiedad)
comment: Questa è una meta-proprietà usata per annotare un'istanza di `org:Role` con una sotto-proprietà di `org:memberOf` e può essere usata per indicare direttamente il ruolo per facilitare un'interrogazione sui dati. @it
label: rôle (propriété) @fr
label: role (property) @en
comment: Ceci est une méta-propriété utilisée pour annoter une instance de `org:Role` ayant une sous-propriété `org:memberOf` qui peut être utilisée pour indiquer directement le rôle et pouvoir faire des requêtes plus facilement. La sémantique visée est un Engagement impliquant l'existence d'une relation de propriété directe à travers d'une règle d'inférence de la forme: `{ [] org:member ?p; org:organization ?o; org:role [org:roleProperty ?r] } -> {?p ?r ?o}`. @fr
comment: これは、クエリが容易になるように役割を直接的に示すために使用できるorg:memberOfのサブプロパティーでorg:Roleインスタンスを注釈するために用いられるメタレベルのプロパティーです。 @ja
range: Property
comment: This is a metalevel property which is used to annotate an `org:Role` instance with a sub-property of `org:memberOf` that can be used to directly indicate the role for easy of query. The intended semantics is a Membership relation involving the Role implies the existence of a direct property relationship through an inference rule of the form: `{ [] org:member ?p; org:organization ?o; org:role [org:roleProperty ?r] } -> {?p ?r ?o}`. @en
type: Property
type: AnnotationProperty
label: ruolo (proprietà) @it
comment: Meta-propiedad que se utiliza para anotar una instancia de `org:Role` con una sub-propiedad de `org:memberOf`, que puede ser utilizada para indicar directamente la actividad a fin de facilitar las consultas a los datos. The intended semantics is that a Membership relation involving the Role implies the existence of a direct property relationship through an inference rule of the form: { [] org:member ?a; org:organization ?o; org:role [org:roleProperty ?r] } -> {?a ?r ?o}
domain: actividad
range: Resource
domain: Concept
domain: Resource
domain: Thing

EURATOM Agency
subclass of: Decentralised body of the European Union
type: Class

Executive Agency
subclass of: Decentralised body of the European Union
type: Class

directora ejecutiva
type: actividad
label: responsabile @it
preferred label: responsable @fr
comment: Un rôle correspondant à la propriété `org:headOf` @fr
preferred label: head @en
comment: Un ruolo corrispondente alla proprietà `org:headOf`. @it
label: director ejecutivo
comment: A role corresponding to the `org:headOf` property @en
comment: Actividad correspondiente a la propiedad `org:headOf`.
desempeña la actividad de (propiedad): es director ejecutivo de
type: Concept
type: Thing
different from: Court of Auditors
different from: Executive Agency for Health and Consumers
different from: European Data Protection Supervisor
different from: Publications Office of the European Union
different from: European Agency for the Management of Operational Cooperation at the External Borders
different from: European Parliament
different from: European Chemicals Agency
different from: European Monitoring Centre for Drugs and Drug Addiction
different from: European Police Office
different from: Court of Justice
different from: European Training Foundation
different from: European GNSS Supervisory Authority
different from: Translation Centre for the Bodies of the European Union
different from: European Food Safety Authority
different from: European Railway Agency
different from: European Agency for Safety and Health at Work
different from: European Network and Information Security Agency
different from: Agency for the Cooperation of Energy Regulators
different from: Executive Agency for Competitiveness and Innovation
different from: European Aviation Safety Agency
different from: European Investment Bank
different from: European Union Institute for Security Studies
different from: Committee of the Regions
different from: Community Plant Variety Office
different from: European Defence Agency

Ontología de organizaciones
modified: 2012-10-06
comment: Vocabulary for describing organizational structures, specializable to a broad variety of types of organization. @en
contributor: Shuji Kamitsuna
modified: 2014-01-25
title: Core organization ontology @en
created: 2010-05-28
comment: Vocabolario per descrivere strutture organizzative, le quali possono essere specializzate in una vasta varietà di tipi di organizzazione @it
modified: 2012-09-30
type: Ontology
modified: 2013-12-16
modified: 2014-01-02
contributor: Olga Ximena Giraldo
modified: 2014-04-12
title: Ontologia delle organizzazioni @it
modified: 2013-02-15
contributor: Antonio Maccioni
contributor: Elena Montiel Ponsoda
modified: 2014-02-05
modified: 2010-10-08
contributor: Giorgia Lodi
version info: 0.8
contributor: María Poveda Villalón
license: http://www.opendatacommons.org/licenses/pddl/1.0/
contributor: Dominique Guardiola
modified: 2010-06-09
comment: Vocabulario para describir organizaciones, adaptable a una amplia variedad de ellas.
contributor: Dave Reynolds
title: Ontologie des organisations @fr
contributor: Guadalupe Aguado de Cea

Common Security and Defence Policy Agency
subclass of: Regulatory Agency
type: Class

Regulatory Agency
subclass of: Decentralised body of the European Union
type: Class

tiene objetivo
label: but @fr
comment: Indique le but de cette Organisation. Il peut exister plusieurs buts à différents niveaux d'abstraction mais la nature d'une organisation est d'avoir une raison d'exister et cette propriété doit servir à documenter cette raison d'être. Une Organisation peut avoir plusieurs Buts. Il est recommandé que le but soit libellé à l'aide d'un vocabulaire contrôlé ou autre code établi, idéalement avec un concept `skos:Concept`. Toutefois, le champ de cette propriété est laissé ouvert et pourrait accepter d'autres schémas de description. Il est préférable que les spécialisations ou les profils d'applications de ce vocabulaire contraignent le champ de cette propriété. @fr
label: purpose @en
comment: Indica l'obiettivo di questa Organization. In generale, si possono esprimere gli obiettivi di un'organizzazione secondo diversi livelli di astrazione, ma la natura stessa dell'organizzazione ha una ragione d'essere ed è proprio questa che deve essere catturata con tale proprietà. Inoltre, un'Organization può avere obiettivi multipli. È raccomandabile che l'obiettivo faccia parte di una code list, e che sia preferibilmente un `skos:Concept`. Ad ogni modo, il codominio della proprietà è lasciato aperto per consentire altri tipi di di descrizione. Conseguentemente, eventuali specializzazioni o profili applicativi possono utilizzare quel vocabolario come codominio della proprietà. @it
domain: organización
comment: この組織の目的を示します。異なる抽象レベルの多くの目的がありえますが、組織の本質は存在理由を持つことであり、このプロパティーはその理由をドキュメント化する手段です。組織は、複数の目的を持っている可能性があります。 @ja
label: obiettivo @it
comment: Indicates the purpose of this Organization. There can be many purposes at different levels of abstraction but the nature of an organization is to have a reason for existence and this property is a means to document that reason. An Organization may have multiple purposes. It is recommended that the purpose be denoted by a controlled term or code list, ideally a `skos:Concept`. However, the range is left open to allow for other types of descriptive schemes. It is expected that specializations or application profiles of this vocabulary will constrain the range of the purpose. Alternative names: _remit_ _responsibility_ (esp. if applied to OrganizationalUnits such as Government Departments). @en
type: Property
comment: Finalidad u objetivo de la organización. La organización puede tener muchos objetivos a diferentes niveles de abstracción, pero en la naturaleza de las organizaciones está el tener una razón para existir, y la finalidad de esta propiedad es documentar dicha razón. La organización podrá tener más de un objetivo. Se recomienda el uso de vocabularios controlados o listas de códigos para indicar el objetivo, preferentemente mediante el uso de un `skos:Concept`. Sin embargo, el rango no está predeterminado, de forma que otros tipos de esquemas descriptivos tiene cabida. Se espera que ciertas especializaciones de este vocabulario o ciertos perfiles de aplicaciones restrinjan el rango del objetivo. Denominaciones alternativas: área_ _jurisdicción_ _ responsabilidad _ (especialmente cuando se aplica a unidades tales como ministerios o divisiones administrativas de los gobiernos)
domain: http://lodlaundromat.org/.well-known/genid/samples/jena///class//fb392f1f41dc748adcc2dbd6019e71b4/218f3af31162c0199ca266130c18209c#14
domain: Thing
domain: Resource
domain: http://lodlaundromat.org/.well-known/genid/samples/jena///class//fb392f1f41dc748adcc2dbd6019e71b4/218f3af31162c0199ca266130c18209c#11
domain: Agent
domain: Organization

tiene identificador
comment: Donne un identifiant, comme par exemple le numéro d'enregistrement d'une entreprise, qui peut être utilisé comme identifiant unique pour l'Organisation. De nombreux schémas nationaux et internationaux sont disponibles. Cette ontologie reste neutre par rapport au schéma utilisé. Le schéma particulier utilisé devrait être indiqué par le `datatype` de la valeur de l'identifiant. Utiliser les datatypes pour distinguer les schémas de notation est cohérent avec les bonnes pratiques pour `skos:notation` dont cette propriété est une spécialisation. @fr
comment: 組織を一意に識別するために使用できる会社登録番号などの識別子を与えます。 @ja
comment: Indica un identificatore univoco per l'organizzazione, come ad esempio la partita IVA di un'azienda. Molti schemi di identificazione a livello nazionale e internazionale sono disponibili allo scopo. L'ontologia ORG è neutrale rispetto allo schema da utilizzare. Lo schema di identificazione dovrebbe essere indicato dal datatype del valore dell'identificatore. L'uso del datatype per distinguere lo schema di identificazione è coerente con le best practice per `skos:notation`, di cui questa proprietà è una specializzazione. @it
label: identifiant @fr
comment: Gives an identifier, such as a company registration number, that can be used to used to uniquely identify the organization. Many different national and international identier schemes are available. The org ontology is neutral to which schemes are used. The particular identifier scheme should be indicated by the datatype of the identifier value. Using datatypes to distinguish the notation scheme used is consistent with recommended best practice for `skos:notation` of which this property is a specialization. @en
comment: Código o identificador, como por ejemplo el CIF de una empresa, que permite identificar de forma inequívoca a una organización. Existen muchos códigos de identificación tanto nacionales como internacionales. Esta ontología no obliga al uso de ningún esquema en concreto. Los códigos de identificación utilizados en cada caso se deberían indicar mediante el uso de la propiedad “datatype” del valor del identificador. El uso de la propiedad “datatype” para especificar el esquema de notación utilizado está en consonancia con las buenas prácticas recomendadas para el uso de la propiedad `skos:notation`, de la que esta propiedad es una especialización.
label: identifier @en
type: DatatypeProperty
label: identificatore @it
type: Property
sub property of: notation
domain: organización
domain: http://lodlaundromat.org/.well-known/genid/samples/jena///class//fb392f1f41dc748adcc2dbd6019e71b4/218f3af31162c0199ca266130c18209c#14
domain: Thing
domain: Resource
domain: http://lodlaundromat.org/.well-known/genid/samples/jena///class//fb392f1f41dc748adcc2dbd6019e71b4/218f3af31162c0199ca266130c18209c#11
domain: Agent
domain: Organization

está ubicada en
comment: Indique la description de l'endroit ou est basé une personne de l'Organisation, par exemple pour des besoins de messagerie interne (Bureau 42). @fr
comment: 例えば、内部配送目的のメール・ストップ（Mail Stop）などの、組織内の人の位置記述を提供します。 @ja
type: Property
comment: Gives a location description for a person within the organization, for example a _Mail Stop_ for internal posting purposes. @en
domain: Person
range: string
label: está ubicado en
comment: Indica la descrizione del luogo presso cui è possibile reperire una persona dell'organizzazione. @it
comment: Lugar o ubicación exacta de una persona en una organización con el objetivo de facilitar, por ejemplo, la entrega de correo.
label: luogo @it
label: localisation @fr
label: location @en
type: DatatypeProperty
range: Resource
domain: Resource