Software Release - version
type: Thing
comment: Revision identifier of a software release.

age
term status: unstable
type: Thing
sub property of: topDataProperty
property disjoint with: bottomDataProperty
type: FunctionalProperty
type: DatatypeProperty
type: Property
comment: The age in years of some agent.
domain: Agent
range: Literal

Surname
term status: archaic
type: Thing
sub property of: topDataProperty
property disjoint with: bottomDataProperty
type: DatatypeProperty
type: Property
comment: The surname of some person.
domain: Person
range: Literal

Data Set
usage note: ADMS.SW uses the RDF Data Qube Vocbulary to exchange metrics about a software project or software release.
type: Thing
comment: qb:DataSet fully represents the ADMS.SW class 'Data Set'.

maker
sub property of: topObjectProperty
equivalent property: creator
sub property of: creator
term status: stable
inverse of: made
property disjoint with: bottomObjectProperty
type: Thing
type: ObjectProperty
comment: An agent that made this thing.
domain: Thing
type: Property
range: Agent

Software Release - project
usage note: The inverse property of 'admsv:project' is 'doap:release'.
type: Thing
sub property of: topObjectProperty
property disjoint with: bottomObjectProperty
type: ObjectProperty
range: Project
comment: The project that has produced the Asset.

ADMS.SW Working Group
made: Asset Description Metadata Schema for Software (ADMS.SW)
type: Thing
type: Agent

Checksum
type: Thing
comment: The SPDX class 'Checksum' fully represents the ADMS.SW type with the same name. A Checksum is value that allows the contents of a file to be authenticated. Even small changes to the content of the file will change it's checksum. This class allows the results of a variety of checksum and cryptographic message digest algorithms to be represented.

depiction
term status: testing
type: Thing
sub property of: topObjectProperty
property disjoint with: bottomObjectProperty
inverse of: depicts
type: ObjectProperty
type: Property
comment: A depiction of some thing.
domain: Thing
range: Image

Software Release - used by
type: Thing
sub property of: topObjectProperty
property disjoint with: bottomObjectProperty
type: ObjectProperty
range: Agent
comment: Agent that uses the Asset.
type: Property

geekcode
term status: archaic
type: Thing
sub property of: topDataProperty
property disjoint with: bottomDataProperty
type: DatatypeProperty
type: Property
comment: A textual geekcode for this person, see http://www.geekcode.com/geek.html
domain: Person
range: Literal

Software Project - documenter
usage note: The range of this property is foaf:Person.
type: Thing
comment: The doap:documenter property fully covers the ADMS.SW property 'documenter'.

Software Project - homepage
sub property of: homepage
sub property of: is primary topic of
sub property of: topObjectProperty
type: ObjectProperty
property disjoint with: bottomObjectProperty
sub property of: page
type: Thing
comment: Both the foaf:homepage and doap:homepage property fully represents the ADMS.SW relationship of the same name.

W3C/ERCIM
type: Thing

Software Project - intended audience
usage note: Ideally, the range of this property is skos:Concept.
type: Thing
sub property of: topObjectProperty
property disjoint with: bottomObjectProperty
type: ObjectProperty
range: Intended Audience
comment: Intended audience of the software.
type: Property

Software Release - metadataDate
type: Thing
sub property of: topDataProperty
property disjoint with: bottomDataProperty
type: DatatypeProperty
comment: The date of the most recent update of the metadata for the Asset.
type: Property
label: Software Release - metadata date
range: Literal

Software Project - helper
usage note: The range of this property is foaf:Person.
type: Thing
comment: The doap:helper property fully covers the ADMS.SW property 'helper'.

Asset Description Metadata Schema for Software (ADMS.SW)
maker: ADMS.SW Working Group
maker: Phil Archer
attribution URL: http://ec.europa.eu/
specializes: radion#
creator: ADMS.SW Working Group
abstract: ADMS.SW is intended as a model that facilitates federation and co-operation. It is not the primary intention that forge owners redesign or convert their current systems and data to conform to ADMS./FOSS, but rather that ADMS.SW can act as a common layer among software forges that want to exchange data.
description: This is the RDF encoding of the Asset Description Metadata Schema for Software, developed under the European Union's ISA Programme, specifically under SEMIC Phase II, directed by Szabolcs Szekacs of DG DIGIT. It re-uses terms from several other vocabularues, notably DOAP (Description of a Project), DCAT (The Data Catalog Vocabulary) and Dublin Core with elements of SKOS, FOAF and more. The ADMS Concept Scheme, available at http://www.w3.org/ns/adms.html, defines its own lexical terms for its classes, properties and relationships.
conforms to: Process and Methodology for Developing Core Vocabularies
Software Release - main documentation: release100
maker: Stijn Goedertier
rights: Copyright (c) 2012 European Commission.
Software Release - date of last modification: com.hp.hpl.jena.datatypes.BaseDatatype$TypedValue@2b3b4ebf
creator: Stijn Goedertier
attribution name: European Commission
publisher: European Commission
Software Release - previous version: http://purl.org/adms/foss/20120625/
creator: Phil Archer
logo: UML Class Diagram: ADMS.SW v1.00 RDF Schema
preferred namespace prefix: admssw
Software Release - related asset: public-comments-adms-specification-v10
rights: Copyright © 2012 European Commission.
type: Thing
Software Package - license: ISA Open Metadata Licence v1.1
comment: This file specifies the set of RDF classes and properties used in ADMS.SW
type: Ontology
version info: Version 1.00 29 June 2012

Software Package
subclass of: Distribution
type: Thing
subclass of: SoftwareApplication
subclass of: Thing
type: Class
disjoint with: Nothing
subclass of: Package
comment: A Software Package represents a particular physical embodiment of a Software Release, which is an example of the FRBR entity manifestation (the physical embodiment of an expression of a work). A Software Package is typically a downloadable computer file (but in principle it could also be a paper document) that implements the intellectual content of a Software Release. A particular Software Package is associated with one and only one Software Release, while all Packages of a Release share the same intellectual content in different physical formats. An example of a Software Package is httpd-2.2.22.tar.gz , which represents the Unix Source of the Apache HTTP Server 2.22.22 (httpd) software release.

UML Class Diagram: ADMS.SW v1.00 Conceptual Model
depicts: Asset Description Metadata Schema for Software (ADMS.SW)
type: Thing
type: Document
type: Image

Software Project
type: Thing
disjoint with: Nothing
subclass of: Thing
subclass of: Project
type: Class
comment: A Software Project is a time-delimited undertaking with the objective to produce one or more software releases, materialised as software packages. Some projects are long-running undertakings, and do not have a clear time-delimited nature or project organisation. In this case, the term 'software project' can be interpreted as the result of the work: a collection of related software releases that serve a common purpose.

knows
term status: stable
type: Thing
sub property of: topObjectProperty
property disjoint with: bottomObjectProperty
type: ObjectProperty
type: Property
comment: A person known by this person (indicating some level of reciprocated interaction between the parties).
domain: Person
range: Person

dimension: programming language dimension
property disjoint with: bottomObjectProperty
type: DimensionProperty
type: Thing
concept: Intended Audience
sub property of: topObjectProperty
type: ObjectProperty
comment: The programming language dimension to which a measured observation applies.
type: Property

Yahoo chat ID
term status: testing
type: DatatypeProperty
type: Thing
sub property of: topDataProperty
property disjoint with: bottomDataProperty
sub property of: nickname
type: InverseFunctionalProperty
domain: Agent
range: Literal
comment: A Yahoo chat ID
type: Property

Online Account
term status: testing
type: Thing
disjoint with: Nothing
subclass of: Thing
type: Class
comment: An online account.

MSN chat ID
sub property of: nickname
property disjoint with: bottomDataProperty
type: Thing
sub property of: topDataProperty
type: InverseFunctionalProperty
term status: testing
type: DatatypeProperty
comment: An MSN chat ID
domain: Agent
type: Property
range: Literal

Software Project - translator
usage note: The range of this property is foaf:Person.
type: Thing
comment: The doap:translator property fully covers the ADMS.SW property 'translator'.

Software Identifier
usage note: Used in ADMS.SW to aligin with the software identifying system in the ISO19770-2:2009 standard.
type: Thing
disjoint with: Nothing
subclass of: Thing
type: Class
comment: A Software Identifier is a complex type (based on the software identifying system in the ISO19770-2:2009 software identification tag data model [ISO19770-2]) consisting of: a unique token within the regid domain of the tag creator; and a tag creator regid.

Phil Archer
affiliation: W3C/ERCIM
type: Agent
type: Thing
made: Asset Description Metadata Schema for Software (ADMS.SW)

Software Package - license
usage note: Used in RADion to link to the conditions or restrictions for (re-use) of the Distribution. Note that the range is dcterms:LicenseDocument
type: Thing
sub property of: topObjectProperty
property disjoint with: bottomObjectProperty
type: ObjectProperty
comment: The dcterms:license property fully represents the RADion relationship of the same name.

Software Project - name
type: Thing
sub property of: topObjectProperty
sub property of: name
property disjoint with: bottomObjectProperty
type: ObjectProperty
comment: Both the dcterms:name and doap:name property fully represents the ADMS.SW property of the same name.

Given name
term status: testing
type: Thing
sub property of: topDataProperty
property disjoint with: bottomDataProperty
type: DatatypeProperty
type: Property
comment: The given name of some person.

funded by
term status: archaic
type: Thing
sub property of: topObjectProperty
property disjoint with: bottomObjectProperty
type: ObjectProperty
type: Property
comment: An organization funding a project or person.
domain: Thing
range: Thing

Software Project - fork of
type: Thing
sub property of: topObjectProperty
property disjoint with: bottomObjectProperty
type: ObjectProperty
comment: software project of which the current project is a descendant
type: Property

Online Chat Account
term status: unstable
type: Thing
disjoint with: Nothing
subclass of: Thing
subclass of: Online Account
type: Class
comment: An online chat account.

account name
term status: testing
type: Thing
sub property of: topDataProperty
property disjoint with: bottomDataProperty
type: DatatypeProperty
type: Property
comment: Indicates the name (identifier) associated with this online account.
domain: Online Account
range: Literal

thumbnail
term status: testing
type: Thing
sub property of: topObjectProperty
property disjoint with: bottomObjectProperty
type: ObjectProperty
type: Property
comment: A derived thumbnail image.
domain: Image
range: Image

Contact Information
usage note: ADMS.SW uses VCard to provide contact information regarding a Software Release, including e-mail, address, name and associated Web page information. See <xh:a xmlns:xh="http://www.w3.org/1999/xhtml" xh:href="http://www.w3.org/TR/vcard-rdf/">Representing vCard Objects in RDF</xh:a> for details of this widely used specification.
type: Thing
comment: VCard fully represents the ADMS.SW class of Contact Information

dimension: agent dimension
sub property of: topObjectProperty
concept: Agent
property disjoint with: bottomObjectProperty
type: DimensionProperty
type: Thing
type: ObjectProperty
comment: The agent category to which a measured observation applies.
type: Property

Software Project - supports format
usage note: Ideally, the range of this property is dcterms:FileFormat.
type: Thing
sub property of: topObjectProperty
property disjoint with: bottomObjectProperty
type: ObjectProperty
range: Intended Audience
comment: Data format that is supported by the software.
type: Property

Software Project - theme
type: Thing
sub property of: topObjectProperty
property disjoint with: bottomObjectProperty
type: ObjectProperty
comment: Topic, theme or function of the software. The theme relationship associates an Software Project or Release with a specific Theme (a skos:Concept).
type: Property
label: Software Release - theme

status
term status: unstable
type: Thing
sub property of: topDataProperty
property disjoint with: bottomDataProperty
type: DatatypeProperty
type: Property
comment: A string expressing what the user is happy for the general public (normally) to know about their current activity.
domain: Agent
range: Literal

DNA checksum
term status: archaic
type: Thing
sub property of: topDataProperty
property disjoint with: bottomDataProperty
type: DatatypeProperty
type: Property
comment: A checksum for the DNA of some thing. Joke.
range: Literal

Software Release - date of creation
usage note: The ADMS.SW and RADion RDF Schemas use this to provide the creation date of this version of the Repository, Asset or Package. RADion expects a datatyped value and for it to be conformant with ISO 8601, preferably using an xsd data type.
type: Thing
comment: The dcterms:created property fully represents the ADMS.SW property 'date of creation'.
label: Software Package - date of creation
label: Software Repository - date of creation

Software Package - checksum
type: Thing
comment: The checksum property provides a mechanism that can be used to verify that the contents of a Package have not been changed.

measure: cumulative effort
type: Thing
type: MeasureProperty
sub property of: obsValue
type: DatatypeProperty
property disjoint with: measure: ticket lead time
property disjoint with: Software Repository - access URL
property disjoint with: bottomDataProperty
sub property of: topDataProperty
range: decimal
comment: The total effort spent (expressed in personhours) on producing a software release, including the effort spent on previous releases.
type: Property

Phil Archer
type: Agent
made: Asset Description Metadata Schema for Software (ADMS.SW)
affiliation: W3C/ERCIM
type: Thing

Software Package - access URL
type: Thing
sub property of: topObjectProperty
property disjoint with: bottomObjectProperty
type: ObjectProperty
comment: The URL of the Repository or Distribution. The range of adms:accessURL is xsd:anyURI
type: Property

dimension: release dimension
concept: Asset
sub property of: topObjectProperty
type: Thing
property disjoint with: bottomObjectProperty
type: DimensionProperty
type: ObjectProperty
comment: The release category to which a measured observation applies.
type: Property

interest
term status: testing
type: Thing
sub property of: topObjectProperty
property disjoint with: bottomObjectProperty
type: ObjectProperty
type: Property
comment: A page about a topic of interest to this person.
domain: Agent
range: Document

measure: number of commits
type: Thing
property disjoint with: bottomDataProperty
property disjoint with: measure: ticket lead time
sub property of: topDataProperty
type: MeasureProperty
property disjoint with: Software Repository - access URL
sub property of: obsValue
type: DatatypeProperty
range: int
comment: The number of times code for the asset has been committed to the forge.
type: Property

depicts
term status: testing
type: Thing
sub property of: topObjectProperty
property disjoint with: bottomObjectProperty
inverse of: depiction
type: ObjectProperty
type: Property
comment: A thing depicted in this representation.
domain: Image
range: Thing

account
term status: testing
type: Thing
sub property of: topObjectProperty
property disjoint with: bottomObjectProperty
type: ObjectProperty
type: Property
comment: Indicates an account held by this agent.
domain: Agent
range: Online Account

Software Project - locale
usage note: Ideally, the range of this property is skos:Concept.
type: Thing
sub property of: topObjectProperty
property disjoint with: bottomObjectProperty
type: ObjectProperty
range: Intended Audience
comment: Locale of the software.
type: Property

Software Project - programming language
usage note: Ideally, the range of this property is skos:Concept.
type: Thing
sub property of: topObjectProperty
property disjoint with: bottomObjectProperty
type: ObjectProperty
range: Intended Audience
comment: Programming language of the software.
type: Property

sha1sum (hex)
term status: unstable
type: Thing
sub property of: topDataProperty
property disjoint with: bottomDataProperty
type: DatatypeProperty
type: Property
comment: A sha1sum hash, in hex.
domain: Document

PwC EU Services
type: Thing

Software Project - developer
usage note: The range of this property is foaf:Person.
type: Thing
comment: The doap:documenter property fully covers the ADMS.SW property 'developer'.

myersBriggs
term status: testing
type: Thing
sub property of: topDataProperty
property disjoint with: bottomDataProperty
type: DatatypeProperty
type: Property
comment: A Myers Briggs (MBTI) personality classification.
domain: Person
range: Literal

Software Package - format
usage note: Used in RADion to link to the format that the Distribution is available in (e.g. EXE, ZIP) which is provided as a property of dcterms:FileFormat
type: Thing
comment: The dcterms:format property fully represents the RADion relationship of the same name

schoolHomepage
term status: testing
type: Thing
sub property of: topObjectProperty
property disjoint with: bottomObjectProperty
type: ObjectProperty
type: Property
comment: A homepage of a school attended by the person.
domain: Person
range: Document

Person
term status: stable
subclass of: SpatialThing
disjoint with: Nothing
subclass of: Agent
disjoint with: Project
subclass of: Person
subclass of: Thing
type: Class
type: Thing
disjoint with: Organization
comment: A person.

Software Release - spatial coverage
usage note: RADion uses this to link to the geographic region or jurisdiction that the Asset or Repository applies to. Note that the range is dcterms:Location.
type: Thing
comment: The dcterms:coverage property fully represents the RADion relationship of the same name
label: Software Repository - spatial coverage

Software Release
subclass of: Version
subclass of: Thing
type: Class
disjoint with: Nothing
subclass of: Asset
type: Thing
comment: A Software Release is an abstract entity that reflects the intellectual content of the software and represents those characteristics of the software that are independent of its physical embodiment. This abstract entity corresponds to the FRBR entity expression (the intellectual or artistic realization of a work). An example of a Software Release is the Apache HTTP Server 2.22.22 (httpd) release.

logo
term status: testing
property disjoint with: bottomObjectProperty
sub property of: topObjectProperty
type: ObjectProperty
type: Thing
type: InverseFunctionalProperty
type: Property
label: Software Release - logo
comment: The foaf:logo property fully represents the ADMS.SW property of the same name.
comment: A logo representing some thing.
range: Thing
domain: Thing

Software Release - related web page
type: Thing
sub property of: topObjectProperty
property disjoint with: bottomObjectProperty
type: ObjectProperty
range: Document
comment: Links to a Web page that contains information related to the asset. The range of adms:relatedWebPage is foaf:Document

Software Release - alternative name
usage note: Alternative name for the Asset. Any number of alternative names may be supplied. The range of dcterms:alternative is rdfs:Literal
type: Thing
comment: The dcterms:alternative property fully represents the ADMS.SW property 'alternative name'.

topic
term status: testing
type: Thing
sub property of: topObjectProperty
property disjoint with: bottomObjectProperty
inverse of: page
type: ObjectProperty
type: Property
comment: A topic of some page or document.
domain: Document
range: Thing

Software Repository - access URL
property disjoint with: measure: cumulative effort
property disjoint with: measure: number of installations
property disjoint with: measure: effort
sub property of: topDataProperty
property disjoint with: measure: number of lines of code
property disjoint with: measure: number of users
property disjoint with: bottomDataProperty
property disjoint with: measure: number of downloads
property disjoint with: measure: number of commits
property disjoint with: measure: ticket lead time
type: Thing
type: DatatypeProperty
type: Property
comment: The URL of the Repository or Distribution. The range of adms:accessURL is xsd:anyURI
range: anyURI

Software Release - language
usage note: RADion uses this to provide the language of the Asset. Note that this is quite separate from Locale.
type: Thing
comment: The dcterms:language property fully represents the RADion and ADMS.SW property of the same name.

member
term status: stable
type: Thing
sub property of: topObjectProperty
property disjoint with: bottomObjectProperty
type: ObjectProperty
type: Property
comment: Indicates a member of a Group
domain: Group
range: Agent

name
term status: testing
type: Thing
sub property of: topDataProperty
property disjoint with: bottomDataProperty
type: DatatypeProperty
type: Property
comment: A name for some thing.
domain: Thing
range: Literal
sub property of: Software Release - name

ICQ chat ID
sub property of: nickname
term status: testing
type: Thing
property disjoint with: bottomDataProperty
sub property of: topDataProperty
type: InverseFunctionalProperty
type: DatatypeProperty
domain: Agent
range: Literal
comment: An ICQ chat ID
type: Property

Intended Audience
subclass of: Thing
disjoint with: Nothing
type: Thing
type: Class
usage note: ADMS.SW uses SKOS Concepts to provide an indication of the maturity of an Asset or Distribution.
comment: The Conceptual Model includes a 'Code' datatype that is used by several classes. This is expressed using the href="http://www.w3.org/TR/skos-primer/">SKOS vocabulary with a particular 'code' usually being a skos:Concept that is part of a scheme. The intention is that the skos:Concept class be used as follows: for the content property, use skos:notation he 'list' property will be taken care of by means of the skos:inScheme property; the list agency property is likely to be applied to the scheme as a whole for which dcterms:creator is appropriate the list version property can be fulfilled using schema:version (see http://schema.org/CreativeWork
label: Intendend Audience, Locale, Operating System, Programming Language, Status, Topic, User Interface Type
label: Operating System
label: Topic
comment: The skos:Concept class fully represents the ADMS.SW classes 'Intended Audience', 'Locale', 'Operating System', 'Status', 'Topic', and 'User Interface Type' (see section on the <xh:a xmlns:xh="http://www.w3.org/1999/xhtml" xh:href="#Code">Code</xh:a> datatype for details).
label: User Interface Type
label: Locale
label: Status
label: Programming Language

Project
disjoint with: PersonalProfileDocument
type: Class
term status: testing
disjoint with: Document
subclass of: Thing
disjoint with: Nothing
disjoint with: Image
disjoint with: Person
type: Thing
comment: A project (a collective endeavour of some kind).

Stijn Goedertier
type: Agent
affiliation: PwC EU Services
type: Thing
made: Asset Description Metadata Schema for Software (ADMS.SW)

dimension: time dimension
type: Thing
comment: The period of time or point in time to which the measured observation refers.

family_name
term status: archaic
type: Thing
sub property of: topDataProperty
property disjoint with: bottomDataProperty
type: DatatypeProperty
type: Property
comment: The family name of some person.
domain: Person
range: Literal

current project
term status: testing
type: Thing
sub property of: topObjectProperty
property disjoint with: bottomObjectProperty
type: ObjectProperty
type: Property
comment: A current project this person works on.
domain: Person
range: Thing

homepage
sub property of: topObjectProperty
term status: stable
sub property of: page
sub property of: is primary topic of
type: Thing
property disjoint with: bottomObjectProperty
type: ObjectProperty
type: InverseFunctionalProperty
comment: A homepage for some thing.
range: Document
type: Property
domain: Thing

Software Package - tag URL
usage note: Several software tag standards exist such as the ISO19770-2:2009, the ISO19770-3 and the SPDX specification. These standards do not require the software tags to be available on via the Web.
type: Thing
sub property of: topObjectProperty
property disjoint with: bottomObjectProperty
type: ObjectProperty
comment: URL from which a software tag file can be obtained for the Software Package.
type: Property

weblog
sub property of: page
term status: testing
type: Thing
property disjoint with: bottomObjectProperty
type: InverseFunctionalProperty
type: ObjectProperty
sub property of: topObjectProperty
type: Property
range: Document
comment: A weblog of some thing (whether person, group, company etc.).
domain: Agent

phone
term status: testing
type: Thing
sub property of: topObjectProperty
property disjoint with: bottomObjectProperty
type: ObjectProperty
type: Property
comment: A phone, specified using fully qualified tel: URI scheme (refs: http://www.w3.org/Addressing/schemes.html#tel).

measure: number of installations
sub property of: obsValue
property disjoint with: measure: ticket lead time
property disjoint with: bottomDataProperty
type: Thing
type: MeasureProperty
property disjoint with: Software Repository - access URL
sub property of: topDataProperty
type: DatatypeProperty
range: int
comment: The number known instances of software package that have been installed.
type: Property

Image
type: Class
disjoint with: Organization
subclass of: Thing
type: Thing
disjoint with: Project
subclass of: Document
disjoint with: Nothing
term status: testing
comment: An image.

ADMS.SW Working Group
made: Asset Description Metadata Schema for Software (ADMS.SW)
type: Thing
type: Agent

Software Project - metrics
usage note: The range of this property is not fixed by the ADMS.SW specification. It is recommended to relate this property to an instance of the class 'qb:DataSet'.
type: Thing
sub property of: topObjectProperty
property disjoint with: bottomObjectProperty
type: ObjectProperty
comment: A data set of metrics about the software project or software release.
type: Property
label: Software Release - metrics

Software Project - repository origin
usage note: RADion uses dcterms:isPartOf to link an Asset to a Repository.
type: Thing
comment: The dcterms:isPartOf property fully represents relationship 'repository origin'.
label: Software Release - repository origin
comment: The dcterms:isPartOf property fully represents the RADion relationship of repository origin.

made
inverse of: maker
type: ObjectProperty
type: Thing
inverse of: creator
property disjoint with: bottomObjectProperty
sub property of: topObjectProperty
term status: stable
type: Property
comment: Something that was made by this agent.
domain: Agent
range: Thing

Software Release - current version
usage note: ADMS.SW uses the XHTML 'last' property to link an Asset to the most recent (i.e. current) version.
type: Thing
comment: The xhv:last property fully represents the RADion and ADMS.SW relationship 'current version'.

is primary topic of
sub property of: topObjectProperty
property disjoint with: bottomObjectProperty
type: Thing
type: ObjectProperty
sub property of: page
type: InverseFunctionalProperty
term status: stable
inverse of: primary topic
comment: A document that this thing is the primary topic of.
domain: Thing
range: Document
type: Property

License
usage note: Used in RADion to provide the conditions or restrictions that apply to the use of a Distribution, e.g. whether it is in the public domain, or that some restrictions apply like in cases attribution is required, or the Asset can only be used for non-commercial purposes etc.
type: Thing
comment: The dcterms:LicenseDocument class fully represents the RADion concept of a Licence

Document
term status: testing
subclass of: Thing
disjoint with: Nothing
usage note: Used in ADMS.SW specifically for the class of documents that further describe a Software Asset or give guidelines for its use. ADMS.SW expects all documents to have a title (use <xh:a xmlns:xh="http://www.w3.org/1999/xhtml" xh:href="http://purl.org/dc/terms/title">dcterms:title</xh:a>).
type: Class
disjoint with: Project
type: Thing
disjoint with: Organization
comment: A document.
comment: The foaf:Document class fully represents the ADMS.SW concept 'Documentation'.
label: Documentation

Software Release - assessment
usage note: The range of this property is foaf:Document.
type: Thing
sub property of: topObjectProperty
property disjoint with: bottomObjectProperty
type: ObjectProperty
range: Document
comment: Assessment of the asset.
type: Property

Stijn Goedertier
type: Agent
made: Asset Description Metadata Schema for Software (ADMS.SW)
affiliation: PwC EU Services
type: Thing

Online Gaming Account
term status: unstable
type: Thing
disjoint with: Nothing
subclass of: Thing
subclass of: Online Account
type: Class
comment: An online gaming account.

lastName
term status: testing
type: Thing
sub property of: topDataProperty
property disjoint with: bottomDataProperty
type: DatatypeProperty
type: Property
comment: The last name of a person.
domain: Person
range: Literal

Software Release - metadata language
type: Thing
sub property of: topObjectProperty
property disjoint with: bottomObjectProperty
type: ObjectProperty
type: Property
comment: Links to the language of the metadata for the Asset. The range of adms:metadataLanguage is dcterms:LinguisticSystem which is used by RADion (and therefore ADMS) to represent the Language class.
range: LinguisticSystem

measure: ticket lead time
property disjoint with: measure: number of installations
property disjoint with: measure: number of commits
type: MeasureProperty
property disjoint with: measure: cumulative effort
property disjoint with: Software Repository - access URL
property disjoint with: measure: number of lines of code
property disjoint with: measure: effort
type: Thing
property disjoint with: bottomDataProperty
sub property of: topDataProperty
property disjoint with: measure: number of downloads
property disjoint with: measure: number of users
sub property of: obsValue
type: DatatypeProperty
range: dateTime
comment: The time between opening and closing a support ticket in milliseconds.
type: Property

W3C/ERCIM
type: Thing

gender
term status: testing
type: Thing
sub property of: topDataProperty
property disjoint with: bottomDataProperty
type: FunctionalProperty
type: DatatypeProperty
type: Property
comment: The gender of this Agent (typically but not necessarily 'male' or 'female').
domain: Agent
range: Literal

Software Release - related asset
usage note: Used in RADion to link any Asset to any other related Asset. RADion expects the object to be an instance of rad:Asset or a sub-class.
type: Thing
sub property of: topObjectProperty
property disjoint with: bottomObjectProperty
type: ObjectProperty
comment: The dcterms:relation property fully represents the RADion related asset relationship.

Agent
type: Thing
subclass of: Agent
usage note: The dcterms:Agent class (or a sub class of it) is used in RADion to represent the publisher of a Repository or its components.
subclass of: Thing
type: Class
disjoint with: Nothing
equivalent class: Agent
comment: A resource that acts or has the power to act.

theme
term status: archaic
type: Thing
sub property of: topObjectProperty
property disjoint with: bottomObjectProperty
type: ObjectProperty
type: Property
comment: A theme.
domain: Thing
range: Thing

Software Release - package
type: Thing
sub property of: topObjectProperty
sub property of: distribution
property disjoint with: bottomObjectProperty
type: ObjectProperty
comment: The package relationship associates a Software Release with a Software Package.
type: Property

measure: number of users
property disjoint with: measure: ticket lead time
type: DatatypeProperty
sub property of: topDataProperty
type: Thing
sub property of: obsValue
property disjoint with: Software Repository - access URL
type: MeasureProperty
property disjoint with: bottomDataProperty
range: int
comment: The number of known users of a software release.
type: Property

measure: effort
property disjoint with: Software Repository - access URL
type: Thing
type: MeasureProperty
type: DatatypeProperty
sub property of: topDataProperty
property disjoint with: bottomDataProperty
property disjoint with: measure: ticket lead time
sub property of: obsValue
range: decimal
comment: The effort spent (expressed in personhours) on producing a new software release, not counting the effort spent on previous software releases.
type: Property

jabber ID
term status: testing
type: Thing
sub property of: topDataProperty
property disjoint with: bottomDataProperty
type: InverseFunctionalProperty
type: DatatypeProperty
type: Property
comment: A jabber ID for something.
domain: Agent
range: Literal

AIM chat ID
type: DatatypeProperty
property disjoint with: bottomDataProperty
sub property of: topDataProperty
type: InverseFunctionalProperty
term status: testing
type: Thing
sub property of: nickname
type: Property
domain: Agent
comment: An AIM chat ID
range: Literal

workplace homepage
term status: testing
type: Thing
sub property of: topObjectProperty
property disjoint with: bottomObjectProperty
type: ObjectProperty
type: Property
comment: A workplace homepage of some person; the homepage of an organization they work for.
domain: Person
range: Document

Agent - type
usage note: Used in ADMS to link an Asset to its Asset Type.
type: Thing
sub property of: topObjectProperty
property disjoint with: bottomObjectProperty
type: ObjectProperty
type: Property
label: Licence - type

personal mailbox
term status: stable
type: Thing
sub property of: topObjectProperty
property disjoint with: bottomObjectProperty
type: InverseFunctionalProperty
type: ObjectProperty
type: Property
comment: A personal mailbox, ie. an Internet mailbox associated with exactly one owner, the first owner of this mailbox. This is a 'static inverse functional property', in that there is (across time and change) at most one individual that ever has any particular value for foaf:mbox.
domain: Agent
range: Thing

Software Repository - theme taxonomy
type: Thing
sub property of: topObjectProperty
property disjoint with: bottomObjectProperty
type: ObjectProperty
range: Intended Audience
domain: Asset
comment: The theme taxonomy relationship associates a Repository with a classification scheme for the assets within it. Its domain is rad:Repository and its range is skos:ConceptScheme.

Software Project - funded by
usage note: Used in ADMS.SW to associate a project with an organisation or person who funds it.
type: Thing
sub property of: topObjectProperty
property disjoint with: bottomObjectProperty
type: ObjectProperty
comment: contributing person or organisation for the project.
type: Property

focus
term status: testing
type: Thing
sub property of: topObjectProperty
property disjoint with: bottomObjectProperty
type: ObjectProperty
type: Property
comment: The underlying or 'focal' entity associated with some SKOS-described concept.
domain: Intended Audience
range: Thing

Software Release - date of last modification
usage note: RADion uses this to provide the date of latest update of the Repository, Asset or Package. RADion expects a datatyped value and for it to be conformant with ISO 8601, preferably using an xsd data type.
type: Thing
sub property of: topDataProperty
property disjoint with: bottomDataProperty
type: DatatypeProperty
comment: The dcterms:modified property fully represents the RADion and ADMS.SW property Date of Last Modification.
label: Software Package - date of last modification
label: Software Repository - date of last modification

openid
type: ObjectProperty
term status: testing
sub property of: page
property disjoint with: bottomObjectProperty
type: InverseFunctionalProperty
sub property of: is primary topic of
sub property of: topObjectProperty
type: Thing
range: Document
type: Property
domain: Agent
comment: An OpenID for an Agent.

Software Identifier - tag_creator_regid
usage note: Used in ADMS.SW to aligin with the software identifying system in the ISO19770-2:2009 standard.
type: Thing
sub property of: topObjectProperty
property disjoint with: bottomObjectProperty
type: ObjectProperty
comment: A tag creator regid, uniquely identifying a tag creator and/or subdomain.
range: RegistrationId
domain: Software Identifier
type: Property

UML Class Diagram: ADMS.SW v1.00 RDF Schema
type: Thing

W3C/ERCIM
type: Thing

Group
type: Thing
subclass of: Agent
disjoint with: Nothing
type: Class
subclass of: Thing
term status: stable
comment: A class of Agents.

Online E-commerce Account
term status: unstable
type: Thing
disjoint with: Nothing
subclass of: Thing
subclass of: Online Account
type: Class
comment: An online e-commerce account.

plan
term status: testing
type: Thing
sub property of: topDataProperty
property disjoint with: bottomDataProperty
type: DatatypeProperty
type: Property
comment: Aplan comment, in the tradition of finger and '.plan' files.
domain: Person
range: Literal

Software Repository - supported schema
type: Thing
sub property of: topDataProperty
property disjoint with: bottomDataProperty
type: DatatypeProperty
range: Literal
comment: A schema according to which the Repository can provide data about its content, e.g. 'ADMS.SW v1.0'

Software Project - operating system
usage note: Ideally, the range of this property is skos:Concept.
type: Thing
sub property of: topObjectProperty
property disjoint with: bottomObjectProperty
type: ObjectProperty
range: Intended Audience
comment: Operating system of the software.
type: Property

measure: number of lines of code
property disjoint with: bottomDataProperty
property disjoint with: measure: ticket lead time
sub property of: obsValue
type: Thing
usage note: Observations for the measure 'number of lines of code' should include the dimension 'programming language'.
sub property of: topDataProperty
type: DatatypeProperty
property disjoint with: Software Repository - access URL
type: MeasureProperty
range: int
comment: The number of lines of code within the asset (not including any dependencies).
type: Property

Phil Archer
affiliation: W3C/ERCIM
type: Agent
made: Asset Description Metadata Schema for Software (ADMS.SW)
type: Thing

membershipClass
term status: unstable
type: Thing
type: Property
type: AnnotationProperty
comment: Indicates the class of individuals that are a member of a Group

Software Repository - includes
usage note: RADion uses dcterms:hasPart to link a Repository to an Asset.
type: Thing
sub property of: topObjectProperty
property disjoint with: bottomObjectProperty
type: ObjectProperty
comment: The dcterms:hasPart property fully represents the RADion relationship 'includes'.

Software Project - description
type: Thing
sub property of: topDataProperty
sub property of: Software Release - description
property disjoint with: bottomDataProperty
type: DatatypeProperty
comment: Both the dcterms:description and doap:description properties fully cover the ADMS.SW property of the same name.

Software Identifier - unique_id
usage note: Used in ADMS.SW to aligin with the software identifying system in the ISO19770-2:2009 standard.
type: Thing
sub property of: topDataProperty
property disjoint with: bottomDataProperty
type: DatatypeProperty
comment: A unique token within the regid domain of the tag creator.
range: Literal
domain: Software Identifier
type: Property

title
term status: testing
type: Thing
sub property of: topDataProperty
property disjoint with: bottomDataProperty
type: DatatypeProperty
type: Property
comment: Title (Mr, Mrs, Ms, Dr. etc)

Agent
type: Class
subclass of: Agent
equivalent class: Agent
subclass of: Thing
disjoint with: Nothing
type: Thing
term status: stable
comment: An agent (eg. person, group, software or physical artifact).

Software Project - release
usage note: Used in ADMS.SW to associate a project with its release.
type: Thing
comment: The doap:release property fully covers the ADMS.SW property 'release'.

Label Property
term status: unstable
type: Thing
disjoint with: Nothing
subclass of: Thing
type: Class
comment: A foaf:LabelProperty is any RDF property with texual values that serve as labels.

Software Release - identifier
usage note: ADMS.SW uses this to include a local identifier for the Software Release. The range of this property is adms:Identifier. This allows specifying the identifying system and ensures that the identifier stays meainingful in a situation with multiple identification domains.
type: Thing
sub property of: topObjectProperty
property disjoint with: bottomObjectProperty
type: ObjectProperty
range: Identifier
comment: Any identifier for the AssetRelease.
type: Property

birthday
term status: unstable
type: Thing
sub property of: topDataProperty
property disjoint with: bottomDataProperty
type: FunctionalProperty
type: DatatypeProperty
type: Property
comment: The birthday of this Agent, represented in mm-dd string form, eg. '12-31'.
domain: Agent
range: Literal

sha1sum of a personal mailbox URI name
term status: testing
type: Thing
sub property of: topDataProperty
property disjoint with: bottomDataProperty
type: InverseFunctionalProperty
type: DatatypeProperty
type: Property
comment: The sha1sum of the URI of an Internet mailbox associated with exactly one owner, the first owner of the mailbox.
domain: Agent
range: Literal

dimension: package dimension
property disjoint with: bottomObjectProperty
type: Thing
type: ObjectProperty
concept: Distribution
type: DimensionProperty
sub property of: topObjectProperty
comment: The software package category to which a measured observation applies.
type: Property

Software Release - description
usage note: Used in ADMS.SW to provide descriptive text for the Software Repository, Software Release or Software Package.
type: Thing
sub property of: topDataProperty
property disjoint with: bottomDataProperty
type: DatatypeProperty
comment: The dcterms:description property fully covers the ADMS.SW property of the same name.
label: Software Package - description
label: Software Repository - description

nickname
term status: testing
type: Thing
sub property of: topDataProperty
property disjoint with: bottomDataProperty
type: DatatypeProperty
type: Property
comment: A short informal nickname characterising an agent (includes login identifiers, IRC and other chat nicknames).

PwC EU Services
type: Thing

Organization
term status: stable
disjoint with: Image
subclass of: Agent
disjoint with: Nothing
disjoint with: Person
disjoint with: Document
subclass of: Thing
type: Thing
disjoint with: PersonalProfileDocument
type: Class
comment: An organization.

publications
term status: testing
type: Thing
sub property of: topObjectProperty
property disjoint with: bottomObjectProperty
type: ObjectProperty
type: Property
comment: A link to the publications of this person.
domain: Person
range: Document

image
term status: testing
type: Thing
sub property of: topObjectProperty
sub property of: depiction
property disjoint with: bottomObjectProperty
type: ObjectProperty
type: Property
comment: An image that can be used to represent some thing (ie. those depictions which are particularly representative of something, eg. one's photo on a homepage).
domain: Person
range: Image

Skype ID
term status: testing
type: Thing
sub property of: topDataProperty
sub property of: nickname
property disjoint with: bottomDataProperty
type: DatatypeProperty
type: Property
comment: A Skype ID
domain: Agent
range: Literal

Software Package - software_id
usage note: Used in ADMS.SW to aligin with the software identifying system in the ISO19770-2:2009 standard.
type: Thing
sub property of: topObjectProperty
property disjoint with: bottomObjectProperty
type: ObjectProperty
comment: A unique token within the regid domain of the tag creator.
range: Software Identifier
type: Property

work info homepage
term status: testing
type: Thing
sub property of: topObjectProperty
property disjoint with: bottomObjectProperty
type: ObjectProperty
type: Property
comment: A work info homepage of some person; a page about their work for some organization.
domain: Person
range: Document

Software Package - release
type: Thing
sub property of: distributionOf
sub property of: topObjectProperty
property disjoint with: bottomObjectProperty
type: ObjectProperty
comment: The release relationship associates a Software Package with a Software Release.
type: Property

PersonalProfileDocument
term status: testing
disjoint with: Nothing
disjoint with: Project
type: Thing
subclass of: Thing
type: Class
subclass of: Document
disjoint with: Organization
comment: A personal profile RDF document.

Software Repository
type: Thing
disjoint with: Nothing
subclass of: Thing
subclass of: Repository
type: Class
comment: A Software Repository is a system or service that provides facilities for storage and maintenance of descriptions of Software Projects, Software Releases and Software Distributions, and functionality that allows users to search and access these descriptions. A Software Repository will typically contain descriptions of several Software Projects, Software Releases and related Software Distributions.

Process and Methodology for Developing Core Vocabularies
type: Thing

Software Project - tester
usage note: The range of this property is foaf:Person.
type: Thing
comment: The doap:tester property fully covers the ADMS.SW property 'tester'.

ISA Open Metadata Licence v1.1
attribution name: European Commission
attribution URL: http://ec.europa.eu/
type: Thing

primary topic
type: FunctionalProperty
sub property of: topic
term status: stable
type: ObjectProperty
type: Thing
inverse of: is primary topic of
sub property of: topObjectProperty
property disjoint with: bottomObjectProperty
domain: Document
range: Thing
type: Property
comment: The primary topic of some page or document.

based near
term status: testing
type: Thing
sub property of: topObjectProperty
property disjoint with: bottomObjectProperty
type: ObjectProperty
type: Property
comment: A location that something is based near, for some broadly human notion of near.
domain: SpatialThing
range: SpatialThing

Software Package - file size
type: Thing
comment: The size of the package file in bytes.

account service homepage
term status: testing
type: Thing
sub property of: topObjectProperty
property disjoint with: bottomObjectProperty
type: ObjectProperty
type: Property
comment: Indicates a homepage of the service provide for this online account.
domain: Online Account
range: Document

Software Project - status
usage note: Ideally, the range of this property is skos:Concept.
type: Thing
sub property of: topObjectProperty
property disjoint with: bottomObjectProperty
type: ObjectProperty
range: Intended Audience
comment: The status of the software project, asset, or package.
type: Property
label: Software Release - status
label: Software Package - status

page
term status: testing
type: Thing
sub property of: topObjectProperty
property disjoint with: bottomObjectProperty
inverse of: topic
type: ObjectProperty
type: Property
comment: A page or document about this thing.
domain: Thing
range: Document

Software Release - included asset
sub property of: Software Repository - includes
type: ObjectProperty
type: Thing
property disjoint with: bottomObjectProperty
sub property of: topObjectProperty
sub property of: adms:includedAsset
comment: An Asset that is contained in the Software Release being described. Example: a Linux distribution is being described, that contains other libraries and submodules.

Software Project - user interface type
usage note: Ideally, the range of this property is skos:Concept.
type: Thing
sub property of: topObjectProperty
property disjoint with: bottomObjectProperty
type: ObjectProperty
range: Intended Audience
comment: User interface type of the software.
type: Property

Software Project - contributor
usage note: Used in ADMS.SW to associate a project with its contributor.
type: Thing
sub property of: topObjectProperty
property disjoint with: bottomObjectProperty
type: ObjectProperty
comment: contributing person or organisation for the project.
type: Property

Identifier
type: Thing
comment: This class is based on the UN/CEFACT Identifier complex type defined in See Section 5.8 of Core Components Data Type Catalogue Version 3.1. The various properties can be fulfilled as follows: use skos:notation to provide the actual identifier (the Identifier class is effectively meaningless without this property and conceptually it is mandatory) use dcterms:type to provide an identifier for the type of identifier issued (the identifier scheme) use adms:schemeVersion to identify the version of the identifier scheme; use adms:schemeAgency to provide the name of the agency that created the identifier (as an rdfs:Literal). Although not part of the ADMS conceptual model, it may be useful to provide further properties to the Identifier class: use dcterms:creator to link to a URI of an Agent class describing the issuing Agency; use dcterms:created to provide the date on which the identifier was issued.

Software Release - publisher
usage note: Used in RADion and thus ADMS.SW to link to the organisation responsible for the publication of the Asset, Repository or Distribution. Note that the range is dcterms:Agent.
type: Thing
sub property of: topObjectProperty
property disjoint with: bottomObjectProperty
type: ObjectProperty
comment: The dcterms:publisher property fully represents the RADion and ADMS.SW relationship of the same name
label: Software Package - publisher
label: Software Repository - publisher

Software Release - version notes
type: Thing
comment: Notes on the particular version of the Software Release. Description of what changed in this version.

Friend of a Friend (FOAF) vocabulary
description: The Friend of a Friend (FOAF) RDF vocabulary, described using W3C RDF Schema and the Web Ontology Language.
type: Thing
type: Ontology

PwC EU Services
type: Thing

Software Release - next version
usage note: RADion uses the XHTML 'next' property to link an Asset to the next most recent version.
type: Thing
comment: The xhv:next property fully represents the RADion relationship of Next version

Software Release - previous version
usage note: RADion and ADMS.SW uses the XHTML 'previous' property to link an Asset to the previous version.
type: Thing
sub property of: topObjectProperty
property disjoint with: bottomObjectProperty
type: ObjectProperty
comment: The xhv:prev property fully represents the RADion and ADMS.SW relationship of Previous version

topic_interest
term status: testing
type: Thing
sub property of: topObjectProperty
property disjoint with: bottomObjectProperty
type: ObjectProperty
type: Property
comment: A thing of interest to this person.
domain: Agent
range: Thing

Software Release - contact point
type: Thing
sub property of: topObjectProperty
property disjoint with: bottomObjectProperty
type: ObjectProperty
range: Contact Information
comment: Links an Asset to relevant <xh:a xmlns:xh="http://www.w3.org/1999/xhtml" xh:href="#ContactInformation">Contact Information</xh:a> which is provided using VCard.
type: Property

ADMS.SW Working Group
made: Asset Description Metadata Schema for Software (ADMS.SW)
type: Thing
type: Agent

firstName
term status: testing
type: Thing
sub property of: topDataProperty
property disjoint with: bottomDataProperty
type: DatatypeProperty
type: Property
comment: The first name of a person.
domain: Person
range: Literal

account
term status: archaic
type: Thing
sub property of: topObjectProperty
property disjoint with: bottomObjectProperty
type: ObjectProperty
type: Property
comment: Indicates an account held by this agent.
domain: Agent
range: Online Account

Software Project - keyword
usage note: The range of rad:keyword is Literal. They should be provided as language-tagged strings.
type: Thing
comment: A word or phrase used to succinctly descibe the software.
label: Software Release - keyword
comment: A word or phrase used to succinctly descibe the Software Release

Stijn Goedertier
affiliation: PwC EU Services
type: Thing
type: Agent
made: Asset Description Metadata Schema for Software (ADMS.SW)

measure: number of downloads
type: Thing
type: DatatypeProperty
sub property of: obsValue
sub property of: topDataProperty
type: MeasureProperty
property disjoint with: measure: ticket lead time
property disjoint with: Software Repository - access URL
property disjoint with: bottomDataProperty
range: int
comment: The number of times a software package has been downloaded.
type: Property

Software Project - maintainer
usage note: The range of this property is foaf:Person.
type: Thing
comment: The doap:maintainer property fully covers the ADMS.SW property 'maintainer'.

Software Release - main documentation
usage note: Used in ADMS.SW to link to the main documentation or specification of the Asset.
type: Thing
sub property of: topObjectProperty
property disjoint with: bottomObjectProperty
type: ObjectProperty
comment: The <xh:a xmlns:xh="http://www.w3.org/1999/xhtml" xh:href="http://www.w3.org/2007/05/powder-s#describedby">wdrs:describedby</xh:a> property fully represents the ADMS.SW relationship 'main documentation'.

Given name
term status: archaic
type: Thing
sub property of: topDataProperty
property disjoint with: bottomDataProperty
type: DatatypeProperty
type: Property
comment: The given name of some person.

tipjar
term status: testing
type: Thing
sub property of: topObjectProperty
sub property of: page
property disjoint with: bottomObjectProperty
type: ObjectProperty
type: Property
comment: A tipjar document for this agent, describing means for payment and reward.
domain: Agent
range: Document

familyName
term status: testing
type: Thing
sub property of: topDataProperty
property disjoint with: bottomDataProperty
type: DatatypeProperty
type: Property
comment: The family name of some person.
domain: Person
range: Literal

Software Release - name
usage note: ADMS.SW uses this to provide the name or label of any class. In cases that a Software Release has parallel names, for example if more than one official name exists, or if an organisation or country has more than one official language, this field can be repeated for all name variants
type: Thing
comment: The rdfs:label property fully represents the RADion and ADMS.SW properties of name and label.
label: Software Package - name
label: Software Repository - name
label: Agent - name
label: Licence - name

past project
term status: testing
type: Thing
sub property of: topObjectProperty
property disjoint with: bottomObjectProperty
type: ObjectProperty
type: Property
comment: A project this person has previously worked on.
domain: Person
range: Thing