Data Creator
disjoint with: Nothing
subclass of: Agent
subclass of: Thing
type: Class
comment: DataCreator is a concept that represents an agent which performed the creation of a data item.

values
sub property of: topObjectProperty
property disjoint with: bottomObjectProperty
type: ObjectProperty
type: Property
sub property of: SP system property
range: Values
domain: Query
comment: The VALUES block at the end of a query. The object may just be an untyped blank node, i.e. the sp:Values type triple is optional.

Artifact
disjoint with: Nothing
subclass of: Thing
type: Class
type: DeprecatedClass
comment: This class is deprecated and will be removed from the Provenance Vocabulary in the next revision. prv:Artifact was deprecated in the process of making the Provenance Vocabulary a specialization of W3C's PROV-O. Hence, use prov:Entity (or the more specific prv:Immutable) instead.

from
property disjoint with: varName
property disjoint with: bottomDataProperty
property disjoint with: limit
property disjoint with: mod max
property disjoint with: group by
property disjoint with: reduced
property disjoint with: all
property disjoint with: default
property disjoint with: text
property disjoint with: named
property disjoint with: distinct
property disjoint with: mod min
property disjoint with: offset
property disjoint with: separator
property disjoint with: silent
sub property of: topDataProperty
sub property of: SP system property
type: DatatypeProperty
type: Property
range: Resource
domain: Query
comment: Specifies an RDF Dataset used by a Query (FROM syntax in SPARQL). Values of this property must be URI resources.

Non-Human Agent
disjoint with: Data Creating Entity
disjoint with: Organization
subclass of: Agent
disjoint with: Human Agent
disjoint with: Group
disjoint with: Nothing
disjoint with: Data Publisher
subclass of: Thing
disjoint with: Person
type: Class
comment: NonHumanAgent is a general class that represents agents who are not social beings.

graph name node
property disjoint with: separator
sub property of: topDataProperty
property disjoint with: text
property disjoint with: mod min
property disjoint with: named
property disjoint with: reduced
property disjoint with: limit
property disjoint with: silent
type: DatatypeProperty
property disjoint with: varName
sub property of: SP system property
property disjoint with: bottomDataProperty
property disjoint with: group by
property disjoint with: all
property disjoint with: offset
property disjoint with: default
property disjoint with: distinct
property disjoint with: mod max
type: Property
range: Resource
domain: Named graph
comment: The name (URI or Variable) of a NamedGraph.

Data Accessor
disjoint with: Person
disjoint with: Data Publisher
subclass of: Agent
disjoint with: Group
subclass of: Thing
type: Class
disjoint with: Nothing
disjoint with: Data Creating Entity
subclass of: Non-Human Agent
subclass of: WebClient
disjoint with: Human Agent
disjoint with: Organization
equivalent class: WebClient
comment: DataAccessor is a concept that represents a system (i.e. a non-human agent) which performed the data access in order to retrieve an information resource from the Web.

Creation Guideline
disjoint with: Nothing
disjoint with: File
subclass of: Plan
subclass of: Data Item
subclass of: InformationRealization
type: Class
subclass of: http://lodlaundromat.org/.well-known/genid/samples/pellet///class//e761128019984814f28b30162a38df4a/d3e700bc1857a8001f8ca87e5b965b3a#4
subclass of: http://lodlaundromat.org/.well-known/genid/samples/pellet///class//e761128019984814f28b30162a38df4a/d3e700bc1857a8001f8ca87e5b965b3a#7
subclass of: Thing
subclass of: Entity
comment: CreationGuideline is a concept that represents a guideline used to guide the execution of a data creation. Examples for creation guidelines are transformation rules, mapping definitions, entailment rules, and database queries.

Describe
disjoint with: Nothing
subclass of: SP System class
subclass of: Query
subclass of: Resource
subclass of: Thing
subclass of: Command
type: Class
comment: A DESCRIBE-type Query.

Alt path
disjoint with: Nothing
subclass of: Path
subclass of: SP System class
subclass of: Resource
subclass of: Thing
type: Class
comment: An alternative path with the union of sp:path1 and sp:path2.

Drop
disjoint with: Nothing
subclass of: Update
subclass of: SP System class
subclass of: Resource
subclass of: Thing
subclass of: Command
type: Class
comment: An Update operation that removes a specified graph from the Graph Store. Must specify the graph using sp:graphIRI, or sp:default, sp:named or sp:all. May have the SILENT flag, encoded using sp:silent.

Desc
disjoint with: Nothing
subclass of: SP System class
subclass of: Resource
subclass of: Order by condition
subclass of: Thing
type: Class
comment: Marker to indicate descending order.

MIN
disjoint with: Nothing
subclass of: SP System class
subclass of: Resource
subclass of: Thing
subclass of: Aggregation
type: Class
comment: Represents MIN aggregations.

using
sub property of: topObjectProperty
property disjoint with: bottomObjectProperty
type: ObjectProperty
type: Property
sub property of: SP system property
range: Resource
domain: Modify

default
property disjoint with: varName
type: DatatypeProperty
property disjoint with: graph IRI
property disjoint with: limit
property disjoint with: separator
property disjoint with: mod min
property disjoint with: graph name node
sub property of: topDataProperty
property disjoint with: text
property disjoint with: group by
property disjoint with: bottomDataProperty
property disjoint with: mod max
property disjoint with: offset
property disjoint with: into
sub property of: SP system property
property disjoint with: from
property disjoint with: from named
property disjoint with: service URI
property disjoint with: with
type: Property
range: boolean
comment: Used in DROP and CLEAR.

arg
sub property of: topObjectProperty
property disjoint with: bottomObjectProperty
type: ObjectProperty
type: Property
comment: Abstract superproperty for the enumerated arg1, arg2 etc.

variable
sub property of: topObjectProperty
property disjoint with: bottomObjectProperty
type: ObjectProperty
type: Property
sub property of: SP system property
range: Variable
domain: Bind
comment: The variable of a Bind element.

separator
sub property of: SP system property
property disjoint with: default
sub property of: topDataProperty
property disjoint with: named
property disjoint with: mod min
property disjoint with: graph IRI
property disjoint with: limit
property disjoint with: service URI
property disjoint with: into
property disjoint with: group by
property disjoint with: from
property disjoint with: distinct
property disjoint with: bottomDataProperty
property disjoint with: mod max
property disjoint with: all
property disjoint with: reduced
type: DatatypeProperty
property disjoint with: with
property disjoint with: silent
property disjoint with: graph name node
property disjoint with: offset
property disjoint with: from named
type: Property
range: string
domain: GROUP_CONCAT
comment: Stores the separator="..." value of a GROUP_CONCAT (sp:GroupConcat) aggregation.

Let
disjoint with: Nothing
subclass of: Element
subclass of: SP System class
subclass of: Resource
subclass of: Bind
subclass of: Thing
type: Class
type: DeprecatedClass
comment: Deprecated: use sp:Bind instead. A variable assignment (LET (?<varName> := <expression>)). Not part of the SPARQL 1.0 standard, but (for example) ARQ.

Union
disjoint with: Nothing
subclass of: Element
subclass of: Element group
subclass of: SP System class
subclass of: Resource
subclass of: Thing
type: Class
comment: A UNION group.

Red de ontologías geo.linkeddata.es
license: http://creativecommons.org/licenses/by-nc-sa/2.0/
contributor: http://delicias.dia.fi.upm.es/members/DGarijo/#me
publisher: Ontology Engineering Group
preferred namespace prefix: geoes
type: Thing
imports: hydro.owl
imports: transportes.owl
imports: geopolitica.owl
comment: Red de ontologías geo.linkeddata.es @es
creator: Luis Manuel Vilches-Blázquez
type: Ontology
comment: Geo.linkeddata.es ontology network
version info: v0.1

Measurement
disjoint with: HTTP-based Data Access
disjoint with: Data Access
disjoint with: Nothing
subclass of: Data Creation
subclass of: Activity
subclass of: Thing
type: Class
comment: Measurement is a concept that represents the execution of a measurement.

where
sub property of: topObjectProperty
property disjoint with: bottomObjectProperty
type: ObjectProperty
type: Property
sub property of: SP system property
range: Element list
comment: The WHERE clause of a Query.

Construct
disjoint with: Nothing
subclass of: SP System class
subclass of: Query
subclass of: Resource
subclass of: Thing
subclass of: Command
type: Class
comment: A CONSTRUCT-type query that can be used to construct new triples from template triples (head) that use variable bindings from the match patterns (body).

SAMPLE
disjoint with: Nothing
subclass of: SP System class
subclass of: Resource
subclass of: Thing
subclass of: Aggregation
type: Class
comment: Represents SAMPLE aggregations

Data Item
subclass of: Entity
subclass of: http://lodlaundromat.org/.well-known/genid/samples/pellet///class//e761128019984814f28b30162a38df4a/d3e700bc1857a8001f8ca87e5b965b3a#7
subclass of: Thing
disjoint with: File
subclass of: InformationRealization
subclass of: http://lodlaundromat.org/.well-known/genid/samples/pellet///class//e761128019984814f28b30162a38df4a/d3e700bc1857a8001f8ca87e5b965b3a#4
disjoint with: Nothing
type: Class
comment: DataItem is a general concept that represents data items of any kind.

Modify
disjoint with: Nothing
subclass of: Update
subclass of: SP System class
subclass of: Resource
subclass of: Thing
subclass of: Command
type: Class
comment: Represents a MODIFY (part of SPARQL UPDATE language). The graph IRIs are stored in sp:graphIRI. The template patterns are stored in sp:deletePattern and sp:insertPattern. The WHERE clause is represented using sp:where.

Element group
disjoint with: Nothing
subclass of: Element
subclass of: SP System class
subclass of: Resource
subclass of: Thing
type: Class
comment: Abstract base class of group patterns.

Not exists
disjoint with: Nothing
subclass of: Element
subclass of: Element group
subclass of: SP System class
subclass of: Resource
subclass of: Thing
type: Class
comment: A NOT EXISTS element group.

into
property disjoint with: separator
property disjoint with: distinct
property disjoint with: limit
property disjoint with: mod min
sub property of: SP system property
property disjoint with: bottomDataProperty
property disjoint with: default
property disjoint with: group by
property disjoint with: mod max
property disjoint with: offset
property disjoint with: text
property disjoint with: all
property disjoint with: varName
sub property of: topDataProperty
property disjoint with: reduced
type: DatatypeProperty
property disjoint with: silent
property disjoint with: named
type: Property
range: Resource
domain: Load
comment: The (optional) target of a LOAD Update operation.

all
property disjoint with: limit
property disjoint with: graph IRI
property disjoint with: from
sub property of: SP system property
property disjoint with: service URI
property disjoint with: text
property disjoint with: from named
property disjoint with: varName
sub property of: topDataProperty
property disjoint with: bottomDataProperty
property disjoint with: mod min
property disjoint with: separator
property disjoint with: group by
property disjoint with: graph name node
property disjoint with: with
property disjoint with: mod max
type: DatatypeProperty
property disjoint with: into
property disjoint with: offset
type: Property
range: boolean
comment: Used in DROP and CLEAR.

executed at
sub property of: topDataProperty
property disjoint with: bottomDataProperty
type: DatatypeProperty
type: DeprecatedProperty
comment: This property has been renamed to prv:completedAt. Hence, prv:performedAt is deprecated and will be removed from the Provenance Vocabulary in the next revision.

Create
disjoint with: Nothing
subclass of: Update
subclass of: SP System class
subclass of: Resource
subclass of: Thing
subclass of: Command
type: Class
comment: An Update operation that creates a new empty graph with a name specified by sp:graphIRI. May have sp:silent set to true.

HTTP-based Data Access
disjoint with: Measurement
disjoint with: Nothing
disjoint with: Query Execution
disjoint with: Data Creation
type: Class
subclass of: Data Access
subclass of: Activity
subclass of: Thing
comment: An HTTPBasedDataAccess represents the completed execution of accessing a data item using the HTTP protocol.

guided by
property disjoint with: accessed
sub property of: used
type: ObjectProperty
property disjoint with: serialized by
sub property of: topObjectProperty
property disjoint with: bottomObjectProperty
property disjoint with: involved exchange of
comment: This property refers to a creation guideline which guided the execution of a data creation. Examples for creation guidelines are transformation rules, mapping definitions, entailment rules, and database queries. Notice, all creation guidelines have provenance; we strongly encourage to describe this provenance as well, at least as far as available information permits.
domain: Data Creation
range: Creation Guideline

Query Template
disjoint with: File
subclass of: Data Item
subclass of: Thing
subclass of: http://lodlaundromat.org/.well-known/genid/samples/pellet///class//e761128019984814f28b30162a38df4a/d3e700bc1857a8001f8ca87e5b965b3a#7
disjoint with: Nothing
subclass of: Entity
subclass of: Plan
subclass of: Creation Guideline
subclass of: http://lodlaundromat.org/.well-known/genid/samples/pellet///class//e761128019984814f28b30162a38df4a/d3e700bc1857a8001f8ca87e5b965b3a#4
subclass of: InformationRealization
type: Class
comment: A QueryTemplate is a query that contains placeholders which are replaced by actual data to create an executable query.

Actor
disjoint with: Nothing
subclass of: Thing
type: Class
type: DeprecatedClass
comment: This class is deprecated and will be removed from the Provenance Vocabulary in the next revision. prv:Actor was deprecated in the process of making the Provenance Vocabulary a specialization of W3C's PROV-O. Hence, use one of the more specific classes prv:HumanAgent and prv:NonHumanAgent instead; or, if such a specialization is unsuitable for the use case at hand, directly use the general class prov:Agent as defined by PROV-O.

Bind
disjoint with: Nothing
subclass of: Element
subclass of: SP System class
subclass of: Resource
subclass of: Thing
type: Class
comment: A BIND element.

Delete
subclass of: Modify
subclass of: Command
subclass of: Update
subclass of: Resource
subclass of: Thing
type: Class
disjoint with: Nothing
subclass of: SP System class
type: DeprecatedClass
comment: Deprecated - use sp:Modify instead. Represents a DELETE FROM (part of SPARQL UPDATE language). The graph IRIs are stored in sp:graphIRI. The template patterns to delete are stored in sp:deletePattern. The WHERE clause is represented using sp:where.

Order by condition
disjoint with: Nothing
subclass of: SP System class
subclass of: Resource
subclass of: Thing
type: Class
comment: An abstract base class for ascending or descending order conditions. Instances of this class (typically bnodes) must have a value for expression to point to the actual values.

Data Access
disjoint with: Data Creation
disjoint with: Query Execution
disjoint with: Nothing
disjoint with: Measurement
subclass of: Activity
subclass of: Thing
type: Class
comment: DataAccess is a concept that represents the completed execution of an activity by which an immutable data item has been retrieved from the Web.
subclass of: http://lodlaundromat.org/.well-known/genid/samples/pellet///class//e761128019984814f28b30162a38df4a/d3e700bc1857a8001f8ca87e5b965b3a#2
subclass of: http://lodlaundromat.org/.well-known/genid/samples/pellet///class//e761128019984814f28b30162a38df4a/d3e700bc1857a8001f8ca87e5b965b3a#3

Provenance Vocabulary Core Ontology namespace
created: 2009-08-25T12:00:00Z
description: The Provenance Vocabulary provides classes and properties for describing provenance of Web data. The vocabulary focuses on two main use cases: 1.) It enables consumers of Web data to describe provenance of data retrieved from the Web and of data derived from such Web data. 2.) It enables providers of Web data to publish provenance-related metadata about their data. Notice, the vocabulary is not intended for describing provenance of other kinds of Web content. The Provenance Vocabulary is designed as a Web data specific specialization of the W3C PROV Ontology (PROV-O); classes and properties provided by the vocabulary are domain specific extensions of the more general concepts introduced in PROV-O. As a consequence, any Provenance Vocabulary based description of provenance can be easily interpreted and exchanged according to the W3C PROV family of standards.
modified: 2012-03-14T12:00:00Z
type: Thing
type: Ontology
creator: Jun Zhao
creator: Olaf Hartig

Provenance Vocabulary types module namespace
created: 2009-11-07T12:00:00Z
description: Extends the Provenance Vocabulary by defining subclasses of the types of provenance elements introduced in the core ontology.
modified: 2012-03-14T12:00:00Z
type: Thing
type: Ontology
imports: Provenance Vocabulary Core Ontology namespace
creator: Olaf Hartig
creator: Jun Zhao

arg3
sub property of: topObjectProperty
sub property of: arg
property disjoint with: bottomObjectProperty
type: ObjectProperty
type: Property
comment: The third argument of a function call.

distinct
property disjoint with: service URI
property disjoint with: from named
property disjoint with: with
property disjoint with: text
property disjoint with: bottomDataProperty
property disjoint with: varName
property disjoint with: graph IRI
type: DatatypeProperty
property disjoint with: mod max
property disjoint with: from
property disjoint with: into
property disjoint with: limit
sub property of: topDataProperty
sub property of: SP system property
property disjoint with: group by
property disjoint with: separator
property disjoint with: mod min
property disjoint with: graph name node
property disjoint with: offset
type: Property
range: boolean
domain: Select query
comment: A marker property to indicate that a Select query is of type SELECT DISTINCT.

subgraph of
sub property of: topObjectProperty
property disjoint with: serialized by
property disjoint with: bottomObjectProperty
type: ObjectProperty
type: Property
comment: The graph associated with the subject is a subgraph of a graph equivalent to that associated with the object.
domain: Graph
range: Graph

Aggregation
disjoint with: Nothing
subclass of: SP System class
subclass of: Resource
subclass of: Thing
type: Class
comment: Base class of aggregation types (not part of the SPARQL 1.0 standard but supported by ARQ and other engines).

Sub query
disjoint with: Nothing
subclass of: Element
subclass of: SP System class
subclass of: Resource
subclass of: Thing
type: Class
comment: A nested SELECT query inside of an element list. The query is stored in sp:query.

group by
property disjoint with: into
property disjoint with: named
property disjoint with: default
property disjoint with: limit
property disjoint with: distinct
property disjoint with: mod min
sub property of: SP system property
property disjoint with: graph name node
property disjoint with: from
property disjoint with: with
property disjoint with: varName
property disjoint with: graph IRI
property disjoint with: reduced
property disjoint with: silent
property disjoint with: from named
property disjoint with: offset
property disjoint with: bottomDataProperty
sub property of: topDataProperty
property disjoint with: service URI
property disjoint with: separator
property disjoint with: all
type: DatatypeProperty
property disjoint with: text
property disjoint with: mod max
type: Property
range: List
domain: Select query
comment: Points from a Query to the list of GROUP BY expressions.

path2
sub property of: topObjectProperty
property disjoint with: bottomObjectProperty
type: ObjectProperty
type: Property
sub property of: SP system property
range: Path
comment: The second child path of a property path. Used by sp:AltPath and sp:SeqPath.

elements
sub property of: topObjectProperty
property disjoint with: bottomObjectProperty
type: ObjectProperty
type: Property
sub property of: SP system property
range: Element list
comment: Points to an ElementList, for example in an Optional element.

Values
disjoint with: Nothing
subclass of: Element
subclass of: SP System class
subclass of: Resource
subclass of: Thing
type: Class
comment: A VALUES element. sp:varNames points to an rdf:List of strings for the variables, sp:values to an rdf:List of rdf:Lists with nodes for each variable, in the order defined by the variables list.

involved
sub property of: topObjectProperty
property disjoint with: bottomObjectProperty
type: ObjectProperty
comment: This property is deprecated and will be removed from the Provenance Vocabulary in the next revision. prv:involvedActor was deprecated in the process of making the Provenance Vocabulary a specialization of W3C's PROV-O. Hence, use prov:wasAssociatedWith instead.
type: DeprecatedProperty

object
sub property of: SP system property
sub property of: topDataProperty
property disjoint with: bottomDataProperty
type: DatatypeProperty
type: Property
domain: Tuple
comment: An RDF Node or Variable describing the object of a triple.

Element
disjoint with: Nothing
subclass of: SP System class
subclass of: Resource
subclass of: Thing
type: Class
comment: An abstract base class for all pattern elements.

Reverse path
disjoint with: Nothing
subclass of: Path
subclass of: SP System class
subclass of: Resource
subclass of: Thing
type: Class
comment: A path with reversed direction.

text
sub property of: topDataProperty
property disjoint with: from named
type: DatatypeProperty
property disjoint with: into
property disjoint with: distinct
property disjoint with: graph IRI
property disjoint with: service URI
property disjoint with: reduced
property disjoint with: all
property disjoint with: group by
property disjoint with: graph name node
property disjoint with: mod max
property disjoint with: offset
property disjoint with: silent
property disjoint with: limit
property disjoint with: bottomDataProperty
property disjoint with: named
property disjoint with: default
property disjoint with: with
sub property of: SP system property
property disjoint with: mod min
property disjoint with: from
type: Property
range: string
comment: Can be attached to sp:Queries to store a textual representation of the query. This can be useful for tools that do not have a complete SPIN Syntax parser available.

Tuple
disjoint with: Nothing
subclass of: SP System class
subclass of: Resource
subclass of: Thing
type: Class
comment: Abstract base class for things that have subject and object.

Data Creating Entity
subclass of: Agent
disjoint with: Data Providing Service
disjoint with: Service
disjoint with: Data Accessor
subclass of: Data Creator
subclass of: Thing
disjoint with: Server
type: Class
subclass of: Human Agent
disjoint with: Non-Human Agent
disjoint with: WebClient
disjoint with: Data Creating Service
disjoint with: Data Creating Device
disjoint with: Nothing
disjoint with: WebServer
disjoint with: Sensor
comment: DataCreatingEntity is a concept that represents a human agent who performed the creation of a data item, either directly or by being responsible for a non-human data creator (see the concepts prvTypes:DataCreatingService and prvTypes:DataCreatingDevice).

operated by
sub property of: topObjectProperty
sub property of: actedOnBehalfOf
property disjoint with: accessed
property disjoint with: bottomObjectProperty
type: ObjectProperty
comment: This property refers to a human agent who was operating a non-human agent. For instance, a service provider operates a data providing service (see concept prv:DataProvidingService). Another example is a human agent who operates a non-human data creating agent.
domain: Non-Human Agent
range: Human Agent

Triplify Mapping
subclass of: Plan
subclass of: http://lodlaundromat.org/.well-known/genid/samples/pellet///class//e761128019984814f28b30162a38df4a/d3e700bc1857a8001f8ca87e5b965b3a#7
subclass of: Entity
disjoint with: File
subclass of: http://lodlaundromat.org/.well-known/genid/samples/pellet///class//e761128019984814f28b30162a38df4a/d3e700bc1857a8001f8ca87e5b965b3a#4
subclass of: Creation Guideline
subclass of: InformationRealization
subclass of: Thing
disjoint with: Nothing
subclass of: Data Item
type: Class
comment: TriplifyMapping is a concept that represents the mapping defined in a Triplify configuration file.

from named
sub property of: SP system property
property disjoint with: distinct
property disjoint with: group by
property disjoint with: limit
property disjoint with: named
property disjoint with: bottomDataProperty
property disjoint with: default
property disjoint with: mod min
property disjoint with: reduced
type: DatatypeProperty
property disjoint with: separator
property disjoint with: varName
sub property of: topDataProperty
property disjoint with: all
property disjoint with: text
property disjoint with: offset
property disjoint with: mod max
property disjoint with: silent
type: Property
range: Resource
domain: Query
comment: Specifies a named RDF Dataset used by a Query (FROM NAMED syntax in SPARQL). Values of this property must be URI resources.

Jun Zhao
type: Human Agent
type: Agent
type: Thing
type: Person

mod max
property disjoint with: distinct
type: DatatypeProperty
property disjoint with: default
sub property of: topDataProperty
property disjoint with: service URI
property disjoint with: named
property disjoint with: from
property disjoint with: text
sub property of: SP system property
property disjoint with: into
property disjoint with: reduced
property disjoint with: from named
property disjoint with: all
property disjoint with: group by
property disjoint with: graph name node
property disjoint with: silent
property disjoint with: graph IRI
property disjoint with: varName
property disjoint with: bottomDataProperty
property disjoint with: separator
property disjoint with: with
type: Property
range: integer
domain: Mod path

contained in
sub property of: topObjectProperty
property disjoint with: serialized by
property disjoint with: bottomObjectProperty
type: ObjectProperty
comment: This property refers to a data item that contained a data item. Hence, this property refers to another data item of a larger granularity (e.g. an RDF triple is usually contained in an RDF graph).
domain: Data Item
range: Data Item

Triple path
disjoint with: Nothing
subclass of: Element
subclass of: Tuple
subclass of: SP System class
subclass of: Resource
subclass of: Thing
type: Class
comment: Similar to a TriplePattern, but with a path expression as its predicate. For example, this can be used to express transitive sub-class relationships (?subClass rdfs:subClassOf* ?superClass).

Insert
disjoint with: Nothing
subclass of: Modify
subclass of: Thing
subclass of: Update
subclass of: SP System class
type: Class
subclass of: Command
subclass of: Resource
type: DeprecatedClass
comment: Deprecated - use sp:Modify instead. Represents a INSERT INTO (part of SPARQL UPDATE language). The graph IRIs are stored in sp:graphIRI. The template patterns to delete are stored in sp:insertPattern. The WHERE clause is represented using sp:where.

SQL Query
subclass of: http://lodlaundromat.org/.well-known/genid/samples/pellet///class//e761128019984814f28b30162a38df4a/d3e700bc1857a8001f8ca87e5b965b3a#7
subclass of: Creation Guideline
subclass of: http://lodlaundromat.org/.well-known/genid/samples/pellet///class//e761128019984814f28b30162a38df4a/d3e700bc1857a8001f8ca87e5b965b3a#4
subclass of: Entity
disjoint with: Nothing
subclass of: Query
subclass of: Thing
disjoint with: File
disjoint with: SPARQL Query
subclass of: InformationRealization
type: Class
subclass of: Plan
subclass of: Data Item

accessed
property disjoint with: bottomObjectProperty
sub property of: topObjectProperty
property disjoint with: used
property disjoint with: operated by
property disjoint with: guided by
property disjoint with: used by
type: ObjectProperty
sub property of: wasAssociatedWith
comment: This property refers to the service that provided the Web representation during the execution of a data access.
domain: Data Access
range: Data Providing Service

service URI
property disjoint with: separator
property disjoint with: reduced
property disjoint with: text
sub property of: topDataProperty
property disjoint with: mod max
property disjoint with: group by
property disjoint with: bottomDataProperty
property disjoint with: mod min
property disjoint with: named
property disjoint with: silent
property disjoint with: default
property disjoint with: offset
property disjoint with: limit
property disjoint with: distinct
sub property of: SP system property
type: DatatypeProperty
property disjoint with: all
property disjoint with: varName
type: Property
range: Resource
domain: Service
comment: Used by sp:Service to specify the URI of the SPARQL end point to invoke. Must point to a URI node.

Data Publisher
disjoint with: Data Accessor
disjoint with: Non-Human Agent
disjoint with: WebServer
subclass of: Agent
disjoint with: WebClient
disjoint with: Service
disjoint with: Server
disjoint with: Sensor
subclass of: Thing
disjoint with: Data Creating Service
disjoint with: Data Providing Service
disjoint with: Data Creating Device
type: Class
subclass of: Human Agent
disjoint with: Nothing
comment: DataPublisher is a concept that represents entities such as persons, groups, or organizations who use a data providing service (see concept prv:DataProvidingService) to publish data on the Web.

Triple template
disjoint with: Nothing
subclass of: Tuple
subclass of: SP System class
subclass of: Resource
subclass of: Triple
subclass of: Thing
type: Class
comment: A prototypical triple used as template in the head of a Construct query. May contain variables.

yielded by
sub property of: topObjectProperty
property disjoint with: bottomObjectProperty
type: ObjectProperty
comment: This property is deprecated and will be removed from the Provenance Vocabulary in the next revision. prv:yieldedBy was deprecated in the process of making the Provenance Vocabulary a specialization of W3C's PROV-O. Hence, use prov:wasGeneratedBy instead.
type: DeprecatedProperty

Sensor
subclass of: Data Creator
disjoint with: Person
subclass of: Data Creating Device
subclass of: Thing
subclass of: Non-Human Agent
disjoint with: Organization
type: Class
disjoint with: Group
disjoint with: Data Creating Service
disjoint with: Human Agent
disjoint with: Nothing
disjoint with: Data Creating Entity
subclass of: Agent
disjoint with: Data Publisher

Variable
disjoint with: Nothing
subclass of: SP System class
subclass of: Resource
subclass of: Thing
type: Class
comment: A variable mentioned in a Triple or expression. Variables are often blank nodes with the variable name stored in ts:name. Variables can also be supplied with a URI in which case the system will attempt to reuse the same variable instance across multiple query definitions.

MAX
disjoint with: Nothing
subclass of: SP System class
subclass of: Resource
subclass of: Thing
subclass of: Aggregation
type: Class
comment: Represents MAX aggregations.

Delete where
disjoint with: Nothing
subclass of: Update
subclass of: SP System class
subclass of: Resource
subclass of: Thing
subclass of: Command
type: Class
comment: An Update operation where the triples matched by the WHERE clause (sp:where) will be the triples deleted.

Minus
disjoint with: Nothing
subclass of: Element
subclass of: Element group
subclass of: SP System class
subclass of: Resource
subclass of: Thing
type: Class
comment: A MINUS element group.

Command
disjoint with: Nothing
subclass of: SP System class
subclass of: Resource
subclass of: Thing
type: Class
comment: A shared superclass for sp:Query and sp:Update that can be used to specify that the range of property can be either one.

arg1
sub property of: topObjectProperty
sub property of: arg
property disjoint with: bottomObjectProperty
type: ObjectProperty
type: Property
comment: The first argument of a function call.

graph IRI
property disjoint with: separator
property disjoint with: default
property disjoint with: silent
sub property of: topDataProperty
property disjoint with: reduced
property disjoint with: limit
property disjoint with: text
property disjoint with: mod max
sub property of: SP system property
property disjoint with: offset
property disjoint with: bottomDataProperty
property disjoint with: varName
property disjoint with: all
property disjoint with: named
type: DatatypeProperty
property disjoint with: distinct
property disjoint with: group by
property disjoint with: mod min
type: Property
range: Resource
comment: Points to graph names (IRIs) in various sp:Update operations.

Named graph
disjoint with: Nothing
subclass of: Element
subclass of: Element group
subclass of: SP System class
subclass of: Resource
subclass of: Thing
type: Class
comment: A named Graph element such as GRAPH <uri> {...}.

order by
sub property of: topObjectProperty
property disjoint with: bottomObjectProperty
type: ObjectProperty
type: Property
sub property of: SP system property
range: List
domain: Query
comment: Links a query with an ORDER BY clause where the values are rdf:List containing OrderByConditions or expressions. While the domain of this property is sp:Query, only Describe and Select queries can have values of it.

Element list
subclass of: SP System class
subclass of: List
subclass of: Resource
type: Class
subclass of: Element group
subclass of: Thing
disjoint with: Nothing
subclass of: Element
comment: A list of Elements. This class is never instantiated directly as SPIN will use plain rdf:Lists to store element lists.

SUM
disjoint with: Nothing
subclass of: SP System class
subclass of: Resource
subclass of: Thing
subclass of: Aggregation
type: Class
comment: Represents sum aggregations, e.g. SELECT SUM(?varName)...

completed at
sub property of: topDataProperty
property disjoint with: bottomDataProperty
sub property of: endedAtTime
equivalent property: endedAtTime
type: FunctionalProperty
type: DatatypeProperty
comment: This property refers to the time an activity has been completed.

sub path
sub property of: topObjectProperty
property disjoint with: bottomObjectProperty
type: ObjectProperty
type: Property
sub property of: SP system property
comment: The child path of a property path expression. This is used by ReversePath and ModPath.

with
property disjoint with: all
property disjoint with: silent
property disjoint with: offset
type: DatatypeProperty
property disjoint with: varName
property disjoint with: bottomDataProperty
property disjoint with: separator
property disjoint with: distinct
property disjoint with: named
sub property of: topDataProperty
property disjoint with: mod max
property disjoint with: text
sub property of: SP system property
property disjoint with: limit
property disjoint with: default
property disjoint with: mod min
property disjoint with: group by
property disjoint with: reduced
type: Property
range: Resource
domain: Modify

Query
disjoint with: Nothing
subclass of: SP System class
subclass of: Resource
subclass of: Thing
subclass of: Command
type: Class
comment: Abstract base class of the various types of supported queries. Common to all types of queries is that they can have a body ("WHERE clause").

Triple pattern
disjoint with: Nothing
subclass of: Resource
subclass of: Element
type: Class
subclass of: Thing
subclass of: Triple
subclass of: SP System class
subclass of: Tuple
comment: A triple pattern used in the body of a query.

delete pattern
sub property of: topObjectProperty
property disjoint with: bottomObjectProperty
type: ObjectProperty
type: Property
sub property of: SP system property
range: List
domain: Update
comment: Points to a list of sp:TripleTemplates and sp:NamedGraphs in a modify operation.

as
sub property of: topObjectProperty
property disjoint with: bottomObjectProperty
type: ObjectProperty
type: Property
sub property of: SP system property
range: Variable
comment: Points to a Variable used in an AS statement such as COUNT aggregates.

Filter
disjoint with: Nothing
subclass of: Element
subclass of: SP System class
subclass of: Resource
subclass of: Thing
type: Class
comment: A constraint element that evaluates a given expression to true or false.

COUNT
disjoint with: Nothing
subclass of: SP System class
subclass of: Resource
subclass of: Thing
subclass of: Aggregation
type: Class
comment: Counts the number of times a variable is used. The variable is stored in the variable property. This might be left blank to indicate COUNT(*).

Clear
disjoint with: Nothing
subclass of: Update
subclass of: SP System class
subclass of: Resource
subclass of: Thing
subclass of: Command
type: Class
comment: An Update operation that removes all triples from a specified graph. Must specify the graph using sp:graphIRI, or sp:default, sp:named or sp:all. May have the SILENT flag, encoded using sp:silent.

Human Actor
disjoint with: Nothing
subclass of: Thing
type: Class
type: DeprecatedClass
comment: This class is deprecated and will be removed from the Provenance Vocabulary in the next revision. prv:HumanActor was renamed to prv:HumanAgent in the process of making the Provenance Vocabulary a specialization of W3C's PROV-O. Hence, use prv:HumanAgent instead.

varName
property disjoint with: silent
property disjoint with: offset
type: DatatypeProperty
property disjoint with: default
property disjoint with: graph name node
sub property of: topDataProperty
property disjoint with: mod max
property disjoint with: distinct
property disjoint with: graph IRI
property disjoint with: limit
property disjoint with: from named
property disjoint with: with
property disjoint with: reduced
property disjoint with: service URI
property disjoint with: bottomDataProperty
property disjoint with: group by
property disjoint with: into
property disjoint with: all
property disjoint with: mod min
property disjoint with: named
sub property of: SP system property
property disjoint with: from
type: Property
range: string
domain: Variable
comment: The name of a Variable.

used
sub property of: topObjectProperty
property disjoint with: bottomObjectProperty
type: ObjectProperty
comment: This property is deprecated and will be removed from the Provenance Vocabulary in the next revision. prv:employedArtifact was deprecated in the process of making the Provenance Vocabulary a specialization of W3C's PROV-O. Hence, use prov:used instead.
type: DeprecatedProperty

limit
property disjoint with: silent
property disjoint with: from
sub property of: topDataProperty
property disjoint with: from named
property disjoint with: named
sub property of: SP system property
property disjoint with: graph name node
property disjoint with: reduced
property disjoint with: default
property disjoint with: service URI
type: DatatypeProperty
property disjoint with: all
property disjoint with: into
property disjoint with: separator
property disjoint with: text
property disjoint with: varName
property disjoint with: bottomDataProperty
property disjoint with: with
property disjoint with: distinct
property disjoint with: graph IRI
property disjoint with: group by
type: Property
range: long
domain: Query
comment: The LIMIT solution modifier of a Query.

arg4
sub property of: topObjectProperty
sub property of: arg
property disjoint with: bottomObjectProperty
type: ObjectProperty
type: Property
comment: The forth argument of a function call.

result variables
sub property of: topObjectProperty
property disjoint with: bottomObjectProperty
type: ObjectProperty
type: Property
sub property of: SP system property
range: List
domain: Select query
comment: An rdf:List of variables that are returned by a Select query.

GROUP_CONCAT
disjoint with: Nothing
subclass of: SP System class
subclass of: Resource
subclass of: Thing
subclass of: Aggregation
type: Class
comment: Represents GROUP_CONCAT aggregations.

result nodes
sub property of: topObjectProperty
property disjoint with: bottomObjectProperty
type: ObjectProperty
type: Property
sub property of: SP system property
range: List
domain: Describe
comment: Contains the result nodes (URI resources or Variables) of a Describe query.

Olaf Hartig
type: Human Agent
type: Agent
type: Thing
type: Person

silent
property disjoint with: mod min
property disjoint with: from
property disjoint with: graph IRI
property disjoint with: mod max
type: DatatypeProperty
sub property of: SP system property
property disjoint with: offset
property disjoint with: varName
property disjoint with: limit
property disjoint with: separator
property disjoint with: graph name node
property disjoint with: text
property disjoint with: service URI
property disjoint with: from named
sub property of: topDataProperty
property disjoint with: with
property disjoint with: bottomDataProperty
property disjoint with: group by
property disjoint with: into
type: Property
range: boolean

Query
subclass of: http://lodlaundromat.org/.well-known/genid/samples/pellet///class//e761128019984814f28b30162a38df4a/d3e700bc1857a8001f8ca87e5b965b3a#4
subclass of: InformationRealization
disjoint with: File
subclass of: Entity
subclass of: Creation Guideline
disjoint with: Nothing
subclass of: http://lodlaundromat.org/.well-known/genid/samples/pellet///class//e761128019984814f28b30162a38df4a/d3e700bc1857a8001f8ca87e5b965b3a#7
subclass of: Data Item
type: Class
subclass of: Plan
subclass of: Thing

AVG
disjoint with: Nothing
subclass of: SP System class
subclass of: Resource
subclass of: Thing
subclass of: Aggregation
type: Class
comment: Represents AVG aggregations.

Data Item
disjoint with: Nothing
subclass of: Entity
subclass of: Thing
type: Class
comment: Immutable is a concept that represents entities which are immutable.

equivalent graph
sub property of: topObjectProperty
property disjoint with: serialized by
property disjoint with: bottomObjectProperty
type: ObjectProperty
type: Property
comment: The graphs associated with the subject and object are equivalent.
domain: Graph
range: Graph

Insert data
disjoint with: Nothing
subclass of: Update
subclass of: SP System class
subclass of: Resource
subclass of: Thing
subclass of: Command
type: Class
comment: An Update operation to insert specific triples. The graph triples are represented using sp:data, which points to an rdf:List of sp:Triples or sp:NamedGraphs.

Query Result
disjoint with: File
subclass of: InformationRealization
subclass of: http://lodlaundromat.org/.well-known/genid/samples/pellet///class//e761128019984814f28b30162a38df4a/d3e700bc1857a8001f8ca87e5b965b3a#4
subclass of: Data Item
type: Class
subclass of: Entity
subclass of: Thing
subclass of: http://lodlaundromat.org/.well-known/genid/samples/pellet///class//e761128019984814f28b30162a38df4a/d3e700bc1857a8001f8ca87e5b965b3a#7
disjoint with: Nothing
subclass of: http://lodlaundromat.org/.well-known/genid/samples/pellet///class//e761128019984814f28b30162a38df4a/e098647b35c514b5f1bd10a1367fd0de#1
comment: QueryResult is the result of a query execution.

var names
sub property of: topObjectProperty
property disjoint with: bottomObjectProperty
type: ObjectProperty
type: Property
sub property of: SP system property
range: List
domain: Values
comment: The names of the variables (xsd:strings) of the variables declared for a VALUES element.

Graph
subclass of: http://lodlaundromat.org/.well-known/genid/samples/pellet///class//e761128019984814f28b30162a38df4a/d3e700bc1857a8001f8ca87e5b965b3a#7
disjoint with: File
subclass of: http://lodlaundromat.org/.well-known/genid/samples/pellet///class//e761128019984814f28b30162a38df4a/d3e700bc1857a8001f8ca87e5b965b3a#4
subclass of: InformationRealization
disjoint with: Nothing
type: Class
subclass of: Entity
subclass of: Data Item
subclass of: Thing
comment: An RDF graph (with intensional semantics).

SP System class
disjoint with: Nothing
subclass of: Resource
subclass of: Thing
type: Class
comment: An "artificial" root class that groups all SP classes. This makes them look much less overwhelming in UI tools. Typical end users don't need to see those classes anyway.

Provenance Vocabulary Core Ontology Specification
description: This documents specifies the Provenance Vocabulary Core Ontology which defines the main classes and properties provided by the Provenance Vocabulary.
license: http://creativecommons.org/licenses/by/1.0/
type: Thing
alternate: ns.rdf
primary topic: Provenance Vocabulary Core Ontology namespace
conforms to: rdfa-syntax
assurance: Detached signature
type: Document
label: Document that defines the core ontology of the Provenance Vocabulary

offset
property disjoint with: varName
property disjoint with: named
property disjoint with: all
property disjoint with: separator
property disjoint with: default
property disjoint with: reduced
property disjoint with: service URI
type: DatatypeProperty
property disjoint with: from named
property disjoint with: bottomDataProperty
property disjoint with: with
property disjoint with: graph name node
property disjoint with: distinct
property disjoint with: text
sub property of: topDataProperty
property disjoint with: graph IRI
property disjoint with: silent
property disjoint with: from
property disjoint with: group by
property disjoint with: into
sub property of: SP system property
type: Property
range: long
domain: Query
comment: The OFFSET solution modifier of a Query.

query
sub property of: topObjectProperty
property disjoint with: bottomObjectProperty
type: ObjectProperty
type: Property
sub property of: SP system property
range: Query
domain: Sub query
comment: Links a SubQuery resource with the nested Query.

using named
sub property of: topObjectProperty
property disjoint with: bottomObjectProperty
type: ObjectProperty
type: Property
sub property of: SP system property
range: Resource
domain: Modify

accessed
sub property of: topObjectProperty
property disjoint with: used
property disjoint with: guided by
property disjoint with: bottomObjectProperty
type: ObjectProperty
comment: This property refers to the Web resource that has been accessed during the execution of a data access. More precisely, the request of the referenced Web resource resulted in retrieving the representation that has been retrieved by the corresponding prv:DataAccess execution.
domain: Data Access
range: WebResource

Asc
disjoint with: Nothing
subclass of: SP System class
subclass of: Resource
subclass of: Order by condition
subclass of: Thing
type: Class
comment: Marker to indicate ascending order.

runs
sub property of: topObjectProperty
property disjoint with: bottomObjectProperty
type: ObjectProperty
comment: This property refers to the software that was run by a non-human actor (usually a service).
domain: Non-Human Agent

Delete data
disjoint with: Nothing
subclass of: Update
subclass of: SP System class
subclass of: Resource
subclass of: Thing
subclass of: Command
type: Class
comment: An Update operation to delete specific triples. The graph triples are represented using sp:data, which points to an rdf:List of sp:Triples or sp:NamedGraphs.

templates
sub property of: topObjectProperty
property disjoint with: bottomObjectProperty
type: ObjectProperty
type: Property
sub property of: SP system property
range: List
domain: Construct
comment: Points to a list of TripleTemplates that form the head of a Construct query.

node
sub property of: topObjectProperty
property disjoint with: bottomObjectProperty
type: ObjectProperty
type: Property
sub property of: SP system property
domain: Reverse link path

Detached signature
endorser: pubkey2011
type: Endorsement
type: Thing

SPARQL Query
subclass of: InformationRealization
subclass of: Entity
type: Class
disjoint with: File
disjoint with: SQL Query
subclass of: Creation Guideline
disjoint with: Nothing
subclass of: http://lodlaundromat.org/.well-known/genid/samples/pellet///class//e761128019984814f28b30162a38df4a/d3e700bc1857a8001f8ca87e5b965b3a#4
subclass of: Data Item
subclass of: http://lodlaundromat.org/.well-known/genid/samples/pellet///class//e761128019984814f28b30162a38df4a/d3e700bc1857a8001f8ca87e5b965b3a#7
subclass of: Thing
subclass of: Query
subclass of: Plan

Ask
disjoint with: Nothing
subclass of: SP System class
subclass of: Query
subclass of: Resource
subclass of: Thing
subclass of: Command
type: Class
comment: An ASK query that returns true if the condition in the body is met by at least one result set.

Data Creating Service
disjoint with: Group
subclass of: Non-Human Agent
disjoint with: Nothing
disjoint with: Person
type: Class
subclass of: Agent
disjoint with: Data Publisher
disjoint with: Data Creating Entity
disjoint with: Data Creating Device
disjoint with: Human Agent
subclass of: Data Creator
disjoint with: Sensor
disjoint with: Organization
subclass of: Thing
comment: DataCreatingService is a concept that represents a software service which performed the creation of a data item. Examples for data creating services are reasoners, query engines, and workflow engines.

serialized by
property disjoint with: guided by
property disjoint with: bottomObjectProperty
sub property of: topObjectProperty
property disjoint with: equivalent graph
property disjoint with: used
property disjoint with: immediately preceded by
type: ObjectProperty
property disjoint with: contained in
property disjoint with: subgraph of
comment: This property refers to a file that serialized a data item.
domain: Data Item
range: File

path
sub property of: topObjectProperty
property disjoint with: bottomObjectProperty
type: ObjectProperty
type: Property
sub property of: SP system property
range: Path
domain: Triple path
comment: Points from a TriplePath to its path.

Triple
disjoint with: Nothing
subclass of: Tuple
subclass of: SP System class
subclass of: Resource
subclass of: Thing
type: Class
comment: A base class for TriplePattern and TripleTemplate. This basically specifies that subject, predicate and object must be present.

Reverse link path
disjoint with: Nothing
subclass of: Path
subclass of: SP System class
subclass of: Resource
subclass of: Thing
type: Class

Non-Human Actor
disjoint with: Nothing
subclass of: Thing
type: Class
type: DeprecatedClass
comment: This class is deprecated and will be removed from the Provenance Vocabulary in the next revision. prv:NonHumanActor was renamed to prv:NonHumanAgent in the process of making the Provenance Vocabulary a specialization of W3C's PROV-O. Hence, use prv:NonHumanAgent instead.

Document that defines the types module of the Provenance Vocabulary
primary topic: Provenance Vocabulary types module namespace
type: Thing
type: Document

Seq path
disjoint with: Nothing
subclass of: Path
subclass of: SP System class
subclass of: Resource
subclass of: Thing
type: Class
comment: A sequence of multiple paths.

predicate
sub property of: topObjectProperty
property disjoint with: bottomObjectProperty
type: ObjectProperty
type: Property
sub property of: SP system property
range: Resource
domain: Triple
comment: A resource or Variable describing the predicate of a triple.

Data Providing Service
disjoint with: Organization
disjoint with: Data Publisher
disjoint with: Group
disjoint with: Nothing
disjoint with: Human Agent
disjoint with: Data Creating Entity
subclass of: Non-Human Agent
disjoint with: Person
subclass of: Agent
subclass of: Thing
type: Class
comment: DataProvidingService is a concept that represents a non-human agent - usually a Web service or a server - that processes data access requests and actually sends the requested Web representations over the Web.

retrieved by
sub property of: topObjectProperty
sub property of: wasGeneratedBy
property disjoint with: bottomObjectProperty
property disjoint with: created by
type: FunctionalProperty
type: ObjectProperty
comment: This property refers to the data access by which an immutable entity has been retrieved from the Web. Each entity that has this property is a Web representation.
domain: Data Item
domain: http://lodlaundromat.org/.well-known/genid/samples/pellet///class//e761128019984814f28b30162a38df4a/d3e700bc1857a8001f8ca87e5b965b3a#4
range: Data Access

Query Execution
disjoint with: HTTP-based Data Access
disjoint with: Data Access
disjoint with: Nothing
subclass of: Data Creation
subclass of: Activity
subclass of: Thing
type: Class
subclass of: http://lodlaundromat.org/.well-known/genid/samples/pellet///class//e761128019984814f28b30162a38df4a/e098647b35c514b5f1bd10a1367fd0de#2

Load
disjoint with: Nothing
subclass of: Update
subclass of: SP System class
subclass of: Resource
subclass of: Thing
subclass of: Command
type: Class
comment: A LOAD Update operation. The document to load is specified using sp:document, and the (optional) target graph using sp:into.

SP system property
sub property of: topDataProperty
property disjoint with: bottomDataProperty
type: DatatypeProperty
type: Property
comment: An abstract base proprerty that groups together the SP system properties. Users typically don't need to see them anyway.

involved exchange of
sub property of: topObjectProperty
property disjoint with: used
property disjoint with: guided by
property disjoint with: bottomObjectProperty
type: ObjectProperty
comment: This property refers to an HTTP message (request or response) that has been exchanged during an HTTP based data access.
domain: Data Access
range: Message

Data Creating Device
subclass of: Agent
subclass of: Thing
type: Class
disjoint with: Person
subclass of: Data Creator
disjoint with: Data Publisher
disjoint with: Data Creating Entity
disjoint with: Group
subclass of: Non-Human Agent
disjoint with: Human Agent
disjoint with: Nothing
disjoint with: Organization
disjoint with: Data Creating Service
comment: DataCreatingDevice is a concept that represents a device which performed the creation of a data item. Examples for data creating devices are sensors.

Select query
disjoint with: Nothing
subclass of: SP System class
subclass of: Query
subclass of: Resource
subclass of: Thing
subclass of: Command
type: Class
comment: A SELECT-type query that returns variable bindings as its result.

created by
sub property of: topObjectProperty
sub property of: wasGeneratedBy
property disjoint with: retrieved by
property disjoint with: bottomObjectProperty
type: ObjectProperty
comment: This property refers to the creation of a data item (or a file that serializes data items).
domain: http://lodlaundromat.org/.well-known/genid/samples/pellet///class//e761128019984814f28b30162a38df4a/d3e700bc1857a8001f8ca87e5b965b3a#7
range: Data Creation
property chain axiom: http://lodlaundromat.org/.well-known/genid/samples/pellet///class//e761128019984814f28b30162a38df4a/d3e700bc1857a8001f8ca87e5b965b3a#10

Human Agent
disjoint with: Nothing
disjoint with: Data Providing Service
disjoint with: WebClient
disjoint with: Non-Human Agent
subclass of: Agent
disjoint with: Server
disjoint with: Data Creating Service
disjoint with: Data Creating Device
disjoint with: WebServer
disjoint with: Service
type: Class
disjoint with: Sensor
disjoint with: Data Accessor
subclass of: Thing
comment: HumanAgent is a general class that represents agents who are social beings such as persons, organizations, companies.

used by
sub property of: topObjectProperty
sub property of: actedOnBehalfOf
property disjoint with: accessed
property disjoint with: bottomObjectProperty
type: ObjectProperty
comment: This property refers to a data publisher who used a data providing services at the time the provenance description refers to.
domain: Data Providing Service
range: Data Publisher

Mod path
disjoint with: Nothing
subclass of: Path
subclass of: SP System class
subclass of: Resource
subclass of: Thing
type: Class
comment: A modified path such as rdfs:subClassOf*.

arg2
sub property of: topObjectProperty
sub property of: arg
property disjoint with: bottomObjectProperty
type: ObjectProperty
type: Property
comment: The second argument of a function call.

Update
disjoint with: Nothing
subclass of: SP System class
subclass of: Resource
subclass of: Thing
subclass of: Command
type: Class
comment: Abstract base class to group the various SPARQL UPDATE commands.

having
sub property of: topObjectProperty
property disjoint with: bottomObjectProperty
type: ObjectProperty
type: Property
sub property of: SP system property
range: List
domain: Select query
comment: Points from a SELECT query to a list of HAVING expressions.

bindings
sub property of: topObjectProperty
property disjoint with: bottomObjectProperty
type: ObjectProperty
type: Property
sub property of: SP system property
range: List
domain: Values
comment: The actual bindings of a sp:Values element.

path1
sub property of: topObjectProperty
property disjoint with: bottomObjectProperty
type: ObjectProperty
type: Property
sub property of: SP system property
range: Path
comment: The first child path of a property path. Used by sp:AltPath and sp:SeqPath.

performed by
sub property of: topObjectProperty
sub property of: wasAssociatedWith
property disjoint with: bottomObjectProperty
type: ObjectProperty
comment: This property refers to an agent that/who performed an activity.

subject
sub property of: topObjectProperty
property disjoint with: bottomObjectProperty
type: ObjectProperty
type: Property
sub property of: SP system property
range: Resource
domain: Tuple
comment: A resource or Variable describing the subject of a triple.

named
property disjoint with: separator
property disjoint with: with
property disjoint with: into
sub property of: topDataProperty
property disjoint with: bottomDataProperty
property disjoint with: graph name node
property disjoint with: text
property disjoint with: limit
property disjoint with: group by
property disjoint with: service URI
property disjoint with: mod max
property disjoint with: from
property disjoint with: mod min
property disjoint with: varName
type: DatatypeProperty
property disjoint with: from named
property disjoint with: graph IRI
sub property of: SP system property
property disjoint with: offset
type: Property
range: boolean
comment: Used in DROP and CLEAR.

insert pattern
sub property of: topObjectProperty
property disjoint with: bottomObjectProperty
type: ObjectProperty
type: Property
sub property of: SP system property
range: List
domain: Modify
comment: Points to a list of sp:TripleTemplates or sp:NamedGraphs in a modify command.

Execution
disjoint with: Nothing
subclass of: Thing
type: Class
type: DeprecatedClass
comment: This class is deprecated and will be removed from the Provenance Vocabulary in the next revision. prv:Execution was deprecated in the process of making the Provenance Vocabulary a specialization of W3C's PROV-O. Hence, use prov:Activity instead.

immediately preceded by
sub property of: topObjectProperty
sub property of: replaces
sub property of: http://lodlaundromat.org/.well-known/genid/samples/pellet///class//e761128019984814f28b30162a38df4a/d3e700bc1857a8001f8ca87e5b965b3a#1
property disjoint with: serialized by
property disjoint with: bottomObjectProperty
type: ObjectProperty
comment: This property may be used to make the relationship between different version of a data item explicit. More precisely, this property refers to an immediately preceding version of a data item; hence, the new version (i.e. the subject) has been created using the old version (i.e. the object). We strongly encourage to also describe this creation of the new version explicitly.
domain: Data Item
range: Data Item

expression
sub property of: SP system property
sub property of: topDataProperty
property disjoint with: bottomDataProperty
type: DatatypeProperty
type: Property
comment: Points to an expression, for example in a Filter or Assignment.

File
subclass of: http://lodlaundromat.org/.well-known/genid/samples/pellet///class//e761128019984814f28b30162a38df4a/d3e700bc1857a8001f8ca87e5b965b3a#4
subclass of: Entity
type: Class
disjoint with: Data Item
disjoint with: Dataset
disjoint with: Graph
disjoint with: Query
disjoint with: Query Template
disjoint with: Creation Guideline
disjoint with: SQL Query
disjoint with: Triplify Mapping
disjoint with: Statement
disjoint with: Nothing
subclass of: http://lodlaundromat.org/.well-known/genid/samples/pellet///class//e761128019984814f28b30162a38df4a/d3e700bc1857a8001f8ca87e5b965b3a#7
disjoint with: Query Result
disjoint with: SPARQL Query
subclass of: Thing
comment: File is a general class that represents computer files/documents of any kind.

Data Creation
disjoint with: HTTP-based Data Access
disjoint with: Data Access
disjoint with: Nothing
subclass of: Activity
subclass of: Thing
type: Class
comment: DataCreation is a concept that represents the execution of an activity by which data items have been created.

Service
disjoint with: Nothing
subclass of: Element
subclass of: Element group
subclass of: SP System class
subclass of: Resource
subclass of: Thing
type: Class
comment: A SERVICE call that matches a nested sub-pattern against a SPARQL end point specified by a URI.

arg5
sub property of: topObjectProperty
sub property of: arg
property disjoint with: bottomObjectProperty
type: ObjectProperty
type: Property
comment: The fifth argument of a function call. Further arguments are not common in SPARQL, therefore no sp:arg6, etc are defined here. However, they can be created if needed.

Exists
disjoint with: Nothing
subclass of: Element
subclass of: Element group
subclass of: SP System class
subclass of: Resource
subclass of: Thing
type: Class
comment: An EXISTS element group.

reduced
sub property of: topDataProperty
property disjoint with: group by
property disjoint with: separator
property disjoint with: graph name node
property disjoint with: into
sub property of: SP system property
property disjoint with: text
property disjoint with: varName
property disjoint with: service URI
property disjoint with: from
property disjoint with: offset
property disjoint with: mod min
type: DatatypeProperty
property disjoint with: with
property disjoint with: limit
property disjoint with: from named
property disjoint with: bottomDataProperty
property disjoint with: mod max
property disjoint with: graph IRI
type: Property
range: boolean
domain: Select query
comment: A property with true to indicate that a Select query has a REDUCED flag.

Path
disjoint with: Nothing
subclass of: SP System class
subclass of: Resource
subclass of: Thing
type: Class
comment: The base class of SPARQL property path expressions. Paths are used by sp:TriplePath triple paths.

used
type: ObjectProperty
property disjoint with: bottomObjectProperty
property disjoint with: accessed
sub property of: used
property disjoint with: serialized by
property disjoint with: involved exchange of
sub property of: topObjectProperty
comment: This property refers to a source data item that has been used during the creation of a data item. Examples for source data are the content of a document used for machine learning, the statements in a knowledge base used to entail a new statement, and the entries in a database used to answer a query. Notice, all source data has provenance; we strongly encourage to describe this provenance as well, at least as far as available information permits.
domain: Data Creation
range: Data Item

mod min
property disjoint with: graph name node
property disjoint with: silent
property disjoint with: from named
property disjoint with: distinct
property disjoint with: group by
property disjoint with: with
property disjoint with: varName
type: DatatypeProperty
property disjoint with: reduced
property disjoint with: bottomDataProperty
property disjoint with: separator
sub property of: SP system property
property disjoint with: into
property disjoint with: service URI
property disjoint with: graph IRI
property disjoint with: from
property disjoint with: named
sub property of: topDataProperty
property disjoint with: text
property disjoint with: all
property disjoint with: default
type: Property
range: integer
domain: Mod path

document
sub property of: topObjectProperty
property disjoint with: bottomObjectProperty
type: ObjectProperty
type: Property
sub property of: SP system property
range: Resource
domain: Load
comment: The URI of the document to load using a LOAD Update operation.

Optional
disjoint with: Nothing
subclass of: Element
subclass of: Element group
subclass of: SP System class
subclass of: Resource
subclass of: Thing
type: Class
comment: An optional element in a query.

http://lodlaundromat.org/.well-known/genid/samples/pellet///class//e761128019984814f28b30162a38df4a/d3e700bc1857a8001f8ca87e5b965b3a#2
type: Restriction
on property: accessed
max cardinality: 1

SPIN SPARQL Syntax
type: Ontology
version info: 1.5.0
comment: An RDF schema to syntactically represent SPARQL queries and update commands as RDF triples.

http://lodlaundromat.org/.well-known/genid/samples/pellet///class//e761128019984814f28b30162a38df4a/d3e700bc1857a8001f8ca87e5b965b3a#3
type: Restriction
on property: accessed
max cardinality: 1