The data catalog vocabulary
type: Ontology
type: Vocabulary
label: El vocabulario de catálogo de datos @es
label: أنطولوجية فهارس قوائم البيانات @ar
label: Το λεξιλόγιο των καταλόγων δεδομένων @el
label: Le vocabulaire des jeux de données @fr
label: データ・カタログ語彙（DCAT） @ja
comment: DCAT is an RDF vocabulary designed to facilitate interoperability between data catalogs published on the Web. By using DCAT to describe datasets in data catalogs, publishers increase discoverability and enable applications easily to consume metadata from multiple catalogs. It further enables decentralized publishing of catalogs and facilitates federated dataset search across sites. Aggregated DCAT metadata can serve as a manifest file to facilitate digital preservation. DCAT is defined at http://www.w3.org/TR/vocab-dcat/. Any variance between that normative document and this schema is an error in this schema.
comment: DCAT est un vocabulaire développé pour faciliter l'interopérabilité entre les jeux de données publiées sur le Web. En utilisant DCAT pour décrire les jeux de données dans les catalogues de données, les fournisseurs de données augmentent leur découverte et permettent que les applications facilement les métadonnées de plusieurs catalogues. Il permet en plus la publication décentralisée des catalogues et facilitent la recherche fédérée des données entre plusieurs sites. Les métadonnées DCAT aggrégées peuvent servir comme un manifeste pour faciliter la préservation digitale des ressources. DCAT est définie à l'adresse http://www.w3.org/TR/vocab-dcat/. Une quelconque version de ce document normatif et ce vocabulaire est une erreur dans ce vocabulaire @fr
comment: DCAT es un vocabulario RDF diseñado para facilitar la interoperabilidad entre catálogo de datos publicados en la Web. Gracias a utilizar DCAT para describir conjuntos de datos en los catálogo de datos, los editores aumentan el descubrimiento y permiten que las aplicaciones consuman fácilmente los metadatos de varios catálogos. @es
comment: هي أنطولوجية تسهل تبادل البيانات بين مختلف الفهارس على الوب. استخدام هذه الأنطولوجية يساعد على اكتشاف قوائم البيانات المنشورة على الوب و يمكن التطبيقات المختلفة من الاستفادة أتوماتيكيا من البيانات المتاحة من مختلف الفهارس. @ar
comment: Το DCAT είναι ένα RDF λεξιλόγιο που σχεδιάσθηκε για να κάνει εφικτή τη διαλειτουργικότητα μεταξύ καταλόγων δεδομένων στον Παγκόσμιο Ιστό. Χρησιμοποιώντας το DCAT για την περιγραφή συνόλων δεδομένων, οι εκδότες αυτών αυξάνουν την ανακαλυψιμότητα και επιτρέπουν στις εφαρμογές την εύκολη κατανάλωση μεταδεδομένων από πολλαπλούς καταλόγους. Επιπλέον, δίνει τη δυνατότητα για αποκεντρωμένη έκδοση και διάθεση καταλόγων και επιτρέπει δυνατότητες ενοποιημένης αναζήτησης μεταξύ διαφορετικών πηγών. Συγκεντρωτικά μεταδεδομένα που έχουν περιγραφεί με το DCAT μπορούν να χρησιμοποιηθούν σαν ένα δηλωτικό αρχείο (manifest file) ώστε να διευκολύνουν την ψηφιακή συντήρηση. @el
comment: DCATは、ウェブ上で公開されたデータ・カタログ間の相互運用性の促進を目的とするRDFの語彙です。このドキュメントでは、その利用のために、スキーマを定義し、例を提供します。 データ・カタログ内のデータセットを記述するためにDCATを用いると、公開者が、発見可能性を増加させ、アプリケーションが複数のカタログのメタデータを容易に利用できるようになります。さらに、カタログの分散公開を可能にし、複数のサイトにまたがるデータセットの統合検索を促進します。集約されたDCATメタデータは、ディジタル保存を促進するためのマニフェスト・ファイルとして使用できます。 @ja
creator: Fadi Maali
creator: John Erickson
contributor: Phil Archer
  affiliation: W3C
contributor: Richard Cyganiak
contributor: Vassilios Peristeras
  affiliation: European Commission, DG DIGIT
contributor: Rufus Pollock
  affiliation: Open Knowledge Foundation
contributor: Ghislain Auguste Atemezing
contributor: Boris Villazón-Terrazas
contributor: Marios Meimaris
contributor: Martin Alvarez-Espinar
contributor: Makx Dekkers
contributor: Shuji Kamitsuna
maker: Government Linked Data WG
modified: 2012-04-24
modified: 2013-09-20
modified: 2013-11-28

Catalog
type: Class
label: Catálogo @es
label: فهرس قوائم البيانات @ar
label: Catalogue @fr
label: Κατάλογος @el
label: カタログ @ja
comment: A curated collection of metadata about datasets
comment: مجموعة من توصيفات قوائم البيانات @ar
comment: Una colección conservada de metadatos de conjuntos de datos @es
comment: Μια επιμελημένη συλλογή μεταδεδομένων περί συνόλων δεδομένων @el
comment: Une collection élaborée de métadonnées sur les jeux de données @fr
comment: データ・カタログは、データセットに関するキュレートされたメタデータの集合です。 @ja
usage note: Συνήθως, ένας κατάλογος δεδομένων στον Παγκόσμιο Ιστό αναπαρίσταται ως ένα στιγμιότυπο αυτής της κλάσης. @el
usage note: Typically, a web-based data catalog is represented as a single instance of this class.
usage note: Normalmente, un catálogo de datos basado en web es representado como una sola instancia de esta clase. @es
usage note: 通常、ウェブ・ベースのデータ・カタログは、このクラスの1つのインスタンスとして表わされます。 @ja

theme taxonomy
type: Property
type: ObjectProperty
label: taxonomía de temas @es
label: قائمة التصنيفات @ar
label: Ταξινομία θεματικών κατηγοριών. @el
label: taxonomie de thèmes @fr
label: テーマ @ja
comment: The knowledge organization system (KOS) used to classify catalog's datasets.
comment: لائحة التصنيفات المستخدمه لتصنيف قوائم البيانات ضمن الفهرس @ar
comment: Le systhème d'ogranisation de connaissances utilisé pour classifier les jeux de données du catalogue. @fr
comment: El sistema de organización del conocimiento utilizado para clasificar conjuntos de datos de catálogos. @es
comment: Το σύστημα οργάνωσης γνώσης που χρησιμοποιείται για την κατηγοριοποίηση των συνόλων δεδομένων του καταλόγου. @el
comment: カタログのデータセットを分類するために用いられる知識組織化体系（KOS；knowledge organization system）。 @ja
domain: Catalog
range: ConceptScheme

dataset
type: Property
type: ObjectProperty
label: conjunto de datos @es
label: jeu de données @fr
label: قائمة بيانات @ar
label: データセット @ja
comment: Links a catalog to a dataset that is part of the catalog.
comment: تربط الفهرس بقائمة بيانات ضمنه @ar
comment: Relie un catalogue à un jeu de données faisant partie de ce catalogue @fr
comment: Enlaza un catálogo a un conjunto de datos que es parte de ese catálogo @es
label: σύνολο δεδομένων @el
comment: Συνδέει έναν κατάλογο με ένα σύνολο δεδομένων το οποίο ανήκει στον εν λόγω κατάλογο. @el
comment: カタログの一部であるデータセット。 @ja
sub property of: hasPart
domain: Catalog
range: Dataset

Dataset
type: Class
label: Conjunto de datos @es
label: Jeu de données @fr
label: قائمة بيانات @ar
label: Σύνολο Δεδομένων @el
label: データセット @ja
comment: A collection of data, published or curated by a single source, and available for access or download in one or more formats
comment: Una colección de datos, publicados o conservados por una única fuente, y disponibles para acceder o descagar en uno o más formatos @es
comment: قائمة بيانات منشورة أو مجموعة من قبل مصدر ما و متاح الوصول إليها أو تحميلها @ar
comment: Une collection de données, publiée ou élaborée par une seule source, et disponible pour accès ou téléchargement dans un ou plusieurs formats @fr
comment: Μία συλλογή από δεδομένα, δημοσιευμένη ή επιμελημένη από μία και μόνο πηγή, διαθέσιμη δε προς πρόσβαση ή μεταφόρτωση σε μία ή περισσότερες μορφές @el
comment: 1つのエージェントによって公開またはキュレートされ、1つ以上の形式でアクセスまたはダウンロードできるデータの集合。 @ja
subclass of: Dataset
usage note: This class represents the actual dataset as published by the dataset publisher. In cases where a distinction between the actual dataset and its entry in the catalog is necessary (because metadata such as modification date and maintainer might differ), the catalog record class can be used for the latter.
usage note: Esta clase representa el conjunto de datos publicado por el editor del conjunto de datos. En los casos donde es necesaria una distinción entre el conjunto de datos y su entrada en el catálogo de datos @es
usage note: Cette classe représente le jeu de données publié par le fournisseur de données. Dans les cas où une distinction est nécessaire entre le jeu de donénes et son entrée dans le catalogue, la classe registre de données peut être utilisée pour ce dernier. @fr
usage note: Η κλάση αυτή αναπαριστά το σύνολο δεδομένων αυτό καθ'εαυτό, όπως έχει δημοσιευθεί από τον εκδότη. Σε περιπτώσεις όπου είναι απαραίτητος ο διαχωρισμός μεταξύ του συνόλου δεδομένων και της καταγραφής αυτού στον κατάλογο (γιατί μεταδεδομένα όπως η ημερομηνία αλλαγής και ο συντηρητής μπορεί να διαφέρουν) η κλάση της καταγραφής καταλόγου μπορεί να χρησιμοποιηθεί για το τελευταίο. @el
usage note: このクラスは、データセットの公開者が公開する実際のデータセットを表わします。カタログ内の実際のデータセットとそのエントリーとの区別が必要な場合（修正日と維持者などのメタデータが異なるかもしれないので）は、後者にcatalog recordというクラスを使用できます。 @ja

record
type: Property
type: ObjectProperty
label: registro @es
label: سجل @ar
label: registre @fr
label: καταγραφή @el
label: カタログ・レコード @ja
comment: Links a catalog to its records.
comment: تربط الفهرس بسجل ضمنه @ar
comment: カタログの一部であるカタログ・レコード。 @ja
comment: Enlaza un catálogo a sus registros. @es
comment: Relie un catalogue à ses registres @fr
comment: Συνδέει έναν κατάλογο με τις καταγραφές του. @el
domain: Catalog
range: Catalog Record

Catalog Record
type: Class
label: Registro de catálogo @es
label: Registre du catalogue @fr
label: سجل @ar
label: Καταγραφή καταλόγου @el
label: カタログ・レコード @ja
comment: A record in a data catalog, describing a single dataset.
comment: Un registre du catalogue ou une entrée du catalogue, décrivant un seul jeu de données @fr
comment: Un registro en un catálogo de datos que describe un solo conjunto de datos. @es
comment: Μία καταγραφή ενός καταλόγου, η οποία περιγράφει ένα συγκεκριμένο σύνολο δεδομένων. @el
comment: 1つのデータセットを記述したデータ・カタログ内のレコード。 @ja
usage note: This class is optional and not all catalogs will use it. It exists for catalogs where a distinction is made between metadata about a dataset and metadata about the dataset's entry in the catalog. For example, the publication date property of the dataset reflects the date when the information was originally made available by the publishing agency, while the publication date of the catalog record is the date when the dataset was added to the catalog. In cases where both dates differ, or where only the latter is known, the publication date should only be specified for the catalog record. Notice that the W3C PROV Ontology allows describing further provenance information such as the details of the process and the agent involved in a particular change to a dataset.
usage note: Esta clase es opcional y no todos los catálogos la utilizarán. Esta clase existe para catálogos que hacen una distinción entre los metadatos acerca de un conjunto de datos y los metadatos acerca de una entrada en ese conjunto de datos en el catálogo. @es
usage note: Αυτή η κλάση είναι προαιρετική και δεν χρησιμοποιείται από όλους τους καταλόγους. Υπάρχει για τις περιπτώσεις καταλόγων όπου γίνεται διαχωρισμός μεταξύ των μεταδεδομένων για το σύνολο των δεδομένων και των μεταδεδομένων για την καταγραφή του συνόλου δεδομένων εντός του καταλόγου. Για παράδειγμα, η ιδιότητα της ημερομηνίας δημοσίευσης του συνόλου δεδομένων δείχνει την ημερομηνία κατά την οποία οι πληροφορίες έγιναν διαθέσιμες από τον φορέα δημοσίευσης, ενώ η ημερομηνία δημοσίευσης της καταγραφής του καταλόγου δείχνει την ημερομηνία που το σύνολο δεδομένων προστέθηκε στον κατάλογο. Σε περιπτώσεις που οι δύο ημερομηνίες διαφέρουν, ή που μόνο η τελευταία είναι γνωστή, η ημερομηνία δημοσίευσης θα πρέπει να δίνεται για την καταγραφή του καταλόγου. Να σημειωθεί πως η οντολογία W3C PROV επιτρέπει την περιγραφή επιπλέον πληροφοριών ιστορικού όπως λεπτομέρειες για τη διαδικασία και τον δράστη που εμπλέκονται σε μία συγκεκριμένη αλλαγή εντός του συνόλου δεδομένων. @el
usage note: C'est une classe facultative et tous les catalogues ne l'utiliseront pas. Cette classe existe pour les catalogues ayant une distinction entre les métadonnées sur le jeu de données et les métadonnées sur une entrée du jeu de données dans le catalogue. @fr
usage note: このクラスはオプションで、すべてのカタログがそれを用いるとは限りません。これは、データセットに関するメタデータとカタログ内のデータセットのエントリーに関するメタデータとで区別が行われるカタログのために存在しています。例えば、データセットの公開日プロパティーは、公開機関が情報を最初に利用可能とした日付を示しますが、カタログ・レコードの公開日は、データセットがカタログに追加された日付です。両方の日付が異っていたり、後者だけが分かっている場合は、カタログ・レコードに対してのみ公開日を指定すべきです。W3CのPROVオントロジー[prov-o]を用いれば、データセットに対する特定の変更に関連するプロセスやエージェントの詳細などの、さらに詳しい来歴情報の記述が可能となることに注意してください。 @ja

theme
type: Property
type: ObjectProperty
label: tema @es
label: التصنيف @ar
label: Θέμα @el
label: thème @fr
label: テーマ/カテゴリー @ja
comment: The main category of the dataset. A dataset can have multiple themes.
comment: La categoría principal del conjunto de datos. Un conjunto de datos puede tener varios temas. @es
comment: La catégorie principale du jeu de données. Un jeu de données peut avoir plusieurs thèmes. @fr
comment: التصنيف الرئيسي لقائمة البيانات. قائمة البيانات يمكن أن تملك أكثر من تصنيف رئيسي واحد. @ar
comment: Η κύρια κατηγορία του συνόλου δεδομένων. Ένα σύνολο δεδομένων δύναται να έχει πολλαπλά θέματα. @el
comment: データセットの主要カテゴリー。データセットは複数のテーマを持つことができます。 @ja
domain: Dataset
range: Concept
sub property of: subject
usage note: The set of skos:Concepts used to categorize the datasets are organized in a skos:ConceptScheme describing all the categories and their relations in the catalog.
usage note: El conjunto de skos:Concepts utilizados para categorizar el conjunto de datos están organizados en un skos:ConceptScheme que describe todas las categorías y sus relaciones en el catálogo @es
usage note: Το σετ των skos:Concepts που χρησιμοποιείται για να κατηγοριοποιήσει τα σύνολα δεδομένων είναι οργανωμένο εντός ενός skos:ConceptScheme που περιγράφει όλες τις κατηγορίες και τις σχέσεις αυτών στον κατάλογο. @el
usage note: Un ensemble de skos:Concepts utilisés pour catégoriser un jeu de données sont organisés en un skos:ConceptScheme décrivqnt toutes les catégories et ses relations dans le catalogue. @fr
usage note: データセットを分類するために用いられるskos:Conceptの集合は、カタログのすべてのカテゴリーとそれらの関係を記述しているskos:ConceptSchemeで組織化されます。 @ja

keyword
type: Property
type: DatatypeProperty
label: palabra clave @es
label: كلمة مفتاحية @ar
label: mot-clés @fr
label: λέξη-κλειδί @el
label: キーワード/タグ @ja
comment: A keyword or tag describing the dataset.
comment: Μία λέξη-κλειδί ή μία ετικέτα που περιγράφει το σύνολο δεδομένων. @el
comment: Una palabra clave o etiqueta que describa al conjunto de datos. @es
comment: Un mot-clé ou étiquette décrivant un jeu de donnnées. @fr
comment: كلمة مفتاحيه توصف قائمة البيانات @ar
comment: データセットを記述しているキーワードまたはタグ。 @ja
domain: Dataset
range: Literal
sub property of: subject

contact point
type: Property
type: ObjectProperty
label: punto de contacto @es
label: عنوان اتصال @ar
label: point de contact @fr
label: σημείο επικοινωνίας @el
label: 窓口 @ja
comment: Links a dataset to relevant contact information which is provided using VCard.
comment: Relie un jeu de données à une information de contact utile en utilisant VCard. @fr
comment: Συνδέει ένα σύνολο δεδομένων με ένα σχετικό σημείο επικοινωνίας, μέσω VCard. @el
comment: Enlaza un conjunto de datos a información de contacto relevante utilizando VCard @es
comment: تربط قائمة البيانات بعنوان اتصال موصف باستخدام VCard @ar
comment: データセットを、VCardを用いて提供されている適切な連絡先情報にリンクします。 @ja
domain: Dataset
range: Kind

distribution
type: Property
type: ObjectProperty
label: distribución @es
label: توزيع @ar
label: διανομή @el
label: データセット配信 @ja
comment: Connects a dataset to one of its available distributions.
comment: Connecte un jeu de données à des distributions disponibles. @fr
comment: Συνδέει ένα σύνολο δεδομένων με μία από τις διαθέσιμες διανομές του. @el
comment: Conecta un conjunto de datos a una de sus distribuciones disponibles @es
comment: تربط قائمة البيانات بطريقة أو بشكل يسمح الوصول الى البيانات @ar
comment: データセットを、その利用可能な配信に接続します。 @ja
domain: Dataset
range: Distribution

Distribution
type: Class
label: Distribución @es
label: التوزيع @ar
label: Διανομή @el
label: 配信 @ja
comment: Represents a specific available form of a dataset. Each dataset might be available in different forms, these forms might represent different formats of the dataset or different endpoints. Examples of distributions include a downloadable CSV file, an API or an RSS feed
comment: Representa una forma disponible y específica a un conjunto de datos. Cada conjunto de datos puede estar disponible en formas diferentes, estas formas pueden representar formatos diferentes del conjunto de datos o puntos de acceso diferentes. @es
comment: شكل محدد لقائمة البيانات يمكن الوصول إليه. قائمة بيانات ما يمكن أن تكون متاحه باشكال و أنواع متعددة. ملف يمكن تحميله أو واجهة برمجية يمكن من خلالها الوصول إلى البيانات هي أمثلة على ذلك. @ar
comment: Αναπαριστά μία συγκεκριμένη διαθέσιμη μορφή ενός συνόλου δεδομένων. Κάθε σύνολο δεδομενων μπορεί να είναι διαθέσιμο σε διαφορετικές μορφές, οι μορφές αυτές μπορεί να αναπαριστούν διαφορετικές μορφές αρχείων ή διαφορετικά σημεία διάθεσης. Παραδείγματα διανομών συμπεριλαμβάνουν ένα μεταφορτώσιμο αρχείο μορφής CSV, ένα API ή ένα RSS feed. @el
comment: Représente une forme spécifique d'un jeu de données. Caque jeu de données peut être disponible sous différentes formes, celles-ci pouvant représenter différents formats du jeu de données ou différents endpoint. Des exemples de distribution sont des fichirs CSV, des API ou des flux RSS. @fr
comment: データセットの特定の利用可能な形式を表わします。各データセットは、異なる形式で利用できることがあり、これらの形式は、データセットの異なる形式や、異なるエンドポイントを表わす可能性があります。配信の例には、ダウンロード可能なCSVファイル、API、RSSフィードが含まれます。 @ja
usage note: This represents a general availability of a dataset it implies no information about the actual access method of the data, i.e. whether it is a direct download, API, or some through Web page. The use of dcat:downloadURL property indicates directly downloadable distributions.
usage note: Ceci représente une disponibilité générale du jeu de données, et implique qu'il n'existe pas d'information sur la méthode d'accès réelle des données, par exple, si c'est un lien de téléchargement direct ou à travers une page Web. @fr
usage note: Αυτό αναπαριστά μία γενική διαθεσιμότητα ενός συνόλου δεδομένων και δεν υπονοεί τίποτα περί του πραγματικού τρόπου πρόσβασης στα δεδομένα, αν είναι άμεσα μεταφορτώσιμα, μέσω API ή μέσω μίας ιστοσελίδας. Η χρήση της ιδιότητας dcat:downloadURL δείχνει μόνο άμεσα μεταφορτώσιμες διανομές. @el
usage note: Esto representa una disponibilidad general de un conjunto de datos, e implica que no existe información acerca del método de acceso real a los datos, i.e., si es un enlace de descarga directa o a través de una página Web. @es
usage note: これは、データセットの一般的な利用可能性を表わし、データの実際のアクセス方式に関する情報（つまり、直接ダウンロードなのか、APIなのか、ウェブページを介したものなのか）を意味しません。dcat:downloadURLプロパティーの使用は、直接ダウンロード可能な配信を意味します。 @ja

landing page
type: Property
type: ObjectProperty
label: página de aterrizaje @es
label: صفحة وصول @ar
label: ιστοσελίδα αρχικής πρόσβασης @el
label: page d'atterrissage @fr
label: ランディング・ページ @ja
comment: A Web page that can be navigated to in a Web browser to gain access to the dataset, its distributions and/or additional information.
comment: Une page Web accessible par un navigateur Web donnant accès au jeu de données, ses distributions et/ou des informations additionnelles. @fr
comment: Una página Web que puede ser visitada en un explorador Web para tener acceso al conjunto de datos, sus distribuciones y/o información adicional @es
comment: صفحة وب يمكن من خلالها الوصول الى قائمة البيانات أو إلى معلومات إضافية متعلقة بها @ar
comment: Μία ιστοσελίδα πλοηγίσιμη μέσω ενός φυλλομετρητή (Web browser) που δίνει πρόσβαση στο σύνολο δεδομένων, τις διανομές αυτού ή/και επιπρόσθετες πληροφορίες. @el
comment: データセット、その配信および（または）追加情報にアクセスするためにウエブ・ブラウザでナビゲートできるウェブページ。 @ja
sub property of: Page
domain: Dataset
range: Document
usage note: If the distribution(s) are accessible only through a landing page (i.e. direct download URLs are not known), then the landing page link should be duplicated as accessURL on a distribution.
usage note: Αν η/οι διανομή/ές είναι προσβάσιμη/ες μόνο μέσω μίας ιστοσελίδας αρχικής πρόσβασης (δηλαδή αν δεν υπάρχουν γνωστές διευθύνσεις άμεσης μεταφόρτωσης), τότε ο σύνδεσμος της ιστοσελίδας αρχικής πρόσβασης πρέπει να αναπαραχθεί ως accessURL σε μία διανομή. @el
usage note: Si la distribución es accesible solamente través de una página de aterrizaje (i.e., no se conoce una URL de descarga directa), entonces el enlance a la página de aterrizaje debe ser duplicado como accessURL sobre la distribución. @es
usage note: Si la distribution est seulement accessible à travers une page d'atterrissage (exple. pas de connaissance d'URLS de téléchargement direct ), alors le lien de la page d'atterrissage doit être dupliqué comme accessURL sur la distribution. @fr
usage note: ランディング・ページを通じてしか配信にアクセスできない場合（つまり、直接的なダウンロードURLが不明）には、配信におけるaccessURLとしてランディング・ページのリンクをコピーすべきです（SHOULD）。 @ja

access URL
type: Property
type: ObjectProperty
label: URL de acceso @es
label: URL d'accès @fr
label: رابط وصول @ar
label: URL πρόσβασης @el
label: アクセスURL @ja
domain: Distribution
range: Resource
comment: Could be any kind of URL that gives access to a distribution of the dataset. E.g. landing page, download, feed URL, SPARQL endpoint. Use when your catalog does not have information on which it is or when it is definitely not a download.
comment: Ceci peut être tout type d'URL qui donne accès à une distribution du jeu de données. Par exemple, un lien à une page HTML contenant un lien au jeu de données, un Flux RSS, un point d'accès SPARQL. Utilisez le lorsque votre catalogue ne contient pas d'information sur quoi il est ou quand ce n'est pas téléchargeable. @fr
comment: Μπορεί να είναι οποιουδήποτε είδους URL που δίνει πρόσβαση στη διανομή ενός συνόλου δεδομένων. Π.χ. ιστοσελίδα αρχικής πρόσβασης, μεταφόρτωση, feed URL, σημείο διάθεσης SPARQL. Να χρησιμοποιείται όταν ο κατάλογος δεν περιέχει πληροφορίες εαν πρόκειται ή όχι για μεταφορτώσιμο αρχείο. @el
comment: Puede ser cualquier tipo de URL que de acceso a una distribución del conjunto de datos, e.g., página de aterrizaje, descarga, URL feed, punto de acceso SPARQL. Utilizado cuando su catálogo de datos no tiene información sobre donde está o cuando no se puede descargar @es
comment: أي رابط يتيح الوصول إلى البيانات. إذا كان الرابط هو ربط مباشر لملف يمكن تحميله استخدم الخاصية downloadURL @ar
comment: データセットの配信にアクセス権を与えるランディング・ページ、フィード、SPARQLエンドポイント、その他の種類の資源。 @ja
usage note: The value is a URL. If the distribution(s) are accessible only through a landing page (i.e. direct download URLs are not known), then the landing page link should be duplicated as accessURL on a distribution.
usage note: El valor es una URL. Si la distribución es accesible solamente través de una página de aterrizaje (i.e., no se conoce una URL de descarga directa), entonces el enlance a la página de aterrizaje debe ser duplicado como accessURL sobre la distribución. @es
usage note: La valeur est une URL. Si la distribution est accessible seulement au travers d'une page d'atterrissage (c-à-dire on n'ignore une URL de téléchargement direct) , alors le lien à la page d'atterrissage doit être dupliqué comee accessURL sur la distribution. @fr
usage note: Η τιμή είναι ένα URL. Αν η/οι διανομή/ές είναι προσβάσιμη/ες μόνο μέσω μίας ιστοσελίδας αρχικής πρόσβασης (δηλαδή αν δεν υπάρχουν γνωστές διευθύνσεις άμεσης μεταφόρτωσης), τότε ο σύνδεσμος της ιστοσελίδας αρχικής πρόσβασης πρέπει να αναπαραχθεί ως accessURL σε μία διανομή. @el
usage note: 確実にダウンロードでない場合や、ダウンロードかどうかが不明である場合は、downloadURLではなく、accessURLを用いてください。 ランディング・ページを通じてしか配信にアクセスできない場合（つまり、直接的なダウンロードURLが不明）は、配信におけるaccessURLとしてランディング・ページのリンクをコピーすべきです（SHOULD）。 @ja

download URL
type: Property
type: ObjectProperty
label: URL de descarga @es
label: URL de téléchargement @fr
label: رابط تحميل @ar
label: URL μεταφόρτωσης @el
label: ダウンロードURL @ja
domain: Distribution
range: Resource
comment: This is a direct link to a downloadable file in a given format. E.g. CSV file or RDF file. The format is described by the distribution's dc:format and/or dcat:mediaType
comment: Este es un enlace directo a un fichero descargable en un formato dado, e.g., fichero CSV o RDF. El formato es descrito por las propiedades de la distribución dc:format y/o dcat:mediaType @es
comment: Ceci est un lien direct à un fichier téléchargeable en un format donnée. Exple fichier CSV ou RDF. Le format est décrit par les propriétés de distribution dc:format et/ou dcat:mediaType @fr
comment: Είναι ένας σύνδεσμος άμεσης μεταφόρτωσης ενός αρχείου σε μια δεδομένη μορφή. Π.χ. ένα αρχείο CSV ή RDF. Η μορφη αρχείου περιγράφεται από τις ιδιότητες dc:format ή/και dcat:mediaType της διανομής @el
comment: رابط مباشر لملف يمكن تحميله. نوع الملف يتم توصيفه باستخدام الخاصية dc:format dcat:mediaType @ar
comment: dcat:downloadURLはdcat:accessURLの特定の形式です。しかし、DCATプロファイルが非ダウンロード・ロケーションに対してのみaccessURLを用いる場合には、より強い分離を課すことを望む可能性があるため、この含意を強化しないように、DCATは、dcat:downloadURLをdcat:accessURLのサブプロパティーであると定義しません。 @ja
usage note: The value is a URL.
usage note: TEl valor es una URL. @es
usage note: La valeur est une URL. @fr
usage note: Η τιμή είναι ένα URL. @el

byte size
type: Property
type: DatatypeProperty
label: tamaño en bytes @es
label: الحجم بالبايت @ar
label: μέγεθος σε bytes @el
label: taille en octects @fr
label: バイト・サイズ @ja
comment: The size of a distribution in bytes.
comment: La taille de la distribution en octects @fr
comment: El tamaño de una distribución en bytes @es
comment: الحجم بالبايتات @ar
comment: Το μέγεθος μιας διανομής σε bytes. @el
comment: バイトによる配信のサイズ。 @ja
domain: Distribution
range: Literal
usage note: The size in bytes can be approximated when the precise size is not known. The literal value of dcat:byteSize should by typed as xsd:decimal
usage note: El tamaño en bytes puede ser aproximado cuando no es conocido el tamaño exacto. El valor literal de dcat:byteSize debe ser tipado como xsd:decimal @es
usage note: La taille en octects peut être approximative lorsque l'on ignore la taille réelle. La valeur littérale de dcat:byteSize doit être de type xsd:decimal @fr
usage note: الحجم يمكن أن يكون تقريبي إذا كان الحجم الدقيق غير معروف @ar
usage note: Το μέγεθος σε bytes μπορεί να προσεγγιστεί όταν η ακριβής τιμή δεν είναι γνωστή. Η τιμή της dcat:byteSize θα πρέπει να δίνεται με τύπο δεδομένων xsd:decimal @el
usage note: 正確なサイズが不明である場合、サイズは、バイトによる近似値を示すことができます。 @ja

media type
type: Property
type: ObjectProperty
label: tipo de media @es
label: type de média @fr
label: نوع الميديا @ar
label: τύπος μέσου @el
label: メディア・タイプ @ja
domain: Distribution
range: MediaTypeOrExtent
sub property of: format
comment: This property SHOULD be used when the media type of the distribution is defined in IANA, otherwise dct:format MAY be used with different values.
comment: Esta propiedad debe ser usada cuando está definido el tipo de media de la distribución en IANA, de otra manera dct:format puede ser utilizado con diferentes valores @es
comment: يجب استخدام هذه الخاصية إذا كان نوع الملف معرف ضمن IANA @ar
comment: Cette propriété doit être utilisée quand c'est définit le type de média de la distribution en IANA, sinon dct:format DOIT être utilisé avec différentes valeurs. @fr
comment: Η ιδιότητα αυτή ΘΑ ΠΡΕΠΕΙ να χρησιμοποιείται όταν ο τύπος μέσου μίας διανομής είναι ορισμένος στο IANA, αλλιώς η ιδιότητα dct:format ΔΥΝΑΤΑΙ να χρησιμοποιηθεί με διαφορετικές τιμές. @el
comment: このプロパティーは、配信のメディア・タイプがIANAで定義されているときに使用すべきで（SHOULD）、そうでない場合には、dct:formatを様々な値と共に使用できます（MAY）。 @ja

Feed (Deprecated)
type: Class
comment: represents availability of a dataset as a feed. This term has been deprecated
deprecated: true
subclass of: Distribution

Web Service (Deprecated)
type: Class
comment: represents a web service that enables access to the data of a dataset. This term has been deprecated
deprecated: true
subclass of: Distribution

Download (Deprecated)
type: Class
comment: represents a downloadable distribution of a dataset. This term has been deprecated
deprecated: true
subclass of: Distribution

data quality (Deprecated)
type: Property
comment: describes the quality of data e.g. precision. This should not be used to describe the data collection characteristics, other more specialized statistical properties can be used instead. This term has been deprecated
deprecated: true
domain: Dataset

data dictionary (Deprecated)
type: Property
comment: links a dataset to a dictionary that helps interpreting the data. This term has been deprecated
deprecated: true
domain: Dataset

granularity (Deprecated)
type: Property
comment: describes the level of granularity of data in a dataset. The granularity can be in time, place etc. This term has been deprecated
deprecated: true
domain: Dataset

size (Deprecated)
type: Property
comment: the size of a distribution. This term has been deprecated
domain: Distribution
deprecated: true
sub property of: extent

size in bytes (Deprecated)
type: Property
type: DatatypeProperty
comment: describe size of resource in bytes. This term has been deprecated
domain: Distribution
deprecated: true
range: integer