http://lodlaundromat.org/.well-known/genid/samples/pellet///class//dc761509450b163119975e1b794c97ac/76a61fdafb1c5f7b6412a1106925b84d#1
on property: hasCity
type: Restriction
max cardinality: 1

Student
disjoint with: Guest
disjoint with: Employee
type: Class
subclass of: Affiliate
comment: The role of one studying at an educational organisation.

Interest
disjoint with: Module
disjoint with: ContactMethod
disjoint with: YearOfStudy
disjoint with: Degree
disjoint with: Agent
disjoint with: Document
disjoint with: Cohort
disjoint with: Location
comment: A topic of interest.
type: Class

http://lodlaundromat.org/.well-known/genid/samples/pellet///class//dc761509450b163119975e1b794c97ac/76a61fdafb1c5f7b6412a1106925b84d#7
max cardinality: 1
type: Restriction
on property: hasCountry

Session
comment: An academic year.
type: Class
subclass of: ProperInterval

AddressLocation
disjoint with: PhysicalLocation
disjoint with: ContactPage
subclass of: http://lodlaundromat.org/.well-known/genid/samples/pellet///class//dc761509450b163119975e1b794c97ac/76a61fdafb1c5f7b6412a1106925b84d#7
subclass of: http://lodlaundromat.org/.well-known/genid/samples/pellet///class//dc761509450b163119975e1b794c97ac/76a61fdafb1c5f7b6412a1106925b84d#1
disjoint with: Telephone
comment: A location which is identified by a postal address; may be associated with physical locations which correspond to components of the postal address.
subclass of: Location
type: Class
subclass of: http://lodlaundromat.org/.well-known/genid/samples/pellet///class//dc761509450b163119975e1b794c97ac/76a61fdafb1c5f7b6412a1106925b84d#8
disjoint with: EmailAddress
disjoint with: Fax
subclass of: http://lodlaundromat.org/.well-known/genid/samples/pellet///class//dc761509450b163119975e1b794c97ac/76a61fdafb1c5f7b6412a1106925b84d#9

University
type: Class
comment: An organisation whose primary focus is higher education.
subclass of: Educational Organisation

http://lodlaundromat.org/.well-known/genid/samples/pellet///class//dc761509450b163119975e1b794c97ac/76a61fdafb1c5f7b6412a1106925b84d#10
on property: ofSession
type: Restriction
cardinality: 1

Postgraduate-Integrated
type: Class
subclass of: Postgraduate
comment: The role of one studying for a higher degree which requires both research and some taught component.
disjoint with: Postgraduate-Instructional
disjoint with: Postgraduate-Research

GeopoliticalEntity
type: Class
subclass of: PhysicalLocation
disjoint with: Building
disjoint with: Room
comment: A geographical area associated with some political or governmental organisation.

Seminar
comment: A meeting associated with an organisation or organisation unit.
disjoint with: Project
disjoint with: Presentation
subclass of: Event
type: Class

City
comment: A municipal geographical region.
disjoint with: Country
disjoint with: AdministrativeRegion
type: Class
subclass of: GeopoliticalEntity

ContactMethod
disjoint with: Agent
disjoint with: Publication
disjoint with: Interest
disjoint with: Degree
comment: A method of contacting an agent.
type: Class
disjoint with: Module
disjoint with: Cohort
disjoint with: Location
disjoint with: YearOfStudy

http://lodlaundromat.org/.well-known/genid/samples/pellet///class//dc761509450b163119975e1b794c97ac/76a61fdafb1c5f7b6412a1106925b84d#13
type: Restriction
cardinality: 1
on property: onDegree

ResearchTheme
comment: A topic of interest that has been identified as a research theme.
subclass of: Interest
type: Class

Room
comment: An enclosed space within a building.
subclass of: PhysicalLocation
subclass of: http://lodlaundromat.org/.well-known/genid/samples/pellet///class//dc761509450b163119975e1b794c97ac/76a61fdafb1c5f7b6412a1106925b84d#14
disjoint with: GeopoliticalEntity
disjoint with: Building
type: Class

Role
comment: A role performed by a person, possibly one of many.
disjoint with: Person
subclass of: Individual
type: Class

NonProfitOrganisation
disjoint with: Educational Organisation
disjoint with: Commercial Organisation
disjoint with: GovernmentalOrganisation
comment: A charity or other not-for-profit organisation.
subclass of: Organisation
type: Class

PostgraduateCohort
comment: A cohort of postgraduate students.
type: Class
equivalent class: http://lodlaundromat.org/.well-known/genid/samples/pellet///class//dc761509450b163119975e1b794c97ac/76a61fdafb1c5f7b6412a1106925b84d#18

DPhil
type: Class
comment: Doctor of Philosophy. Equivalent to a PhD.
subclass of: Postgraduate-Research-Degree
disjoint with: EngD
disjoint with: MPhil
disjoint with: PhD

http://lodlaundromat.org/.well-known/genid/samples/pellet///class//dc761509450b163119975e1b794c97ac/76a61fdafb1c5f7b6412a1106925b84d#19
rest: http://lodlaundromat.org/.well-known/genid/samples/pellet///class//dc761509450b163119975e1b794c97ac/76a61fdafb1c5f7b6412a1106925b84d#20
first: Part III

Postgraduate-Research
subclass of: Postgraduate
comment: The role of one studying for a higher degree by research.
disjoint with: Postgraduate-Instructional
disjoint with: Postgraduate-Integrated
type: Class

Cohort
disjoint with: Document
disjoint with: Interest
subclass of: Group
type: Class
subclass of: http://lodlaundromat.org/.well-known/genid/samples/pellet///class//dc761509450b163119975e1b794c97ac/76a61fdafb1c5f7b6412a1106925b84d#21
disjoint with: Location
disjoint with: Degree
disjoint with: ContactMethod
disjoint with: Module
subclass of: http://lodlaundromat.org/.well-known/genid/samples/pellet///class//dc761509450b163119975e1b794c97ac/76a61fdafb1c5f7b6412a1106925b84d#22
disjoint with: YearOfStudy
comment: An abstract group of students who are studying on the same course, at the same institution and who are at the same point in their studies.

hasAssignments
comment: not sure about this
range: string
type: DatatypeProperty
domain: ModuleInSession

http://lodlaundromat.org/.well-known/genid/samples/pellet///class//dc761509450b163119975e1b794c97ac/76a61fdafb1c5f7b6412a1106925b84d#24
rest: nil
first: 5

Publication
type: Class
comment: A published document.
subclass of: Document
disjoint with: ContactMethod
disjoint with: ContactPage

Affiliate
comment: The role of affiliation to an organisation.
type: Class
subclass of: Role

Group
type: Class
subclass of: Agent
comment: A group of individual agents.
disjoint with: Individual

http://lodlaundromat.org/.well-known/genid/samples/pellet///class//dc761509450b163119975e1b794c97ac/76a61fdafb1c5f7b6412a1106925b84d#30
rest: http://lodlaundromat.org/.well-known/genid/samples/pellet///class//dc761509450b163119975e1b794c97ac/76a61fdafb1c5f7b6412a1106925b84d#24
first: 4

http://lodlaundromat.org/.well-known/genid/samples/pellet///class//dc761509450b163119975e1b794c97ac/76a61fdafb1c5f7b6412a1106925b84d#14
type: Restriction
cardinality: 1
on property: inBuilding

http://lodlaundromat.org/.well-known/genid/samples/pellet///class//dc761509450b163119975e1b794c97ac/76a61fdafb1c5f7b6412a1106925b84d#32
rest: http://lodlaundromat.org/.well-known/genid/samples/pellet///class//dc761509450b163119975e1b794c97ac/76a61fdafb1c5f7b6412a1106925b84d#33
first: 2

http://lodlaundromat.org/.well-known/genid/samples/pellet///class//dc761509450b163119975e1b794c97ac/76a61fdafb1c5f7b6412a1106925b84d#28
first: 1
rest: http://lodlaundromat.org/.well-known/genid/samples/pellet///class//dc761509450b163119975e1b794c97ac/76a61fdafb1c5f7b6412a1106925b84d#35

EmailAddress
comment: A mailto: URI which may be used to contact an agent.
disjoint with: ContactPage
disjoint with: Fax
disjoint with: Telephone
disjoint with: AddressLocation
type: Class
subclass of: ContactMethod

http://lodlaundromat.org/.well-known/genid/samples/pellet///class//dc761509450b163119975e1b794c97ac/76a61fdafb1c5f7b6412a1106925b84d#22
on property: onDegree
type: Restriction
cardinality: 1

UndergraduateCohort
equivalent class: http://lodlaundromat.org/.well-known/genid/samples/pellet///class//dc761509450b163119975e1b794c97ac/76a61fdafb1c5f7b6412a1106925b84d#39
type: Class
comment: A cohort of undergraduate students.

Building
comment: A built structure, possibly intended for occupation by people.
disjoint with: Room
disjoint with: GeopoliticalEntity
type: Class
subclass of: PhysicalLocation

Undergraduate
disjoint with: Postgraduate
type: Class
subclass of: Student
comment: The role of one studying for a

http://lodlaundromat.org/.well-known/genid/samples/pellet///class//dc761509450b163119975e1b794c97ac/76a61fdafb1c5f7b6412a1106925b84d#40
cardinality: 1
on property: onDegree
type: Restriction

YearOfStudy
disjoint with: Interest
type: Class
disjoint with: Location
disjoint with: Document
disjoint with: ContactMethod
disjoint with: Module
comment: A year within a degree programme.
disjoint with: Degree
disjoint with: Cohort
disjoint with: Agent

Postgraduate
subclass of: Student
disjoint with: Undergraduate
comment: The role of one studying for a higher degree.
type: Class

Semester
type: Class
comment: A division of an academic year associated with teaching.
subclass of: ProperInterval
subclass of: http://lodlaundromat.org/.well-known/genid/samples/pellet///class//dc761509450b163119975e1b794c97ac/76a61fdafb1c5f7b6412a1106925b84d#10

MSc
subclass of: Postgraduate-Taught-Degree
disjoint with: MA
type: Class
comment: Master of Science.

http://lodlaundromat.org/.well-known/genid/samples/pellet///class//dc761509450b163119975e1b794c97ac/76a61fdafb1c5f7b6412a1106925b84d#43
on property: hasSession
type: Restriction
cardinality: 1

BSc
disjoint with: MEng
disjoint with: BEng
disjoint with: BA
type: Class
subclass of: Undergraduate-Degree
comment: Batchelor of Science.

OrganisationUnit
disjoint with: Organisation
disjoint with: Project
disjoint with: Cohort in Session
type: Class
subclass of: Group
comment: A group of individuals that forms part of an organisation, but which is not recognised as a legal entity in its own right.

ECS Ontology
type: Ontology
imports: time
comment: The ECS Ontology

ModuleInSession
type: Class
comment: A module of tuition on a degree programme, as taught in a particular academic session.
subclass of: Module

ContactPage
type: Class
disjoint with: EmailAddress
disjoint with: Telephone
disjoint with: Fax
disjoint with: AddressLocation
disjoint with: Publication
comment: A webpage which contains contact information for an agent.
subclass of: ContactMethod
subclass of: Document

Fax
comment: A fax: URI which may be used to contact an agent.
type: Class
subclass of: ContactMethod
disjoint with: AddressLocation
disjoint with: ContactPage
disjoint with: EmailAddress
disjoint with: Telephone

Individual
comment: An individual agent.
subclass of: Agent
disjoint with: Group
type: Class

Commercial Organisation
subclass of: Organisation
comment: A for-profit organisation.
type: Class
disjoint with: Educational Organisation
disjoint with: GovernmentalOrganisation
disjoint with: NonProfitOrganisation

Degree
comment: An educational award made by a university or other higher education institution.
disjoint with: Interest
disjoint with: Cohort
disjoint with: YearOfStudy
disjoint with: ContactMethod
type: Class
disjoint with: Location
disjoint with: Document
disjoint with: Module
disjoint with: Agent

Event
subclass of: IntervalEvent
type: Class
comment: An activity which takes place at a particular place and time.

Module
disjoint with: Degree
disjoint with: ContactMethod
type: Class
disjoint with: Agent
disjoint with: Cohort
disjoint with: Document
disjoint with: Location
disjoint with: Interest
comment: A module of tuition on a degree programme.
disjoint with: YearOfStudy

MPhil
disjoint with: PhD
disjoint with: DPhil
disjoint with: EngD
type: Class
subclass of: Postgraduate-Research-Degree
comment: Master of Philosophy.

AdministrativeRegion
type: Class
comment: An administrative subdivision of a country; a state, province or county.
subclass of: http://lodlaundromat.org/.well-known/genid/samples/pellet///class//dc761509450b163119975e1b794c97ac/76a61fdafb1c5f7b6412a1106925b84d#50
subclass of: GeopoliticalEntity
disjoint with: Country
disjoint with: City

Guest
type: Class
comment: The role of temporary affiliation to an organisation, or affiliation without formal function.
disjoint with: Student
disjoint with: Employee
subclass of: Affiliate

Agent
comment: An entity capable of independent action; may be an individual or a group.
disjoint with: Location
disjoint with: Document
type: Class
disjoint with: ContactMethod
disjoint with: YearOfStudy
disjoint with: Degree
disjoint with: Module
disjoint with: Interest

BA
type: Class
disjoint with: BSc
disjoint with: BEng
disjoint with: MEng
comment: Batchelor of Arts.
subclass of: Undergraduate-Degree

LegalAgent
type: Class
comment: An agent that is recognised as a legal entity.
subclass of: Agent

http://lodlaundromat.org/.well-known/genid/samples/pellet///class//dc761509450b163119975e1b794c97ac/76a61fdafb1c5f7b6412a1106925b84d#52
rest: http://lodlaundromat.org/.well-known/genid/samples/pellet///class//dc761509450b163119975e1b794c97ac/76a61fdafb1c5f7b6412a1106925b84d#19
first: Part II

Educational Organisation
comment: An organisation whose primary focus is education.
type: Class
disjoint with: Commercial Organisation
disjoint with: NonProfitOrganisation
disjoint with: GovernmentalOrganisation
subclass of: Organisation

Postgraduate-Instructional
disjoint with: Postgraduate-Research
disjoint with: Postgraduate-Integrated
type: Class
subclass of: Postgraduate
comment: The role of one studying for a higher taught degree.

Person
type: Class
subclass of: LegalAgent
subclass of: Individual
disjoint with: Role
disjoint with: Organisation
comment: A human being; an individual recognised as a legal entity.

GovernmentalOrganisation
disjoint with: Commercial Organisation
disjoint with: Educational Organisation
disjoint with: NonProfitOrganisation
comment: An organisation that is part of government.
subclass of: Organisation
type: Class

http://lodlaundromat.org/.well-known/genid/samples/pellet///class//dc761509450b163119975e1b794c97ac/76a61fdafb1c5f7b6412a1106925b84d#42
first: 1
rest: http://lodlaundromat.org/.well-known/genid/samples/pellet///class//dc761509450b163119975e1b794c97ac/76a61fdafb1c5f7b6412a1106925b84d#32

http://lodlaundromat.org/.well-known/genid/samples/pellet///class//dc761509450b163119975e1b794c97ac/76a61fdafb1c5f7b6412a1106925b84d#20
rest: nil
first: Part IV

http://lodlaundromat.org/.well-known/genid/samples/pellet///class//dc761509450b163119975e1b794c97ac/76a61fdafb1c5f7b6412a1106925b84d#8
type: Restriction
on property: hasRegion
max cardinality: 1

http://lodlaundromat.org/.well-known/genid/samples/pellet///class//dc761509450b163119975e1b794c97ac/76a61fdafb1c5f7b6412a1106925b84d#48
rest: http://lodlaundromat.org/.well-known/genid/samples/pellet///class//dc761509450b163119975e1b794c97ac/76a61fdafb1c5f7b6412a1106925b84d#52
first: Part I

http://lodlaundromat.org/.well-known/genid/samples/pellet///class//dc761509450b163119975e1b794c97ac/76a61fdafb1c5f7b6412a1106925b84d#9
on property: hasPostalAddress
type: Restriction
cardinality: 1

MEng
subclass of: Undergraduate-Degree
type: Class
comment: Master of Engineering.
disjoint with: BSc
disjoint with: BA
disjoint with: BEng

http://lodlaundromat.org/.well-known/genid/samples/pellet///class//dc761509450b163119975e1b794c97ac/76a61fdafb1c5f7b6412a1106925b84d#21
cardinality: 1
on property: hasYearOfStudy
type: Restriction

Project
disjoint with: OrganisationUnit
disjoint with: Presentation
disjoint with: Organisation
disjoint with: Seminar
disjoint with: Cohort in Session
type: Class
comment: A group of individuals who are engaged in a common activity with a formal goal.
subclass of: Group
subclass of: Event

Employee
subclass of: Affiliate
disjoint with: Student
disjoint with: Guest
comment: The role of employment by an organisation.
type: Class

Telephone
comment: A tel: URI which may be used to contact an agent.
disjoint with: EmailAddress
disjoint with: AddressLocation
disjoint with: Fax
disjoint with: ContactPage
type: Class
subclass of: ContactMethod

Organisation
comment: A group of individuals recognised as a legal entity.
disjoint with: Person
disjoint with: Project
disjoint with: OrganisationUnit
disjoint with: Cohort in Session
type: Class
subclass of: Group
subclass of: LegalAgent

EducationalOrganisationUnit
subclass of: OrganisationUnit
type: Class
comment: A group of individuals that forms part of an educational organisation, but which is not recognised as a legal entity in its own right.

BEng
subclass of: Undergraduate-Degree
type: Class
disjoint with: BA
disjoint with: BSc
disjoint with: MEng
comment: Batchelor of Engineering.

Location
disjoint with: Degree
disjoint with: ContactMethod
comment: Location
disjoint with: Cohort
disjoint with: YearOfStudy
type: Class
disjoint with: Module
disjoint with: Interest
disjoint with: Document
disjoint with: Agent

http://lodlaundromat.org/.well-known/genid/samples/pellet///class//dc761509450b163119975e1b794c97ac/76a61fdafb1c5f7b6412a1106925b84d#33
first: 3
rest: http://lodlaundromat.org/.well-known/genid/samples/pellet///class//dc761509450b163119975e1b794c97ac/76a61fdafb1c5f7b6412a1106925b84d#30

EngD
disjoint with: MPhil
disjoint with: DPhil
disjoint with: PhD
subclass of: Postgraduate-Research-Degree
type: Class
comment: An engineering doctorate.

http://lodlaundromat.org/.well-known/genid/samples/pellet///class//dc761509450b163119975e1b794c97ac/76a61fdafb1c5f7b6412a1106925b84d#55
cardinality: 1
on property: hasOrganisingGroup
type: Restriction

http://lodlaundromat.org/.well-known/genid/samples/pellet///class//dc761509450b163119975e1b794c97ac/76a61fdafb1c5f7b6412a1106925b84d#35
rest: nil
first: 2

MA
type: Class
comment: Master of Arts.
disjoint with: MSc
subclass of: Postgraduate-Taught-Degree

PhD
subclass of: Postgraduate-Research-Degree
comment: Doctor of Philosophy. Equivalent to a DPhil.
type: Class
disjoint with: DPhil
disjoint with: MPhil
disjoint with: EngD

Cohort in Session
subclass of: Cohort
subclass of: http://lodlaundromat.org/.well-known/genid/samples/pellet///class//dc761509450b163119975e1b794c97ac/76a61fdafb1c5f7b6412a1106925b84d#43
type: Class
comment: A group of students who are studying on the same course, in the same session, at the same institution and who are at the same point in their studies.
disjoint with: Project
disjoint with: OrganisationUnit
disjoint with: Organisation

http://lodlaundromat.org/.well-known/genid/samples/pellet///class//dc761509450b163119975e1b794c97ac/76a61fdafb1c5f7b6412a1106925b84d#50
type: Restriction
on property: inCountry
cardinality: 1