http://lodlaundromat.org/.well-known/genid/samples/jena///class//dc761509450b163119975e1b794c97ac/76a61fdafb1c5f7b6412a1106925b84d#1
subclass of: Resource
type: Class
subclass of: Thing
on property: hasCity
type: Restriction
max cardinality: 1

Educational Organisation
subclass of: Resource
type: Class
subclass of: Thing
subclass of: http://lodlaundromat.org/.well-known/genid/samples/jena///class//dc761509450b163119975e1b794c97ac/76a61fdafb1c5f7b6412a1106925b84d#34
subclass of: http://lodlaundromat.org/.well-known/genid/samples/jena///class//dc761509450b163119975e1b794c97ac/76a61fdafb1c5f7b6412a1106925b84d#6
comment: An organisation whose primary focus is education.
disjoint with: Commercial Organisation
disjoint with: NonProfitOrganisation
disjoint with: GovernmentalOrganisation
subclass of: Organisation
subclass of: http://lodlaundromat.org/.well-known/genid/samples/jena///class//dc761509450b163119975e1b794c97ac/76a61fdafb1c5f7b6412a1106925b84d#16
subclass of: Agent
subclass of: Group
subclass of: LegalAgent

Postgraduate-Instructional
subclass of: http://lodlaundromat.org/.well-known/genid/samples/jena///class//dc761509450b163119975e1b794c97ac/76a61fdafb1c5f7b6412a1106925b84d#2
subclass of: Resource
type: Class
subclass of: Thing
disjoint with: Postgraduate-Research
disjoint with: Postgraduate-Integrated
subclass of: Postgraduate
comment: The role of one studying for a higher taught degree.
subclass of: Student
subclass of: Affiliate
subclass of: Role
subclass of: Individual
subclass of: Agent

Module
subclass of: Thing
subclass of: Resource
type: Class
disjoint with: Location
disjoint with: Document
disjoint with: Cohort
comment: A module of tuition on a degree programme.
disjoint with: Degree
disjoint with: Agent
disjoint with: Interest
disjoint with: YearOfStudy
disjoint with: ContactMethod

PostgraduateCohort
subclass of: Thing
subclass of: http://lodlaundromat.org/.well-known/genid/samples/jena///class//dc761509450b163119975e1b794c97ac/76a61fdafb1c5f7b6412a1106925b84d#18
type: Class
subclass of: Resource
comment: A cohort of postgraduate students.
equivalent class: http://lodlaundromat.org/.well-known/genid/samples/jena///class//dc761509450b163119975e1b794c97ac/76a61fdafb1c5f7b6412a1106925b84d#18
subclass of: http://lodlaundromat.org/.well-known/genid/samples/jena///class//dc761509450b163119975e1b794c97ac/76a61fdafb1c5f7b6412a1106925b84d#13
subclass of: http://lodlaundromat.org/.well-known/genid/samples/jena///class//dc761509450b163119975e1b794c97ac/76a61fdafb1c5f7b6412a1106925b84d#22
subclass of: http://lodlaundromat.org/.well-known/genid/samples/jena///class//dc761509450b163119975e1b794c97ac/76a61fdafb1c5f7b6412a1106925b84d#40
subclass of: http://lodlaundromat.org/.well-known/genid/samples/jena///class//dc761509450b163119975e1b794c97ac/76a61fdafb1c5f7b6412a1106925b84d#38

Affiliate
subclass of: Thing
subclass of: Resource
type: Class
comment: The role of affiliation to an organisation.
subclass of: Role
subclass of: Individual
subclass of: Agent

http://lodlaundromat.org/.well-known/genid/samples/jena///class//dc761509450b163119975e1b794c97ac/76a61fdafb1c5f7b6412a1106925b84d#40
subclass of: Resource
subclass of: Thing
type: Class
cardinality: 1
on property: onDegree
type: Restriction
subclass of: http://lodlaundromat.org/.well-known/genid/samples/jena///class//dc761509450b163119975e1b794c97ac/76a61fdafb1c5f7b6412a1106925b84d#13
subclass of: http://lodlaundromat.org/.well-known/genid/samples/jena///class//dc761509450b163119975e1b794c97ac/76a61fdafb1c5f7b6412a1106925b84d#22
equivalent class: http://lodlaundromat.org/.well-known/genid/samples/jena///class//dc761509450b163119975e1b794c97ac/76a61fdafb1c5f7b6412a1106925b84d#13
equivalent class: http://lodlaundromat.org/.well-known/genid/samples/jena///class//dc761509450b163119975e1b794c97ac/76a61fdafb1c5f7b6412a1106925b84d#22

http://lodlaundromat.org/.well-known/genid/samples/jena///class//dc761509450b163119975e1b794c97ac/76a61fdafb1c5f7b6412a1106925b84d#10
type: Class
subclass of: Thing
subclass of: Resource
on property: ofSession
type: Restriction
cardinality: 1

http://lodlaundromat.org/.well-known/genid/samples/jena///class//dc761509450b163119975e1b794c97ac/76a61fdafb1c5f7b6412a1106925b84d#7
subclass of: Resource
type: Class
subclass of: Thing
max cardinality: 1
type: Restriction
on property: hasCountry

Group
subclass of: Thing
subclass of: Resource
type: Class
subclass of: Agent
comment: A group of individual agents.
disjoint with: Individual

Building
subclass of: Thing
subclass of: Resource
type: Class
comment: A built structure, possibly intended for occupation by people.
disjoint with: Room
disjoint with: GeopoliticalEntity
subclass of: PhysicalLocation
subclass of: Location

http://lodlaundromat.org/.well-known/genid/samples/jena///class//dc761509450b163119975e1b794c97ac/76a61fdafb1c5f7b6412a1106925b84d#22
subclass of: Thing
subclass of: Resource
type: Class
on property: onDegree
type: Restriction
cardinality: 1
subclass of: http://lodlaundromat.org/.well-known/genid/samples/jena///class//dc761509450b163119975e1b794c97ac/76a61fdafb1c5f7b6412a1106925b84d#13
subclass of: http://lodlaundromat.org/.well-known/genid/samples/jena///class//dc761509450b163119975e1b794c97ac/76a61fdafb1c5f7b6412a1106925b84d#40
equivalent class: http://lodlaundromat.org/.well-known/genid/samples/jena///class//dc761509450b163119975e1b794c97ac/76a61fdafb1c5f7b6412a1106925b84d#13
equivalent class: http://lodlaundromat.org/.well-known/genid/samples/jena///class//dc761509450b163119975e1b794c97ac/76a61fdafb1c5f7b6412a1106925b84d#40

Project
subclass of: Resource
type: Class
subclass of: Thing
disjoint with: OrganisationUnit
disjoint with: Presentation
disjoint with: Organisation
disjoint with: Seminar
disjoint with: Cohort in Session
comment: A group of individuals who are engaged in a common activity with a formal goal.
subclass of: Group
subclass of: Event
subclass of: Agent
subclass of: IntervalEvent

Individual
subclass of: Resource
type: Class
subclass of: Thing
comment: An individual agent.
subclass of: Agent
disjoint with: Group

BSc
subclass of: Resource
type: Class
subclass of: Thing
disjoint with: MEng
disjoint with: BEng
disjoint with: BA
subclass of: Undergraduate-Degree
comment: Batchelor of Science.
subclass of: Degree

Seminar
subclass of: Thing
subclass of: http://lodlaundromat.org/.well-known/genid/samples/jena///class//dc761509450b163119975e1b794c97ac/76a61fdafb1c5f7b6412a1106925b84d#29
subclass of: Resource
type: Class
comment: A meeting associated with an organisation or organisation unit.
disjoint with: Project
disjoint with: Presentation
subclass of: Event
subclass of: IntervalEvent

Guest
subclass of: Thing
subclass of: Resource
type: Class
comment: The role of temporary affiliation to an organisation, or affiliation without formal function.
disjoint with: Student
disjoint with: Employee
subclass of: Affiliate
subclass of: Individual
subclass of: Role
subclass of: Agent

Event
subclass of: Resource
type: Class
subclass of: Thing
subclass of: IntervalEvent
comment: An activity which takes place at a particular place and time.

Commercial Organisation
subclass of: Resource
type: Class
subclass of: Thing
subclass of: Organisation
comment: A for-profit organisation.
disjoint with: Educational Organisation
disjoint with: GovernmentalOrganisation
disjoint with: NonProfitOrganisation
subclass of: Agent
subclass of: LegalAgent
subclass of: Group
subclass of: http://lodlaundromat.org/.well-known/genid/samples/jena///class//dc761509450b163119975e1b794c97ac/76a61fdafb1c5f7b6412a1106925b84d#16

http://lodlaundromat.org/.well-known/genid/samples/jena///class//dc761509450b163119975e1b794c97ac/76a61fdafb1c5f7b6412a1106925b84d#8
subclass of: Resource
type: Class
subclass of: Thing
type: Restriction
on property: hasRegion
max cardinality: 1

Semester
subclass of: Thing
subclass of: Resource
type: Class
comment: A division of an academic year associated with teaching.
subclass of: ProperInterval
subclass of: http://lodlaundromat.org/.well-known/genid/samples/jena///class//dc761509450b163119975e1b794c97ac/76a61fdafb1c5f7b6412a1106925b84d#10

NonProfitOrganisation
subclass of: Resource
type: Class
subclass of: Thing
disjoint with: Educational Organisation
disjoint with: Commercial Organisation
disjoint with: GovernmentalOrganisation
comment: A charity or other not-for-profit organisation.
subclass of: Organisation
subclass of: Agent
subclass of: http://lodlaundromat.org/.well-known/genid/samples/jena///class//dc761509450b163119975e1b794c97ac/76a61fdafb1c5f7b6412a1106925b84d#16
subclass of: LegalAgent
subclass of: Group

University
subclass of: Resource
type: Class
subclass of: Thing
comment: An organisation whose primary focus is higher education.
subclass of: Educational Organisation
subclass of: http://lodlaundromat.org/.well-known/genid/samples/jena///class//dc761509450b163119975e1b794c97ac/76a61fdafb1c5f7b6412a1106925b84d#34
subclass of: http://lodlaundromat.org/.well-known/genid/samples/jena///class//dc761509450b163119975e1b794c97ac/76a61fdafb1c5f7b6412a1106925b84d#6
subclass of: Organisation
subclass of: http://lodlaundromat.org/.well-known/genid/samples/jena///class//dc761509450b163119975e1b794c97ac/76a61fdafb1c5f7b6412a1106925b84d#16
subclass of: LegalAgent
subclass of: Agent
subclass of: Group

EmailAddress
subclass of: Resource
type: Class
subclass of: Thing
comment: A mailto: URI which may be used to contact an agent.
disjoint with: ContactPage
disjoint with: Fax
disjoint with: Telephone
disjoint with: AddressLocation
subclass of: ContactMethod

City
subclass of: Thing
subclass of: Resource
type: Class
comment: A municipal geographical region.
disjoint with: Country
disjoint with: AdministrativeRegion
subclass of: GeopoliticalEntity
subclass of: PhysicalLocation
subclass of: Location

Role
subclass of: Resource
type: Class
subclass of: Thing
comment: A role performed by a person, possibly one of many.
disjoint with: Person
subclass of: Individual
subclass of: Agent

ResearchTheme
subclass of: Thing
subclass of: Resource
type: Class
comment: A topic of interest that has been identified as a research theme.
subclass of: Interest

AddressLocation
subclass of: Thing
subclass of: Resource
type: Class
disjoint with: EmailAddress
subclass of: http://lodlaundromat.org/.well-known/genid/samples/jena///class//dc761509450b163119975e1b794c97ac/76a61fdafb1c5f7b6412a1106925b84d#9
subclass of: Location
subclass of: http://lodlaundromat.org/.well-known/genid/samples/jena///class//dc761509450b163119975e1b794c97ac/76a61fdafb1c5f7b6412a1106925b84d#1
subclass of: http://lodlaundromat.org/.well-known/genid/samples/jena///class//dc761509450b163119975e1b794c97ac/76a61fdafb1c5f7b6412a1106925b84d#7
disjoint with: Telephone
disjoint with: Fax
disjoint with: ContactPage
comment: A location which is identified by a postal address; may be associated with physical locations which correspond to components of the postal address.
disjoint with: PhysicalLocation
subclass of: http://lodlaundromat.org/.well-known/genid/samples/jena///class//dc761509450b163119975e1b794c97ac/76a61fdafb1c5f7b6412a1106925b84d#8

PhD
subclass of: Resource
type: Class
subclass of: Thing
subclass of: Postgraduate-Research-Degree
comment: Doctor of Philosophy. Equivalent to a DPhil.
disjoint with: DPhil
disjoint with: MPhil
disjoint with: EngD
subclass of: Degree
subclass of: Postgraduate-Degree

MSc
subclass of: Resource
type: Class
subclass of: Thing
subclass of: Postgraduate-Taught-Degree
disjoint with: MA
comment: Master of Science.
subclass of: http://lodlaundromat.org/.well-known/genid/samples/jena///class//dc761509450b163119975e1b794c97ac/76a61fdafb1c5f7b6412a1106925b84d#57
subclass of: Postgraduate-Degree
subclass of: Degree

http://lodlaundromat.org/.well-known/genid/samples/jena///class//dc761509450b163119975e1b794c97ac/76a61fdafb1c5f7b6412a1106925b84d#9
type: Class
subclass of: Thing
subclass of: Resource
on property: hasPostalAddress
type: Restriction
cardinality: 1

LegalAgent
subclass of: Resource
type: Class
subclass of: Thing
comment: An agent that is recognised as a legal entity.
subclass of: Agent

OrganisationUnit
subclass of: Thing
subclass of: Resource
type: Class
subclass of: http://lodlaundromat.org/.well-known/genid/samples/jena///class//dc761509450b163119975e1b794c97ac/76a61fdafb1c5f7b6412a1106925b84d#16
disjoint with: Organisation
disjoint with: Project
disjoint with: Cohort in Session
subclass of: Group
comment: A group of individuals that forms part of an organisation, but which is not recognised as a legal entity in its own right.
subclass of: Agent

Postgraduate-Research
subclass of: Thing
subclass of: Resource
type: Class
subclass of: Postgraduate
comment: The role of one studying for a higher degree by research.
disjoint with: Postgraduate-Instructional
disjoint with: Postgraduate-Integrated
subclass of: Student
subclass of: Role
subclass of: Individual
subclass of: Affiliate
subclass of: Agent

Agent
subclass of: Thing
subclass of: Resource
type: Class
disjoint with: Module
disjoint with: Document
disjoint with: ContactMethod
disjoint with: Interest
disjoint with: YearOfStudy
comment: An entity capable of independent action; may be an individual or a group.
disjoint with: Degree
disjoint with: Location

EngD
subclass of: Resource
type: Class
subclass of: Thing
disjoint with: MPhil
disjoint with: DPhil
disjoint with: PhD
subclass of: Postgraduate-Research-Degree
comment: An engineering doctorate.
subclass of: Postgraduate-Degree
subclass of: Degree

Fax
subclass of: Resource
type: Class
subclass of: Thing
comment: A fax: URI which may be used to contact an agent.
subclass of: ContactMethod
disjoint with: AddressLocation
disjoint with: ContactPage
disjoint with: EmailAddress
disjoint with: Telephone

BEng
subclass of: Resource
type: Class
subclass of: Thing
subclass of: Undergraduate-Degree
disjoint with: BA
disjoint with: BSc
disjoint with: MEng
comment: Batchelor of Engineering.
subclass of: Degree

http://lodlaundromat.org/.well-known/genid/samples/jena///class//dc761509450b163119975e1b794c97ac/76a61fdafb1c5f7b6412a1106925b84d#43
type: Class
subclass of: Thing
subclass of: Resource
on property: hasSession
type: Restriction
cardinality: 1

GovernmentalOrganisation
subclass of: Resource
type: Class
subclass of: Thing
disjoint with: Commercial Organisation
disjoint with: Educational Organisation
disjoint with: NonProfitOrganisation
comment: An organisation that is part of government.
subclass of: Organisation
subclass of: Agent
subclass of: LegalAgent
subclass of: http://lodlaundromat.org/.well-known/genid/samples/jena///class//dc761509450b163119975e1b794c97ac/76a61fdafb1c5f7b6412a1106925b84d#16
subclass of: Group

http://lodlaundromat.org/.well-known/genid/samples/jena///class//dc761509450b163119975e1b794c97ac/76a61fdafb1c5f7b6412a1106925b84d#13
type: Class
subclass of: Thing
subclass of: Resource
type: Restriction
cardinality: 1
on property: onDegree
subclass of: http://lodlaundromat.org/.well-known/genid/samples/jena///class//dc761509450b163119975e1b794c97ac/76a61fdafb1c5f7b6412a1106925b84d#22
subclass of: http://lodlaundromat.org/.well-known/genid/samples/jena///class//dc761509450b163119975e1b794c97ac/76a61fdafb1c5f7b6412a1106925b84d#40
equivalent class: http://lodlaundromat.org/.well-known/genid/samples/jena///class//dc761509450b163119975e1b794c97ac/76a61fdafb1c5f7b6412a1106925b84d#22
equivalent class: http://lodlaundromat.org/.well-known/genid/samples/jena///class//dc761509450b163119975e1b794c97ac/76a61fdafb1c5f7b6412a1106925b84d#40

http://lodlaundromat.org/.well-known/genid/samples/jena///class//dc761509450b163119975e1b794c97ac/76a61fdafb1c5f7b6412a1106925b84d#55
subclass of: Thing
type: Class
subclass of: Resource
cardinality: 1
on property: hasOrganisingGroup
type: Restriction

Postgraduate-Integrated
subclass of: Resource
type: Class
subclass of: Thing
subclass of: Postgraduate
comment: The role of one studying for a higher degree which requires both research and some taught component.
disjoint with: Postgraduate-Instructional
disjoint with: Postgraduate-Research
subclass of: Student
subclass of: Individual
subclass of: Role
subclass of: Affiliate
subclass of: Agent

BA
subclass of: Resource
type: Class
subclass of: Thing
disjoint with: BSc
disjoint with: BEng
disjoint with: MEng
comment: Batchelor of Arts.
subclass of: Undergraduate-Degree
subclass of: Degree

Cohort
type: Class
subclass of: Thing
subclass of: Resource
disjoint with: Interest
disjoint with: Location
disjoint with: YearOfStudy
comment: An abstract group of students who are studying on the same course, at the same institution and who are at the same point in their studies.
subclass of: Group
subclass of: http://lodlaundromat.org/.well-known/genid/samples/jena///class//dc761509450b163119975e1b794c97ac/76a61fdafb1c5f7b6412a1106925b84d#21
disjoint with: ContactMethod
disjoint with: Document
disjoint with: Degree
disjoint with: Module
subclass of: http://lodlaundromat.org/.well-known/genid/samples/jena///class//dc761509450b163119975e1b794c97ac/76a61fdafb1c5f7b6412a1106925b84d#22
subclass of: http://lodlaundromat.org/.well-known/genid/samples/jena///class//dc761509450b163119975e1b794c97ac/76a61fdafb1c5f7b6412a1106925b84d#13
subclass of: http://lodlaundromat.org/.well-known/genid/samples/jena///class//dc761509450b163119975e1b794c97ac/76a61fdafb1c5f7b6412a1106925b84d#40
subclass of: Agent

Session
subclass of: Resource
type: Class
subclass of: Thing
comment: An academic year.
subclass of: ProperInterval

Publication
subclass of: Resource
type: Class
subclass of: Thing
comment: A published document.
subclass of: Document
disjoint with: ContactMethod
disjoint with: ContactPage

MPhil
subclass of: Resource
type: Class
subclass of: Thing
disjoint with: PhD
disjoint with: DPhil
disjoint with: EngD
subclass of: Postgraduate-Research-Degree
comment: Master of Philosophy.
subclass of: Degree
subclass of: Postgraduate-Degree

Degree
subclass of: Resource
type: Class
subclass of: Thing
disjoint with: Module
disjoint with: Document
disjoint with: ContactMethod
disjoint with: YearOfStudy
disjoint with: Agent
disjoint with: Location
comment: An educational award made by a university or other higher education institution.
disjoint with: Interest
disjoint with: Cohort

http://lodlaundromat.org/.well-known/genid/samples/jena///class//dc761509450b163119975e1b794c97ac/76a61fdafb1c5f7b6412a1106925b84d#50
subclass of: Resource
subclass of: Thing
type: Class
type: Restriction
on property: inCountry
cardinality: 1

Student
subclass of: Thing
subclass of: Resource
type: Class
disjoint with: Guest
disjoint with: Employee
subclass of: Affiliate
comment: The role of one studying at an educational organisation.
subclass of: Role
subclass of: Individual
subclass of: Agent

DPhil
subclass of: Resource
type: Class
subclass of: Thing
comment: Doctor of Philosophy. Equivalent to a PhD.
subclass of: Postgraduate-Research-Degree
disjoint with: EngD
disjoint with: MPhil
disjoint with: PhD
subclass of: Degree
subclass of: Postgraduate-Degree

YearOfStudy
subclass of: Resource
type: Class
subclass of: Thing
comment: A year within a degree programme.
disjoint with: Interest
disjoint with: Degree
disjoint with: Cohort
disjoint with: Document
disjoint with: ContactMethod
disjoint with: Location
disjoint with: Module
disjoint with: Agent

UndergraduateCohort
subclass of: Resource
subclass of: http://lodlaundromat.org/.well-known/genid/samples/jena///class//dc761509450b163119975e1b794c97ac/76a61fdafb1c5f7b6412a1106925b84d#39
subclass of: Thing
type: Class
equivalent class: http://lodlaundromat.org/.well-known/genid/samples/jena///class//dc761509450b163119975e1b794c97ac/76a61fdafb1c5f7b6412a1106925b84d#39
comment: A cohort of undergraduate students.
subclass of: http://lodlaundromat.org/.well-known/genid/samples/jena///class//dc761509450b163119975e1b794c97ac/76a61fdafb1c5f7b6412a1106925b84d#4
subclass of: http://lodlaundromat.org/.well-known/genid/samples/jena///class//dc761509450b163119975e1b794c97ac/76a61fdafb1c5f7b6412a1106925b84d#13
subclass of: http://lodlaundromat.org/.well-known/genid/samples/jena///class//dc761509450b163119975e1b794c97ac/76a61fdafb1c5f7b6412a1106925b84d#22
subclass of: http://lodlaundromat.org/.well-known/genid/samples/jena///class//dc761509450b163119975e1b794c97ac/76a61fdafb1c5f7b6412a1106925b84d#40

Telephone
subclass of: Thing
subclass of: Resource
type: Class
comment: A tel: URI which may be used to contact an agent.
disjoint with: EmailAddress
disjoint with: AddressLocation
disjoint with: Fax
disjoint with: ContactPage
subclass of: ContactMethod

Undergraduate
subclass of: http://lodlaundromat.org/.well-known/genid/samples/jena///class//dc761509450b163119975e1b794c97ac/76a61fdafb1c5f7b6412a1106925b84d#2
subclass of: Resource
type: Class
subclass of: Thing
disjoint with: Postgraduate
subclass of: Student
comment: The role of one studying for a
subclass of: Role
subclass of: Individual
subclass of: Affiliate
subclass of: Agent

http://lodlaundromat.org/.well-known/genid/samples/jena///class//dc761509450b163119975e1b794c97ac/76a61fdafb1c5f7b6412a1106925b84d#14
type: Class
subclass of: Resource
subclass of: Thing
type: Restriction
cardinality: 1
on property: inBuilding

Room
type: Class
subclass of: Resource
subclass of: Thing
comment: An enclosed space within a building.
subclass of: PhysicalLocation
subclass of: http://lodlaundromat.org/.well-known/genid/samples/jena///class//dc761509450b163119975e1b794c97ac/76a61fdafb1c5f7b6412a1106925b84d#14
disjoint with: GeopoliticalEntity
disjoint with: Building
subclass of: Location

MEng
subclass of: Resource
type: Class
subclass of: Thing
subclass of: Undergraduate-Degree
comment: Master of Engineering.
disjoint with: BSc
disjoint with: BA
disjoint with: BEng
subclass of: Degree

Employee
subclass of: Thing
subclass of: Resource
type: Class
subclass of: Affiliate
disjoint with: Student
disjoint with: Guest
comment: The role of employment by an organisation.
subclass of: Individual
subclass of: Role
subclass of: Agent

ContactPage
subclass of: Resource
type: Class
subclass of: Thing
disjoint with: EmailAddress
disjoint with: Telephone
disjoint with: Fax
disjoint with: AddressLocation
disjoint with: Publication
comment: A webpage which contains contact information for an agent.
subclass of: ContactMethod
subclass of: Document

Person
subclass of: Thing
subclass of: Resource
type: Class
subclass of: LegalAgent
subclass of: Individual
disjoint with: Role
disjoint with: Organisation
comment: A human being; an individual recognised as a legal entity.
subclass of: Agent

Interest
subclass of: Thing
subclass of: Resource
type: Class
disjoint with: YearOfStudy
disjoint with: Module
disjoint with: Location
disjoint with: ContactMethod
disjoint with: Degree
disjoint with: Document
comment: A topic of interest.
disjoint with: Cohort
disjoint with: Agent

Location
subclass of: Thing
subclass of: Resource
type: Class
disjoint with: Agent
disjoint with: Cohort
disjoint with: YearOfStudy
disjoint with: Module
disjoint with: ContactMethod
disjoint with: Degree
disjoint with: Document
disjoint with: Interest
comment: Location

Cohort in Session
subclass of: Resource
type: Class
subclass of: Thing
subclass of: Cohort
subclass of: http://lodlaundromat.org/.well-known/genid/samples/jena///class//dc761509450b163119975e1b794c97ac/76a61fdafb1c5f7b6412a1106925b84d#43
comment: A group of students who are studying on the same course, in the same session, at the same institution and who are at the same point in their studies.
disjoint with: Project
disjoint with: OrganisationUnit
disjoint with: Organisation
subclass of: http://lodlaundromat.org/.well-known/genid/samples/jena///class//dc761509450b163119975e1b794c97ac/76a61fdafb1c5f7b6412a1106925b84d#13
subclass of: http://lodlaundromat.org/.well-known/genid/samples/jena///class//dc761509450b163119975e1b794c97ac/76a61fdafb1c5f7b6412a1106925b84d#22
subclass of: http://lodlaundromat.org/.well-known/genid/samples/jena///class//dc761509450b163119975e1b794c97ac/76a61fdafb1c5f7b6412a1106925b84d#40
subclass of: http://lodlaundromat.org/.well-known/genid/samples/jena///class//dc761509450b163119975e1b794c97ac/76a61fdafb1c5f7b6412a1106925b84d#21
subclass of: Agent
subclass of: Group

EducationalOrganisationUnit
subclass of: http://lodlaundromat.org/.well-known/genid/samples/jena///class//dc761509450b163119975e1b794c97ac/76a61fdafb1c5f7b6412a1106925b84d#34
subclass of: http://lodlaundromat.org/.well-known/genid/samples/jena///class//dc761509450b163119975e1b794c97ac/76a61fdafb1c5f7b6412a1106925b84d#6
subclass of: Resource
type: Class
subclass of: Thing
subclass of: OrganisationUnit
comment: A group of individuals that forms part of an educational organisation, but which is not recognised as a legal entity in its own right.
subclass of: Agent
subclass of: http://lodlaundromat.org/.well-known/genid/samples/jena///class//dc761509450b163119975e1b794c97ac/76a61fdafb1c5f7b6412a1106925b84d#16
subclass of: Group

ModuleInSession
subclass of: Thing
subclass of: Resource
type: Class
comment: A module of tuition on a degree programme, as taught in a particular academic session.
subclass of: Module

http://lodlaundromat.org/.well-known/genid/samples/jena///class//dc761509450b163119975e1b794c97ac/76a61fdafb1c5f7b6412a1106925b84d#21
type: Class
subclass of: Thing
subclass of: Resource
cardinality: 1
on property: hasYearOfStudy
type: Restriction

Organisation
subclass of: Thing
subclass of: Resource
type: Class
subclass of: http://lodlaundromat.org/.well-known/genid/samples/jena///class//dc761509450b163119975e1b794c97ac/76a61fdafb1c5f7b6412a1106925b84d#16
comment: A group of individuals recognised as a legal entity.
disjoint with: Person
disjoint with: Project
disjoint with: OrganisationUnit
disjoint with: Cohort in Session
subclass of: Group
subclass of: LegalAgent
subclass of: Agent

ContactMethod
subclass of: Thing
subclass of: Resource
type: Class
disjoint with: YearOfStudy
disjoint with: Degree
disjoint with: Interest
disjoint with: Location
disjoint with: Agent
comment: A method of contacting an agent.
disjoint with: Publication
disjoint with: Cohort
disjoint with: Module

Postgraduate
subclass of: Resource
type: Class
subclass of: Thing
subclass of: Student
disjoint with: Undergraduate
comment: The role of one studying for a higher degree.
subclass of: Role
subclass of: Individual
subclass of: Affiliate
subclass of: Agent

MA
subclass of: Resource
type: Class
subclass of: Thing
comment: Master of Arts.
disjoint with: MSc
subclass of: Postgraduate-Taught-Degree
subclass of: Postgraduate-Degree
subclass of: Degree
subclass of: http://lodlaundromat.org/.well-known/genid/samples/jena///class//dc761509450b163119975e1b794c97ac/76a61fdafb1c5f7b6412a1106925b84d#57

GeopoliticalEntity
subclass of: Resource
type: Class
subclass of: Thing
subclass of: PhysicalLocation
disjoint with: Building
disjoint with: Room
comment: A geographical area associated with some political or governmental organisation.
subclass of: Location

AdministrativeRegion
subclass of: Thing
type: Class
subclass of: Resource
comment: An administrative subdivision of a country; a state, province or county.
subclass of: http://lodlaundromat.org/.well-known/genid/samples/jena///class//dc761509450b163119975e1b794c97ac/76a61fdafb1c5f7b6412a1106925b84d#50
subclass of: GeopoliticalEntity
disjoint with: Country
disjoint with: City
subclass of: PhysicalLocation
subclass of: Location

hasAssignments
comment: not sure about this
range: string
type: DatatypeProperty
domain: ModuleInSession
type: Property
range: Resource
domain: Resource
domain: Module
domain: Thing

http://lodlaundromat.org/.well-known/genid/samples/jena///class//dc761509450b163119975e1b794c97ac/76a61fdafb1c5f7b6412a1106925b84d#30
rest: http://lodlaundromat.org/.well-known/genid/samples/jena///class//dc761509450b163119975e1b794c97ac/76a61fdafb1c5f7b6412a1106925b84d#24
first: 4

http://lodlaundromat.org/.well-known/genid/samples/jena///class//dc761509450b163119975e1b794c97ac/76a61fdafb1c5f7b6412a1106925b84d#33
first: 3
rest: http://lodlaundromat.org/.well-known/genid/samples/jena///class//dc761509450b163119975e1b794c97ac/76a61fdafb1c5f7b6412a1106925b84d#30

http://lodlaundromat.org/.well-known/genid/samples/jena///class//dc761509450b163119975e1b794c97ac/76a61fdafb1c5f7b6412a1106925b84d#20
rest: nil
first: Part IV

http://lodlaundromat.org/.well-known/genid/samples/jena///class//dc761509450b163119975e1b794c97ac/76a61fdafb1c5f7b6412a1106925b84d#28
first: 1
rest: http://lodlaundromat.org/.well-known/genid/samples/jena///class//dc761509450b163119975e1b794c97ac/76a61fdafb1c5f7b6412a1106925b84d#35

http://lodlaundromat.org/.well-known/genid/samples/jena///class//dc761509450b163119975e1b794c97ac/76a61fdafb1c5f7b6412a1106925b84d#52
rest: http://lodlaundromat.org/.well-known/genid/samples/jena///class//dc761509450b163119975e1b794c97ac/76a61fdafb1c5f7b6412a1106925b84d#19
first: Part II

http://lodlaundromat.org/.well-known/genid/samples/jena///class//dc761509450b163119975e1b794c97ac/76a61fdafb1c5f7b6412a1106925b84d#42
first: 1
rest: http://lodlaundromat.org/.well-known/genid/samples/jena///class//dc761509450b163119975e1b794c97ac/76a61fdafb1c5f7b6412a1106925b84d#32

http://lodlaundromat.org/.well-known/genid/samples/jena///class//dc761509450b163119975e1b794c97ac/76a61fdafb1c5f7b6412a1106925b84d#24
rest: nil
first: 5

http://lodlaundromat.org/.well-known/genid/samples/jena///class//dc761509450b163119975e1b794c97ac/76a61fdafb1c5f7b6412a1106925b84d#32
rest: http://lodlaundromat.org/.well-known/genid/samples/jena///class//dc761509450b163119975e1b794c97ac/76a61fdafb1c5f7b6412a1106925b84d#33
first: 2

ECS Ontology
type: Ontology
imports: time
comment: The ECS Ontology

http://lodlaundromat.org/.well-known/genid/samples/jena///class//dc761509450b163119975e1b794c97ac/76a61fdafb1c5f7b6412a1106925b84d#19
rest: http://lodlaundromat.org/.well-known/genid/samples/jena///class//dc761509450b163119975e1b794c97ac/76a61fdafb1c5f7b6412a1106925b84d#20
first: Part III

http://lodlaundromat.org/.well-known/genid/samples/jena///class//dc761509450b163119975e1b794c97ac/76a61fdafb1c5f7b6412a1106925b84d#48
rest: http://lodlaundromat.org/.well-known/genid/samples/jena///class//dc761509450b163119975e1b794c97ac/76a61fdafb1c5f7b6412a1106925b84d#52
first: Part I

http://lodlaundromat.org/.well-known/genid/samples/jena///class//dc761509450b163119975e1b794c97ac/76a61fdafb1c5f7b6412a1106925b84d#35
rest: nil
first: 2