http://lodlaundromat.org/.well-known/genid/samples/jena///class//dc761509450b163119975e1b794c97ac/76a61fdafb1c5f7b6412a1106925b84d#1
subclass of: Resource
type: Class
subclass of: Thing
on property: hasCity
type: Restriction
max cardinality: 1

Educational Organisation
subclass of: Resource
type: Class
subclass of: Thing
subclass of: http://lodlaundromat.org/.well-known/genid/samples/jena///class//dc761509450b163119975e1b794c97ac/76a61fdafb1c5f7b6412a1106925b84d#34
subclass of: http://lodlaundromat.org/.well-known/genid/samples/jena///class//dc761509450b163119975e1b794c97ac/76a61fdafb1c5f7b6412a1106925b84d#6
comment: An organisation whose primary focus is education.
disjoint with: Commercial Organisation
disjoint with: NonProfitOrganisation
disjoint with: GovernmentalOrganisation
subclass of: Organisation
subclass of: Agent
subclass of: http://lodlaundromat.org/.well-known/genid/samples/jena///class//dc761509450b163119975e1b794c97ac/76a61fdafb1c5f7b6412a1106925b84d#16
subclass of: Group
subclass of: LegalAgent

Postgraduate-Instructional
subclass of: http://lodlaundromat.org/.well-known/genid/samples/jena///class//dc761509450b163119975e1b794c97ac/76a61fdafb1c5f7b6412a1106925b84d#2
subclass of: Resource
type: Class
subclass of: Thing
disjoint with: Postgraduate-Research
disjoint with: Postgraduate-Integrated
subclass of: Postgraduate
comment: The role of one studying for a higher taught degree.
subclass of: Student
subclass of: Affiliate
subclass of: Individual
subclass of: Role
subclass of: Agent

Module
subclass of: Thing
subclass of: Resource
type: Class
disjoint with: Location
disjoint with: Document
disjoint with: Cohort
comment: A module of tuition on a degree programme.
disjoint with: Degree
disjoint with: Agent
disjoint with: Interest
disjoint with: YearOfStudy
disjoint with: ContactMethod

PostgraduateCohort
subclass of: Thing
subclass of: http://lodlaundromat.org/.well-known/genid/samples/jena///class//dc761509450b163119975e1b794c97ac/76a61fdafb1c5f7b6412a1106925b84d#18
type: Class
subclass of: Resource
comment: A cohort of postgraduate students.
equivalent class: http://lodlaundromat.org/.well-known/genid/samples/jena///class//dc761509450b163119975e1b794c97ac/76a61fdafb1c5f7b6412a1106925b84d#18
subclass of: http://lodlaundromat.org/.well-known/genid/samples/jena///class//dc761509450b163119975e1b794c97ac/76a61fdafb1c5f7b6412a1106925b84d#13
subclass of: http://lodlaundromat.org/.well-known/genid/samples/jena///class//dc761509450b163119975e1b794c97ac/76a61fdafb1c5f7b6412a1106925b84d#40
subclass of: http://lodlaundromat.org/.well-known/genid/samples/jena///class//dc761509450b163119975e1b794c97ac/76a61fdafb1c5f7b6412a1106925b84d#22
subclass of: http://lodlaundromat.org/.well-known/genid/samples/jena///class//dc761509450b163119975e1b794c97ac/76a61fdafb1c5f7b6412a1106925b84d#38

Affiliate
subclass of: Thing
subclass of: Resource
type: Class
comment: The role of affiliation to an organisation.
subclass of: Role
subclass of: Individual
subclass of: Agent

http://lodlaundromat.org/.well-known/genid/samples/jena///class//dc761509450b163119975e1b794c97ac/76a61fdafb1c5f7b6412a1106925b84d#40
subclass of: Resource
subclass of: Thing
type: Class
cardinality: 1
on property: onDegree
type: Restriction
subclass of: http://lodlaundromat.org/.well-known/genid/samples/jena///class//dc761509450b163119975e1b794c97ac/76a61fdafb1c5f7b6412a1106925b84d#22
subclass of: http://lodlaundromat.org/.well-known/genid/samples/jena///class//dc761509450b163119975e1b794c97ac/76a61fdafb1c5f7b6412a1106925b84d#13
equivalent class: http://lodlaundromat.org/.well-known/genid/samples/jena///class//dc761509450b163119975e1b794c97ac/76a61fdafb1c5f7b6412a1106925b84d#22
equivalent class: http://lodlaundromat.org/.well-known/genid/samples/jena///class//dc761509450b163119975e1b794c97ac/76a61fdafb1c5f7b6412a1106925b84d#13

http://lodlaundromat.org/.well-known/genid/samples/jena///class//dc761509450b163119975e1b794c97ac/76a61fdafb1c5f7b6412a1106925b84d#10
type: Class
subclass of: Thing
subclass of: Resource
on property: ofSession
type: Restriction
cardinality: 1

http://lodlaundromat.org/.well-known/genid/samples/jena///class//dc761509450b163119975e1b794c97ac/76a61fdafb1c5f7b6412a1106925b84d#7
subclass of: Resource
type: Class
subclass of: Thing
max cardinality: 1
type: Restriction
on property: hasCountry

Group
subclass of: Thing
subclass of: Resource
type: Class
subclass of: Agent
comment: A group of individual agents.
disjoint with: Individual

Building
subclass of: Thing
subclass of: Resource
type: Class
comment: A built structure, possibly intended for occupation by people.
disjoint with: Room
disjoint with: GeopoliticalEntity
subclass of: PhysicalLocation
subclass of: Location

http://lodlaundromat.org/.well-known/genid/samples/jena///class//dc761509450b163119975e1b794c97ac/76a61fdafb1c5f7b6412a1106925b84d#22
subclass of: Thing
subclass of: Resource
type: Class
on property: onDegree
type: Restriction
cardinality: 1
subclass of: http://lodlaundromat.org/.well-known/genid/samples/jena///class//dc761509450b163119975e1b794c97ac/76a61fdafb1c5f7b6412a1106925b84d#13
subclass of: http://lodlaundromat.org/.well-known/genid/samples/jena///class//dc761509450b163119975e1b794c97ac/76a61fdafb1c5f7b6412a1106925b84d#40
equivalent class: http://lodlaundromat.org/.well-known/genid/samples/jena///class//dc761509450b163119975e1b794c97ac/76a61fdafb1c5f7b6412a1106925b84d#13
equivalent class: http://lodlaundromat.org/.well-known/genid/samples/jena///class//dc761509450b163119975e1b794c97ac/76a61fdafb1c5f7b6412a1106925b84d#40

Project
subclass of: Resource
type: Class
subclass of: Thing
disjoint with: OrganisationUnit
disjoint with: Presentation
disjoint with: Organisation
disjoint with: Seminar
disjoint with: Cohort in Session
comment: A group of individuals who are engaged in a common activity with a formal goal.
subclass of: Group
subclass of: Event
subclass of: Agent
subclass of: IntervalEvent

Individual
subclass of: Resource
type: Class
subclass of: Thing
comment: An individual agent.
subclass of: Agent
disjoint with: Group

BSc
subclass of: Resource
type: Class
subclass of: Thing
disjoint with: MEng
disjoint with: BEng
disjoint with: BA
subclass of: Undergraduate-Degree
comment: Batchelor of Science.
subclass of: Degree

Seminar
subclass of: Thing
subclass of: http://lodlaundromat.org/.well-known/genid/samples/jena///class//dc761509450b163119975e1b794c97ac/76a61fdafb1c5f7b6412a1106925b84d#29
subclass of: Resource
type: Class
comment: A meeting associated with an organisation or organisation unit.
disjoint with: Project
disjoint with: Presentation
subclass of: Event
subclass of: IntervalEvent

Guest
subclass of: Thing
subclass of: Resource
type: Class
comment: The role of temporary affiliation to an organisation, or affiliation without formal function.
disjoint with: Student
disjoint with: Employee
subclass of: Affiliate
subclass of: Role
subclass of: Individual
subclass of: Agent

Event
subclass of: Resource
type: Class
subclass of: Thing
subclass of: IntervalEvent
comment: An activity which takes place at a particular place and time.

Commercial Organisation
subclass of: Resource
type: Class
subclass of: Thing
subclass of: Organisation
comment: A for-profit organisation.
disjoint with: Educational Organisation
disjoint with: GovernmentalOrganisation
disjoint with: NonProfitOrganisation
subclass of: Agent
subclass of: LegalAgent
subclass of: Group
subclass of: http://lodlaundromat.org/.well-known/genid/samples/jena///class//dc761509450b163119975e1b794c97ac/76a61fdafb1c5f7b6412a1106925b84d#16

http://lodlaundromat.org/.well-known/genid/samples/jena///class//dc761509450b163119975e1b794c97ac/76a61fdafb1c5f7b6412a1106925b84d#8
subclass of: Resource
type: Class
subclass of: Thing
type: Restriction
on property: hasRegion
max cardinality: 1

Semester
subclass of: Thing
subclass of: Resource
type: Class
comment: A division of an academic year associated with teaching.
subclass of: ProperInterval
subclass of: http://lodlaundromat.org/.well-known/genid/samples/jena///class//dc761509450b163119975e1b794c97ac/76a61fdafb1c5f7b6412a1106925b84d#10

NonProfitOrganisation
subclass of: Resource
type: Class
subclass of: Thing
disjoint with: Educational Organisation
disjoint with: Commercial Organisation
disjoint with: GovernmentalOrganisation
comment: A charity or other not-for-profit organisation.
subclass of: Organisation
subclass of: http://lodlaundromat.org/.well-known/genid/samples/jena///class//dc761509450b163119975e1b794c97ac/76a61fdafb1c5f7b6412a1106925b84d#16
subclass of: LegalAgent
subclass of: Agent
subclass of: Group

University
subclass of: Resource
type: Class
subclass of: Thing
comment: An organisation whose primary focus is higher education.
subclass of: Educational Organisation
subclass of: http://lodlaundromat.org/.well-known/genid/samples/jena///class//dc761509450b163119975e1b794c97ac/76a61fdafb1c5f7b6412a1106925b84d#34
subclass of: Organisation
subclass of: Group
subclass of: http://lodlaundromat.org/.well-known/genid/samples/jena///class//dc761509450b163119975e1b794c97ac/76a61fdafb1c5f7b6412a1106925b84d#16
subclass of: Agent
subclass of: LegalAgent
subclass of: http://lodlaundromat.org/.well-known/genid/samples/jena///class//dc761509450b163119975e1b794c97ac/76a61fdafb1c5f7b6412a1106925b84d#6

EmailAddress
subclass of: Resource
type: Class
subclass of: Thing
comment: A mailto: URI which may be used to contact an agent.
disjoint with: ContactPage
disjoint with: Fax
disjoint with: Telephone
disjoint with: AddressLocation
subclass of: ContactMethod

City
subclass of: Thing
subclass of: Resource
type: Class
comment: A municipal geographical region.
disjoint with: Country
disjoint with: AdministrativeRegion
subclass of: GeopoliticalEntity
subclass of: PhysicalLocation
subclass of: Location

Role
subclass of: Resource
type: Class
subclass of: Thing
comment: A role performed by a person, possibly one of many.
disjoint with: Person
subclass of: Individual
subclass of: Agent

ResearchTheme
subclass of: Thing
subclass of: Resource
type: Class
comment: A topic of interest that has been identified as a research theme.
subclass of: Interest

AddressLocation
subclass of: Thing
subclass of: Resource
type: Class
disjoint with: EmailAddress
subclass of: http://lodlaundromat.org/.well-known/genid/samples/jena///class//dc761509450b163119975e1b794c97ac/76a61fdafb1c5f7b6412a1106925b84d#9
subclass of: Location
subclass of: http://lodlaundromat.org/.well-known/genid/samples/jena///class//dc761509450b163119975e1b794c97ac/76a61fdafb1c5f7b6412a1106925b84d#1
subclass of: http://lodlaundromat.org/.well-known/genid/samples/jena///class//dc761509450b163119975e1b794c97ac/76a61fdafb1c5f7b6412a1106925b84d#7
disjoint with: Telephone
disjoint with: Fax
disjoint with: ContactPage
comment: A location which is identified by a postal address; may be associated with physical locations which correspond to components of the postal address.
disjoint with: PhysicalLocation
subclass of: http://lodlaundromat.org/.well-known/genid/samples/jena///class//dc761509450b163119975e1b794c97ac/76a61fdafb1c5f7b6412a1106925b84d#8

PhD
subclass of: Resource
type: Class
subclass of: Thing
subclass of: Postgraduate-Research-Degree
comment: Doctor of Philosophy. Equivalent to a DPhil.
disjoint with: DPhil
disjoint with: MPhil
disjoint with: EngD
subclass of: Degree
subclass of: Postgraduate-Degree

MSc
subclass of: Resource
type: Class
subclass of: Thing
subclass of: Postgraduate-Taught-Degree
disjoint with: MA
comment: Master of Science.
subclass of: Postgraduate-Degree
subclass of: http://lodlaundromat.org/.well-known/genid/samples/jena///class//dc761509450b163119975e1b794c97ac/76a61fdafb1c5f7b6412a1106925b84d#57
subclass of: Degree

http://lodlaundromat.org/.well-known/genid/samples/jena///class//dc761509450b163119975e1b794c97ac/76a61fdafb1c5f7b6412a1106925b84d#9
type: Class
subclass of: Thing
subclass of: Resource
on property: hasPostalAddress
type: Restriction
cardinality: 1

LegalAgent
subclass of: Resource
type: Class
subclass of: Thing
comment: An agent that is recognised as a legal entity.
subclass of: Agent

OrganisationUnit
subclass of: Thing
subclass of: Resource
type: Class
subclass of: http://lodlaundromat.org/.well-known/genid/samples/jena///class//dc761509450b163119975e1b794c97ac/76a61fdafb1c5f7b6412a1106925b84d#16
disjoint with: Organisation
disjoint with: Project
disjoint with: Cohort in Session
subclass of: Group
comment: A group of individuals that forms part of an organisation, but which is not recognised as a legal entity in its own right.
subclass of: Agent

Postgraduate-Research
subclass of: Thing
subclass of: Resource
type: Class
subclass of: Postgraduate
comment: The role of one studying for a higher degree by research.
disjoint with: Postgraduate-Instructional
disjoint with: Postgraduate-Integrated
subclass of: Student
subclass of: Affiliate
subclass of: Role
subclass of: Individual
subclass of: Agent

Agent
subclass of: Thing
subclass of: Resource
type: Class
disjoint with: Module
disjoint with: Document
disjoint with: ContactMethod
disjoint with: Interest
disjoint with: YearOfStudy
comment: An entity capable of independent action; may be an individual or a group.
disjoint with: Degree
disjoint with: Location

EngD
subclass of: Resource
type: Class
subclass of: Thing
disjoint with: MPhil
disjoint with: DPhil
disjoint with: PhD
subclass of: Postgraduate-Research-Degree
comment: An engineering doctorate.
subclass of: Postgraduate-Degree
subclass of: Degree

Fax
subclass of: Resource
type: Class
subclass of: Thing
comment: A fax: URI which may be used to contact an agent.
subclass of: ContactMethod
disjoint with: AddressLocation
disjoint with: ContactPage
disjoint with: EmailAddress
disjoint with: Telephone

BEng
subclass of: Resource
type: Class
subclass of: Thing
subclass of: Undergraduate-Degree
disjoint with: BA
disjoint with: BSc
disjoint with: MEng
comment: Batchelor of Engineering.
subclass of: Degree

http://lodlaundromat.org/.well-known/genid/samples/jena///class//dc761509450b163119975e1b794c97ac/76a61fdafb1c5f7b6412a1106925b84d#43
type: Class
subclass of: Thing
subclass of: Resource
on property: hasSession
type: Restriction
cardinality: 1

GovernmentalOrganisation
subclass of: Resource
type: Class
subclass of: Thing
disjoint with: Commercial Organisation
disjoint with: Educational Organisation
disjoint with: NonProfitOrganisation
comment: An organisation that is part of government.
subclass of: Organisation
subclass of: LegalAgent
subclass of: Agent
subclass of: Group
subclass of: http://lodlaundromat.org/.well-known/genid/samples/jena///class//dc761509450b163119975e1b794c97ac/76a61fdafb1c5f7b6412a1106925b84d#16

http://lodlaundromat.org/.well-known/genid/samples/jena///class//dc761509450b163119975e1b794c97ac/76a61fdafb1c5f7b6412a1106925b84d#13
type: Class
subclass of: Thing
subclass of: Resource
type: Restriction
cardinality: 1
on property: onDegree
subclass of: http://lodlaundromat.org/.well-known/genid/samples/jena///class//dc761509450b163119975e1b794c97ac/76a61fdafb1c5f7b6412a1106925b84d#22
subclass of: http://lodlaundromat.org/.well-known/genid/samples/jena///class//dc761509450b163119975e1b794c97ac/76a61fdafb1c5f7b6412a1106925b84d#40
equivalent class: http://lodlaundromat.org/.well-known/genid/samples/jena///class//dc761509450b163119975e1b794c97ac/76a61fdafb1c5f7b6412a1106925b84d#22
equivalent class: http://lodlaundromat.org/.well-known/genid/samples/jena///class//dc761509450b163119975e1b794c97ac/76a61fdafb1c5f7b6412a1106925b84d#40

http://lodlaundromat.org/.well-known/genid/samples/jena///class//dc761509450b163119975e1b794c97ac/76a61fdafb1c5f7b6412a1106925b84d#55
subclass of: Thing
type: Class
subclass of: Resource
cardinality: 1
on property: hasOrganisingGroup
type: Restriction

Postgraduate-Integrated
subclass of: Resource
type: Class
subclass of: Thing
subclass of: Postgraduate
comment: The role of one studying for a higher degree which requires both research and some taught component.
disjoint with: Postgraduate-Instructional
disjoint with: Postgraduate-Research
subclass of: Student
subclass of: Affiliate
subclass of: Individual
subclass of: Role
subclass of: Agent

BA
subclass of: Resource
type: Class
subclass of: Thing
disjoint with: BSc
disjoint with: BEng
disjoint with: MEng
comment: Batchelor of Arts.
subclass of: Undergraduate-Degree
subclass of: Degree

Cohort
type: Class
subclass of: Thing
subclass of: Resource
disjoint with: Interest
disjoint with: Location
disjoint with: YearOfStudy
comment: An abstract group of students who are studying on the same course, at the same institution and who are at the same point in their studies.
subclass of: Group
subclass of: http://lodlaundromat.org/.well-known/genid/samples/jena///class//dc761509450b163119975e1b794c97ac/76a61fdafb1c5f7b6412a1106925b84d#21
disjoint with: ContactMethod
disjoint with: Document
disjoint with: Degree
disjoint with: Module
subclass of: http://lodlaundromat.org/.well-known/genid/samples/jena///class//dc761509450b163119975e1b794c97ac/76a61fdafb1c5f7b6412a1106925b84d#22
subclass of: http://lodlaundromat.org/.well-known/genid/samples/jena///class//dc761509450b163119975e1b794c97ac/76a61fdafb1c5f7b6412a1106925b84d#40
subclass of: http://lodlaundromat.org/.well-known/genid/samples/jena///class//dc761509450b163119975e1b794c97ac/76a61fdafb1c5f7b6412a1106925b84d#13
subclass of: Agent

Session
subclass of: Resource
type: Class
subclass of: Thing
comment: An academic year.
subclass of: ProperInterval

Publication
subclass of: Resource
type: Class
subclass of: Thing
comment: A published document.
subclass of: Document
disjoint with: ContactMethod
disjoint with: ContactPage

MPhil
subclass of: Resource
type: Class
subclass of: Thing
disjoint with: PhD
disjoint with: DPhil
disjoint with: EngD
subclass of: Postgraduate-Research-Degree
comment: Master of Philosophy.
subclass of: Degree
subclass of: Postgraduate-Degree

Degree
subclass of: Resource
type: Class
subclass of: Thing
disjoint with: Module
disjoint with: Document
disjoint with: ContactMethod
disjoint with: YearOfStudy
disjoint with: Agent
disjoint with: Location
comment: An educational award made by a university or other higher education institution.
disjoint with: Interest
disjoint with: Cohort

http://lodlaundromat.org/.well-known/genid/samples/jena///class//dc761509450b163119975e1b794c97ac/76a61fdafb1c5f7b6412a1106925b84d#50
subclass of: Resource
subclass of: Thing
type: Class
type: Restriction
on property: inCountry
cardinality: 1

Student
subclass of: Thing
subclass of: Resource
type: Class
disjoint with: Guest
disjoint with: Employee
subclass of: Affiliate
comment: The role of one studying at an educational organisation.
subclass of: Role
subclass of: Individual
subclass of: Agent

DPhil
subclass of: Resource
type: Class
subclass of: Thing
comment: Doctor of Philosophy. Equivalent to a PhD.
subclass of: Postgraduate-Research-Degree
disjoint with: EngD
disjoint with: MPhil
disjoint with: PhD
subclass of: Degree
subclass of: Postgraduate-Degree

YearOfStudy
subclass of: Resource
type: Class
subclass of: Thing
comment: A year within a degree programme.
disjoint with: Interest
disjoint with: Degree
disjoint with: Cohort
disjoint with: Document
disjoint with: ContactMethod
disjoint with: Location
disjoint with: Module
disjoint with: Agent

UndergraduateCohort
subclass of: Resource
subclass of: http://lodlaundromat.org/.well-known/genid/samples/jena///class//dc761509450b163119975e1b794c97ac/76a61fdafb1c5f7b6412a1106925b84d#39
subclass of: Thing
type: Class
equivalent class: http://lodlaundromat.org/.well-known/genid/samples/jena///class//dc761509450b163119975e1b794c97ac/76a61fdafb1c5f7b6412a1106925b84d#39
comment: A cohort of undergraduate students.
subclass of: http://lodlaundromat.org/.well-known/genid/samples/jena///class//dc761509450b163119975e1b794c97ac/76a61fdafb1c5f7b6412a1106925b84d#40
subclass of: http://lodlaundromat.org/.well-known/genid/samples/jena///class//dc761509450b163119975e1b794c97ac/76a61fdafb1c5f7b6412a1106925b84d#4
subclass of: http://lodlaundromat.org/.well-known/genid/samples/jena///class//dc761509450b163119975e1b794c97ac/76a61fdafb1c5f7b6412a1106925b84d#13
subclass of: http://lodlaundromat.org/.well-known/genid/samples/jena///class//dc761509450b163119975e1b794c97ac/76a61fdafb1c5f7b6412a1106925b84d#22

Telephone
subclass of: Thing
subclass of: Resource
type: Class
comment: A tel: URI which may be used to contact an agent.
disjoint with: EmailAddress
disjoint with: AddressLocation
disjoint with: Fax
disjoint with: ContactPage
subclass of: ContactMethod

Undergraduate
subclass of: http://lodlaundromat.org/.well-known/genid/samples/jena///class//dc761509450b163119975e1b794c97ac/76a61fdafb1c5f7b6412a1106925b84d#2
subclass of: Resource
type: Class
subclass of: Thing
disjoint with: Postgraduate
subclass of: Student
comment: The role of one studying for a
subclass of: Role
subclass of: Individual
subclass of: Affiliate
subclass of: Agent

http://lodlaundromat.org/.well-known/genid/samples/jena///class//dc761509450b163119975e1b794c97ac/76a61fdafb1c5f7b6412a1106925b84d#14
type: Class
subclass of: Resource
subclass of: Thing
type: Restriction
cardinality: 1
on property: inBuilding

Southampton
type: City
lat: 50.89696
long: -1.40416
type: Thing
type: PhysicalLocation
type: Location
type: GeopoliticalEntity
different from: Part-II
different from: Part-IV
different from: Part-III
different from: Part-I
different from: Building 9
different from: Building 58
different from: Building 18
different from: Building 43
different from: Building 26
different from: Building 60
different from: Building 20
different from: Building 30
different from: Building 4
different from: Building 36
different from: Building 21
different from: Building 5
different from: Building 27
different from: Building 58a
different from: Building 67
different from: Building 39
different from: Building 44
different from: Building 54
different from: Building 14
different from: Building 19
different from: Building 45
different from: Building 57
different from: Building 17
different from: Building 22
different from: Building 6
different from: Building 28
different from: Building 38
different from: Building 32
different from: Building 35
different from: Building 40
different from: Building 85
different from: Building 15a
different from: Building 1
different from: Building 29
different from: Building 46
different from: Building 50
different from: Building 44a
different from: Building 10
different from: Building 7
different from: Building 47a
different from: Building 53
different from: Building 41
different from: Building 13
different from: Building 56
different from: Building 16
different from: Building 59
different from: Building 47
different from: Building 86
different from: Building 15b
different from: Building 2
different from: Building 34
different from: Building 8
different from: Building 25
different from: Building 37
different from: Building 42
different from: Building 48
different from: Building 52
different from: Building 12

Room
type: Class
subclass of: Resource
subclass of: Thing
comment: An enclosed space within a building.
subclass of: PhysicalLocation
subclass of: http://lodlaundromat.org/.well-known/genid/samples/jena///class//dc761509450b163119975e1b794c97ac/76a61fdafb1c5f7b6412a1106925b84d#14
disjoint with: GeopoliticalEntity
disjoint with: Building
subclass of: Location

MEng
subclass of: Resource
type: Class
subclass of: Thing
subclass of: Undergraduate-Degree
comment: Master of Engineering.
disjoint with: BSc
disjoint with: BA
disjoint with: BEng
subclass of: Degree

Employee
subclass of: Thing
subclass of: Resource
type: Class
subclass of: Affiliate
disjoint with: Student
disjoint with: Guest
comment: The role of employment by an organisation.
subclass of: Role
subclass of: Individual
subclass of: Agent

ContactPage
subclass of: Resource
type: Class
subclass of: Thing
disjoint with: EmailAddress
disjoint with: Telephone
disjoint with: Fax
disjoint with: AddressLocation
disjoint with: Publication
comment: A webpage which contains contact information for an agent.
subclass of: ContactMethod
subclass of: Document

Person
subclass of: Thing
subclass of: Resource
type: Class
subclass of: LegalAgent
subclass of: Individual
disjoint with: Role
disjoint with: Organisation
comment: A human being; an individual recognised as a legal entity.
subclass of: Agent

Interest
subclass of: Thing
subclass of: Resource
type: Class
disjoint with: YearOfStudy
disjoint with: Module
disjoint with: Location
disjoint with: ContactMethod
disjoint with: Degree
disjoint with: Document
comment: A topic of interest.
disjoint with: Cohort
disjoint with: Agent

Location
subclass of: Thing
subclass of: Resource
type: Class
disjoint with: Agent
disjoint with: Cohort
disjoint with: YearOfStudy
disjoint with: Module
disjoint with: ContactMethod
disjoint with: Degree
disjoint with: Document
disjoint with: Interest
comment: Location

Cohort in Session
subclass of: Resource
type: Class
subclass of: Thing
subclass of: Cohort
subclass of: http://lodlaundromat.org/.well-known/genid/samples/jena///class//dc761509450b163119975e1b794c97ac/76a61fdafb1c5f7b6412a1106925b84d#43
comment: A group of students who are studying on the same course, in the same session, at the same institution and who are at the same point in their studies.
disjoint with: Project
disjoint with: OrganisationUnit
disjoint with: Organisation
subclass of: http://lodlaundromat.org/.well-known/genid/samples/jena///class//dc761509450b163119975e1b794c97ac/76a61fdafb1c5f7b6412a1106925b84d#22
subclass of: http://lodlaundromat.org/.well-known/genid/samples/jena///class//dc761509450b163119975e1b794c97ac/76a61fdafb1c5f7b6412a1106925b84d#40
subclass of: http://lodlaundromat.org/.well-known/genid/samples/jena///class//dc761509450b163119975e1b794c97ac/76a61fdafb1c5f7b6412a1106925b84d#13
subclass of: http://lodlaundromat.org/.well-known/genid/samples/jena///class//dc761509450b163119975e1b794c97ac/76a61fdafb1c5f7b6412a1106925b84d#21
subclass of: Agent
subclass of: Group

EducationalOrganisationUnit
subclass of: http://lodlaundromat.org/.well-known/genid/samples/jena///class//dc761509450b163119975e1b794c97ac/76a61fdafb1c5f7b6412a1106925b84d#34
subclass of: http://lodlaundromat.org/.well-known/genid/samples/jena///class//dc761509450b163119975e1b794c97ac/76a61fdafb1c5f7b6412a1106925b84d#6
subclass of: Resource
type: Class
subclass of: Thing
subclass of: OrganisationUnit
comment: A group of individuals that forms part of an educational organisation, but which is not recognised as a legal entity in its own right.
subclass of: Group
subclass of: Agent
subclass of: http://lodlaundromat.org/.well-known/genid/samples/jena///class//dc761509450b163119975e1b794c97ac/76a61fdafb1c5f7b6412a1106925b84d#16

ModuleInSession
subclass of: Thing
subclass of: Resource
type: Class
comment: A module of tuition on a degree programme, as taught in a particular academic session.
subclass of: Module

http://lodlaundromat.org/.well-known/genid/samples/jena///class//dc761509450b163119975e1b794c97ac/76a61fdafb1c5f7b6412a1106925b84d#21
type: Class
subclass of: Thing
subclass of: Resource
cardinality: 1
on property: hasYearOfStudy
type: Restriction

Organisation
subclass of: Thing
subclass of: Resource
type: Class
subclass of: http://lodlaundromat.org/.well-known/genid/samples/jena///class//dc761509450b163119975e1b794c97ac/76a61fdafb1c5f7b6412a1106925b84d#16
comment: A group of individuals recognised as a legal entity.
disjoint with: Person
disjoint with: Project
disjoint with: OrganisationUnit
disjoint with: Cohort in Session
subclass of: Group
subclass of: LegalAgent
subclass of: Agent

ContactMethod
subclass of: Thing
subclass of: Resource
type: Class
disjoint with: YearOfStudy
disjoint with: Degree
disjoint with: Interest
disjoint with: Location
disjoint with: Agent
comment: A method of contacting an agent.
disjoint with: Publication
disjoint with: Cohort
disjoint with: Module

Postgraduate
subclass of: Resource
type: Class
subclass of: Thing
subclass of: Student
disjoint with: Undergraduate
comment: The role of one studying for a higher degree.
subclass of: Affiliate
subclass of: Role
subclass of: Individual
subclass of: Agent

MA
subclass of: Resource
type: Class
subclass of: Thing
comment: Master of Arts.
disjoint with: MSc
subclass of: Postgraduate-Taught-Degree
subclass of: Postgraduate-Degree
subclass of: Degree
subclass of: http://lodlaundromat.org/.well-known/genid/samples/jena///class//dc761509450b163119975e1b794c97ac/76a61fdafb1c5f7b6412a1106925b84d#57

GeopoliticalEntity
subclass of: Resource
type: Class
subclass of: Thing
subclass of: PhysicalLocation
disjoint with: Building
disjoint with: Room
comment: A geographical area associated with some political or governmental organisation.
subclass of: Location

AdministrativeRegion
subclass of: Thing
type: Class
subclass of: Resource
comment: An administrative subdivision of a country; a state, province or county.
subclass of: http://lodlaundromat.org/.well-known/genid/samples/jena///class//dc761509450b163119975e1b794c97ac/76a61fdafb1c5f7b6412a1106925b84d#50
subclass of: GeopoliticalEntity
disjoint with: Country
disjoint with: City
subclass of: PhysicalLocation
subclass of: Location

Southampton
type: City
lat: 50.89696
long: -1.40416
type: Thing
type: PhysicalLocation
type: Location
type: GeopoliticalEntity
different from: Part-II
different from: Part-IV
different from: Part-III
different from: Part-I
different from: Building 9
different from: Building 58
different from: Building 18
different from: Building 43
different from: Building 26
different from: Building 60
different from: Building 20
different from: Building 30
different from: Building 4
different from: Building 36
different from: Building 21
different from: Building 5
different from: Building 27
different from: Building 58a
different from: Building 67
different from: Building 39
different from: Building 44
different from: Building 54
different from: Building 14
different from: Building 19
different from: Building 45
different from: Building 57
different from: Building 17
different from: Building 22
different from: Building 6
different from: Building 28
different from: Building 38
different from: Building 32
different from: Building 35
different from: Building 40
different from: Building 85
different from: Building 15a
different from: Building 1
different from: Building 29
different from: Building 46
different from: Building 50
different from: Building 44a
different from: Building 10
different from: Building 7
different from: Building 47a
different from: Building 53
different from: Building 41
different from: Building 13
different from: Building 56
different from: Building 16
different from: Building 59
different from: Building 47
different from: Building 86
different from: Building 15b
different from: Building 2
different from: Building 34
different from: Building 8
different from: Building 25
different from: Building 37
different from: Building 42
different from: Building 48
different from: Building 52
different from: Building 12

Building 9
type: Building
lat: 50.935406
long: -1.394368
based near: Highfield Campus
type: PhysicalLocation
type: Thing
type: Location
different from: Southampton
different from: Part-II
different from: Part-IV
different from: Part-III
different from: Part-I

Building 45
type: Building
lat: 50.937801
long: -1.394014
based near: Highfield Campus
type: PhysicalLocation
type: Thing
type: Location
different from: Southampton
different from: Part-II
different from: Part-IV
different from: Part-III
different from: Part-I

hasAssignments
comment: not sure about this
range: string
type: DatatypeProperty
domain: ModuleInSession
type: Property
domain: Resource
domain: Module
domain: Thing
range: Resource

Building 53
type: Building
lat: 50.937412
long: -1.398236
based near: Highfield Campus
type: PhysicalLocation
type: Thing
type: Location
different from: Southampton
different from: Part-II
different from: Part-IV
different from: Part-III
different from: Part-I

Building 32
type: Building
lat: 50.936462
long: -1.395913
based near: Highfield Campus
type: PhysicalLocation
type: Thing
type: Location
different from: Southampton
different from: Part-II
different from: Part-IV
different from: Part-III
different from: Part-I

http://lodlaundromat.org/.well-known/genid/samples/jena///class//dc761509450b163119975e1b794c97ac/76a61fdafb1c5f7b6412a1106925b84d#30
rest: http://lodlaundromat.org/.well-known/genid/samples/jena///class//dc761509450b163119975e1b794c97ac/76a61fdafb1c5f7b6412a1106925b84d#24
first: 4

Building 4
type: Building
lat: 50.936012
long: -1.397763
based near: Highfield Campus
type: PhysicalLocation
type: Thing
type: Location
different from: Southampton
different from: Part-II
different from: Part-IV
different from: Part-III
different from: Part-I

Building 58a
type: Building
lat: 50.936817
long: -1.398016
based near: Highfield Campus
type: PhysicalLocation
type: Thing
type: Location
different from: Southampton
different from: Part-II
different from: Part-IV
different from: Part-III
different from: Part-I

Building 40
type: Building
lat: 50.934715
long: -1.397356
based near: Highfield Campus
type: PhysicalLocation
type: Thing
type: Location
different from: Southampton
different from: Part-II
different from: Part-IV
different from: Part-III
different from: Part-I

Building 19
type: Building
lat: 50.935532
long: -1.392826
based near: Highfield Campus
type: PhysicalLocation
type: Thing
type: Location
different from: Southampton
different from: Part-II
different from: Part-IV
different from: Part-III
different from: Part-I

Building 27
type: Building
lat: 50.934334
long: -1.393746
based near: Highfield Campus
type: PhysicalLocation
type: Thing
type: Location
different from: Southampton
different from: Part-II
different from: Part-IV
different from: Part-III
different from: Part-I

Building 48
type: Building
lat: 50.935696
long: -1.399485
based near: Highfield Campus
type: PhysicalLocation
type: Thing
type: Location
different from: Southampton
different from: Part-II
different from: Part-IV
different from: Part-III
different from: Part-I

Building 56
type: Building
lat: 50.936119
long: -1.398536
based near: Highfield Campus
type: PhysicalLocation
type: Thing
type: Location
different from: Southampton
different from: Part-II
different from: Part-IV
different from: Part-III
different from: Part-I

Building 35
type: Building
lat: 50.93383
long: -1.394475
based near: Highfield Campus
type: PhysicalLocation
type: Thing
type: Location
different from: Southampton
different from: Part-II
different from: Part-IV
different from: Part-III
different from: Part-I

http://lodlaundromat.org/.well-known/genid/samples/jena///class//dc761509450b163119975e1b794c97ac/76a61fdafb1c5f7b6412a1106925b84d#33
first: 3
rest: http://lodlaundromat.org/.well-known/genid/samples/jena///class//dc761509450b163119975e1b794c97ac/76a61fdafb1c5f7b6412a1106925b84d#30

Building 14
type: Building
lat: 50.934654
long: -1.395784
based near: Highfield Campus
type: PhysicalLocation
type: Thing
type: Location
different from: Southampton
different from: Part-II
different from: Part-IV
different from: Part-III
different from: Part-I

Building 7
type: Building
lat: 50.93523
long: -1.393756
based near: Highfield Campus
type: PhysicalLocation
type: Thing
type: Location
different from: Southampton
different from: Part-II
different from: Part-IV
different from: Part-III
different from: Part-I

Building 85
type: Building
lat: 50.936436
long: -1.395323
based near: Highfield Campus
type: PhysicalLocation
type: Thing
type: Location
different from: Southampton
different from: Part-II
different from: Part-IV
different from: Part-III
different from: Part-I

Building 43
type: Building
lat: 50.93737
long: -1.395162
based near: Highfield Campus
type: PhysicalLocation
type: Thing
type: Location
different from: Southampton
different from: Part-II
different from: Part-IV
different from: Part-III
different from: Part-I

Building 22
type: Building
lat: 50.935017
long: -1.394196
based near: Highfield Campus
type: PhysicalLocation
type: Thing
type: Location
different from: Southampton
different from: Part-II
different from: Part-IV
different from: Part-III
different from: Part-I

http://lodlaundromat.org/.well-known/genid/samples/jena///class//dc761509450b163119975e1b794c97ac/76a61fdafb1c5f7b6412a1106925b84d#20
rest: nil
first: Part IV

Building 47a
type: Building
lat: 50.934582
long: -1.400236
based near: Highfield Campus
type: PhysicalLocation
type: Thing
type: Location
different from: Southampton
different from: Part-II
different from: Part-IV
different from: Part-III
different from: Part-I

Building 30
type: Building
lat: 50.934307
long: -1.394625
based near: Highfield Campus
type: PhysicalLocation
type: Thing
type: Location
different from: Southampton
different from: Part-II
different from: Part-IV
different from: Part-III
different from: Part-I

http://lodlaundromat.org/.well-known/genid/samples/jena///class//dc761509450b163119975e1b794c97ac/76a61fdafb1c5f7b6412a1106925b84d#28
first: 1
rest: http://lodlaundromat.org/.well-known/genid/samples/jena///class//dc761509450b163119975e1b794c97ac/76a61fdafb1c5f7b6412a1106925b84d#35

Building 2
type: Building
lat: 50.936298
long: -1.398139
based near: Highfield Campus
type: PhysicalLocation
type: Thing
type: Location
different from: Southampton
different from: Part-II
different from: Part-IV
different from: Part-III
different from: Part-I

Building 59
type: Building
lat: 50.937412
long: -1.39786
based near: Highfield Campus
type: PhysicalLocation
type: Thing
type: Location
different from: Southampton
different from: Part-II
different from: Part-IV
different from: Part-III
different from: Part-I

Building 38
type: Building
lat: 50.935314
long: -1.397452
based near: Highfield Campus
type: PhysicalLocation
type: Thing
type: Location
different from: Southampton
different from: Part-II
different from: Part-IV
different from: Part-III
different from: Part-I

Building 17
type: Building
lat: 50.936214
long: -1.394582
based near: Highfield Campus
type: PhysicalLocation
type: Thing
type: Location
different from: Southampton
different from: Part-II
different from: Part-IV
different from: Part-III
different from: Part-I

Building 67
type: Building
lat: 50.936707
long: -1.396658
based near: Highfield Campus
type: PhysicalLocation
type: Thing
type: Location
different from: Southampton
different from: Part-II
different from: Part-IV
different from: Part-III
different from: Part-I

Building 46
type: Building
lat: 50.934799
long: -1.399657
based near: Highfield Campus
type: PhysicalLocation
type: Thing
type: Location
different from: Southampton
different from: Part-II
different from: Part-IV
different from: Part-III
different from: Part-I

Building 25
type: Building
lat: 50.934788
long: -1.393461
based near: Highfield Campus
type: PhysicalLocation
type: Thing
type: Location
different from: Southampton
different from: Part-II
different from: Part-IV
different from: Part-III
different from: Part-I

Building 54
type: Building
lat: 50.93618
long: -1.398949
based near: Highfield Campus
type: PhysicalLocation
type: Thing
type: Location
different from: Southampton
different from: Part-II
different from: Part-IV
different from: Part-III
different from: Part-I

http://lodlaundromat.org/.well-known/genid/samples/jena///class//dc761509450b163119975e1b794c97ac/76a61fdafb1c5f7b6412a1106925b84d#52
rest: http://lodlaundromat.org/.well-known/genid/samples/jena///class//dc761509450b163119975e1b794c97ac/76a61fdafb1c5f7b6412a1106925b84d#19
first: Part II

Building 12
type: Building
lat: 50.935074
long: -1.395822
based near: Highfield Campus
type: PhysicalLocation
type: Thing
type: Location
different from: Southampton
different from: Part-II
different from: Part-IV
different from: Part-III
different from: Part-I

Building 5
type: Building
lat: 50.935547
long: -1.394802
based near: Highfield Campus
type: PhysicalLocation
type: Thing
type: Location
different from: Southampton
different from: Part-II
different from: Part-IV
different from: Part-III
different from: Part-I

Building 41
type: Building
lat: 50.933559
long: -1.395301
based near: Highfield Campus
type: PhysicalLocation
type: Thing
type: Location
different from: Southampton
different from: Part-II
different from: Part-IV
different from: Part-III
different from: Part-I

Building 20
type: Building
lat: 50.936901
long: -1.39514
based near: Highfield Campus
type: PhysicalLocation
type: Thing
type: Location
different from: Southampton
different from: Part-II
different from: Part-IV
different from: Part-III
different from: Part-I

University of Southampton, Highfield Campus
attribution name: University of Southampton, School of Electronics and Computer Science
license: http://creativecommons.org/publicdomain/zero/1.0/
comment: This data is freely available to use and reuse. Please provide an attribution to University of Southampton, if convenient. If you're using this data, we'd love to hear about it at webmaster@ecs.soton.ac.uk. For discussion on our RDF, join http://mailman.ecs.soton.ac.uk/mailman/listinfo/ecsrdf, for annoucements of changes, join http://mailman.ecs.soton.ac.uk/mailman/listinfo/ecsrdf-announce.
created: 2015-02-20T08:51:05Z
rights holder: UoS
publisher: ECS
attribution URL: http://www.ecs.soton.ac.uk/

Building 28
type: Building
lat: 50.934685
long: -1.394513
based near: Highfield Campus
type: PhysicalLocation
type: Thing
type: Location
different from: Southampton
different from: Part-II
different from: Part-IV
different from: Part-III
different from: Part-I

Building 57
type: Building
lat: 50.934399
long: -1.396755
based near: Highfield Campus
type: PhysicalLocation
type: Thing
type: Location
different from: Southampton
different from: Part-II
different from: Part-IV
different from: Part-III
different from: Part-I

Building 15a
type: Building
lat: 50.935932
long: -1.39359
based near: Highfield Campus
type: PhysicalLocation
type: Thing
type: Location
different from: Southampton
different from: Part-II
different from: Part-IV
different from: Part-III
different from: Part-I

Building 36
type: Building
lat: 50.934986
long: -1.395156
based near: Highfield Campus
type: PhysicalLocation
type: Thing
type: Location
different from: Southampton
different from: Part-II
different from: Part-IV
different from: Part-III
different from: Part-I

Highfield Campus
type: Site
lat: 50.935768
long: -1.396229
based near: Southampton

Building 8
type: Building
lat: 50.936554
long: -1.394781
based near: Highfield Campus
type: PhysicalLocation
type: Thing
type: Location
different from: Southampton
different from: Part-II
different from: Part-IV
different from: Part-III
different from: Part-I

Building 86
type: Building
lat: 50.937386
long: -1.396755
based near: Highfield Campus
type: PhysicalLocation
type: Thing
type: Location
different from: Southampton
different from: Part-II
different from: Part-IV
different from: Part-III
different from: Part-I

Building 44
type: Building
lat: 50.934322
long: -1.399062
based near: Highfield Campus
type: PhysicalLocation
type: Thing
type: Location
different from: Southampton
different from: Part-II
different from: Part-IV
different from: Part-III
different from: Part-I

http://lodlaundromat.org/.well-known/genid/samples/jena///class//dc761509450b163119975e1b794c97ac/76a61fdafb1c5f7b6412a1106925b84d#42
first: 1
rest: http://lodlaundromat.org/.well-known/genid/samples/jena///class//dc761509450b163119975e1b794c97ac/76a61fdafb1c5f7b6412a1106925b84d#32

Building 52
type: Building
lat: 50.935879
long: -1.39882
based near: Highfield Campus
type: PhysicalLocation
type: Thing
type: Location
different from: Southampton
different from: Part-II
different from: Part-IV
different from: Part-III
different from: Part-I

Building 10
type: Building
lat: 50.935318
long: -1.39529
based near: Highfield Campus
type: PhysicalLocation
type: Thing
type: Location
different from: Southampton
different from: Part-II
different from: Part-IV
different from: Part-III
different from: Part-I

Building 60
type: Building
lat: 50.937763
long: -1.397485
based near: Highfield Campus
type: PhysicalLocation
type: Thing
type: Location
different from: Southampton
different from: Part-II
different from: Part-IV
different from: Part-III
different from: Part-I

Building 39
type: Building
lat: 50.936722
long: -1.399298
based near: Highfield Campus
type: PhysicalLocation
type: Thing
type: Location
different from: Southampton
different from: Part-II
different from: Part-IV
different from: Part-III
different from: Part-I

Building 18
type: Building
lat: 50.933853
long: -1.396734
based near: Highfield Campus
type: PhysicalLocation
type: Thing
type: Location
different from: Southampton
different from: Part-II
different from: Part-IV
different from: Part-III
different from: Part-I

Building 47
type: Building
lat: 50.934917
long: -1.399974
based near: Highfield Campus
type: PhysicalLocation
type: Thing
type: Location
different from: Southampton
different from: Part-II
different from: Part-IV
different from: Part-III
different from: Part-I

Building 26
type: Building
lat: 50.934727
long: -1.394073
based near: Highfield Campus
type: PhysicalLocation
type: Thing
type: Location
different from: Southampton
different from: Part-II
different from: Part-IV
different from: Part-III
different from: Part-I

http://lodlaundromat.org/.well-known/genid/samples/jena///class//dc761509450b163119975e1b794c97ac/76a61fdafb1c5f7b6412a1106925b84d#24
rest: nil
first: 5

Building 34
type: Building
lat: 50.934509
long: -1.395307
based near: Highfield Campus
type: PhysicalLocation
type: Thing
type: Location
different from: Southampton
different from: Part-II
different from: Part-IV
different from: Part-III
different from: Part-I

http://lodlaundromat.org/.well-known/genid/samples/jena///class//dc761509450b163119975e1b794c97ac/76a61fdafb1c5f7b6412a1106925b84d#32
rest: http://lodlaundromat.org/.well-known/genid/samples/jena///class//dc761509450b163119975e1b794c97ac/76a61fdafb1c5f7b6412a1106925b84d#33
first: 2

Building 13
type: Building
lat: 50.935551
long: -1.393488
based near: Highfield Campus
type: PhysicalLocation
type: Thing
type: Location
different from: Southampton
different from: Part-II
different from: Part-IV
different from: Part-III
different from: Part-I

Building 6
type: Building
lat: 50.93594
long: -1.397195
based near: Highfield Campus
type: PhysicalLocation
type: Thing
type: Location
different from: Southampton
different from: Part-II
different from: Part-IV
different from: Part-III
different from: Part-I

Building 44a
type: Building
lat: 50.93399
long: -1.398692
based near: Highfield Campus
type: PhysicalLocation
type: Thing
type: Location
different from: Southampton
different from: Part-II
different from: Part-IV
different from: Part-III
different from: Part-I

ECS Ontology
type: Ontology
imports: time
comment: The ECS Ontology

http://lodlaundromat.org/.well-known/genid/samples/jena///class//dc761509450b163119975e1b794c97ac/76a61fdafb1c5f7b6412a1106925b84d#19
rest: http://lodlaundromat.org/.well-known/genid/samples/jena///class//dc761509450b163119975e1b794c97ac/76a61fdafb1c5f7b6412a1106925b84d#20
first: Part III

Building 42
type: Building
lat: 50.934219
long: -1.397511
based near: Highfield Campus
type: PhysicalLocation
type: Thing
type: Location
different from: Southampton
different from: Part-II
different from: Part-IV
different from: Part-III
different from: Part-I

Building 21
type: Building
lat: 50.935036
long: -1.39319
based near: Highfield Campus
type: PhysicalLocation
type: Thing
type: Location
different from: Southampton
different from: Part-II
different from: Part-IV
different from: Part-III
different from: Part-I

Building 50
type: Building
lat: 50.936142
long: -1.3994
based near: Highfield Campus
type: PhysicalLocation
type: Thing
type: Location
different from: Southampton
different from: Part-II
different from: Part-IV
different from: Part-III
different from: Part-I

http://lodlaundromat.org/.well-known/genid/samples/jena///class//dc761509450b163119975e1b794c97ac/76a61fdafb1c5f7b6412a1106925b84d#48
rest: http://lodlaundromat.org/.well-known/genid/samples/jena///class//dc761509450b163119975e1b794c97ac/76a61fdafb1c5f7b6412a1106925b84d#52
first: Part I

Building 29
type: Building
lat: 50.93391
long: -1.393987
based near: Highfield Campus
type: PhysicalLocation
type: Thing
type: Location
different from: Southampton
different from: Part-II
different from: Part-IV
different from: Part-III
different from: Part-I

Building 1
type: Building
lat: 50.937691
long: -1.39609
based near: Highfield Campus
type: PhysicalLocation
type: Thing
type: Location
different from: Southampton
different from: Part-II
different from: Part-IV
different from: Part-III
different from: Part-I

Building 58
type: Building
lat: 50.936592
long: -1.398697
based near: Highfield Campus
type: PhysicalLocation
type: Thing
type: Location
different from: Southampton
different from: Part-II
different from: Part-IV
different from: Part-III
different from: Part-I

Building 15b
type: Building
lat: 50.935738
long: -1.39307
based near: Highfield Campus
type: PhysicalLocation
type: Thing
type: Location
different from: Southampton
different from: Part-II
different from: Part-IV
different from: Part-III
different from: Part-I

Building 37
type: Building
lat: 50.933811
long: -1.395687
based near: Highfield Campus
type: PhysicalLocation
type: Thing
type: Location
different from: Southampton
different from: Part-II
different from: Part-IV
different from: Part-III
different from: Part-I

http://lodlaundromat.org/.well-known/genid/samples/jena///class//dc761509450b163119975e1b794c97ac/76a61fdafb1c5f7b6412a1106925b84d#35
rest: nil
first: 2

Building 16
type: Building
lat: 50.937653
long: -1.395645
based near: Highfield Campus
type: PhysicalLocation
type: Thing
type: Location
different from: Southampton
different from: Part-II
different from: Part-IV
different from: Part-III
different from: Part-I