Ontology
subclass of: Resource
type: Class
subclass of: Ontology
deprecated: true
description: information model ontology (deprecated)

Condition
subclass of: Resource
type: Class
description: preconditions of services and operations

Effect
subclass of: Resource
type: Class
description: effects (postconditions) of services and operations

Nonfunctional Parameter
subclass of: Resource
type: Class
description: instances of this class are concrete nonfunctional properties of services

Functional Classification Root
subclass of: Class
description: instances of this class are roots of functionality classification hierarchies
type: Class

WSMO-Lite
imports: msm
created: 2009-04-22
description: This is a lightweight ontology for semantic annotations of services, intended for use with SAWSDL and the Minimal Service Model.
issued: 2009-04-22
version info: 2013-05-30
creator: vitvar.com
type: Ontology
creator: me
imports: sawsdl#
modified: 2013-05-30

uses Ontology
type: Property
domain: Service
sub property of: seeAlso
deprecated: true
description: pointer from a semantic description to an ontology that it uses (deprecated)
domain: Resource