Date Created
sub property of: date
date: 2000-07-11
property disjoint with: bottomDataProperty
Relation: created-003
Date Modified: 2008-01-14
type: DatatypeProperty
date: 2008-01-14
sub property of: topDataProperty
relation: created-003
Has Version: created-003
issued: 2000-07-11
type: Thing
sub property of: Date
range: Literal
comment: Date of creation of the resource.
type: Property

familyName
term status: testing
type: Thing
sub property of: topDataProperty
property disjoint with: bottomDataProperty
type: DatatypeProperty
type: Property
comment: The family name of some person.
domain: Person
range: Literal

Skype ID
term status: testing
type: Thing
sub property of: topDataProperty
sub property of: nickname
property disjoint with: bottomDataProperty
type: DatatypeProperty
type: Property
comment: A Skype ID
domain: Agent
range: Literal

Accrual Method
issued: 2005-06-13
date: 2010-10-11
Has Version: accrualMethod-003
Relation: accrualMethod-003
type: ObjectProperty
Date Modified: 2010-10-11
sub property of: topObjectProperty
date: 2005-06-13
property disjoint with: bottomObjectProperty
type: Thing
relation: accrualMethod-003
type: Property
comment: The method by which items are added to a collection.
domain: Collection
range: Method of Accrual

residence
type: ObjectProperty
sub property of: topObjectProperty
sub property of: P263
sub property of: hasLocation
describedby: definitions.ttl
property disjoint with: bottomObjectProperty
equivalent property: P263
type: Thing
label: verblijfplaats @nl
domain: Person
label: 居住地 @ja
label: miejsce zamieszkania @pl
label: κατοικία @el
range: Place
type: Property
label: Residenz @de
comment: Place of residence of a person.

has function
property disjoint with: container of
property disjoint with: has administrator
property disjoint with: sibling
property disjoint with: moderator of
property disjoint with: usergroup of
sub property of: topObjectProperty
property disjoint with: has host
property disjoint with: has parent
property disjoint with: previous version
property disjoint with: has owner
property disjoint with: has modifier
property disjoint with: has space
property disjoint with: next version
property disjoint with: host of
property disjoint with: next by date
property disjoint with: bottomObjectProperty
property disjoint with: has reply
property disjoint with: administrator of
property disjoint with: reply of
property disjoint with: earlier version
property disjoint with: account
property disjoint with: latest version
property disjoint with: modifier of
property disjoint with: parent of
property disjoint with: has creator
property disjoint with: later version
property disjoint with: has moderator
property disjoint with: previous by date
property disjoint with: member of
type: ObjectProperty
property disjoint with: has member
property disjoint with: has usergroup
property disjoint with: has subscriber
property disjoint with: subscriber of
property disjoint with: follows
property disjoint with: has container
inverse of: function of
comment: A Role that this UserAccount has.
range: Role

email sha1
property disjoint with: content
property disjoint with: num threads
property disjoint with: num items
property disjoint with: title
property disjoint with: created at
property disjoint with: modified at
property disjoint with: description
property disjoint with: subject
sub property of: topDataProperty
property disjoint with: bottomDataProperty
property disjoint with: ip address
property disjoint with: content encoded
type: DatatypeProperty
property disjoint with: last item date
comment: An electronic mail address of the UserAccount, encoded using SHA1.
domain: User Account
range: Literal

Bibliographic Resource
Relation: BibliographicResource-001
date: 2008-01-14
subclass of: Thing
relation: BibliographicResource-001
issued: 2008-01-14
type: Class
Has Version: BibliographicResource-001
type: Thing
disjoint with: Nothing
comment: A book, article, or other documentary resource.

Accrual Periodicity
Date Modified: 2010-10-11
sub property of: topObjectProperty
date: 2010-10-11
issued: 2005-06-13
date: 2005-06-13
type: Thing
Relation: accrualPeriodicity-003
property disjoint with: bottomObjectProperty
Has Version: accrualPeriodicity-003
type: ObjectProperty
relation: accrualPeriodicity-003
type: Property
comment: The frequency with which items are added to a collection.
domain: Collection
range: Frequency

License Document
issued: 2008-01-14
Relation: LicenseDocument-001
subclass of: Rights Statement
relation: LicenseDocument-001
disjoint with: Nothing
type: Thing
type: Class
subclass of: Thing
date: 2008-01-14
Has Version: LicenseDocument-001
comment: A legal document giving official permission to do something with a Resource.

Description
date: 2008-01-14
description: Description may include but is not limited to: an abstract, a table of contents, a graphical representation, or a free-text account of the resource.
Relation: descriptionT-001
relation: descriptionT-001
type: Thing
sub property of: topDataProperty
type: DatatypeProperty
Date Modified: 2008-01-14
property disjoint with: bottomDataProperty
Has Version: descriptionT-001
sub property of: description
issued: 2008-01-14
comment: An account of the resource.
type: Property

has administrator
property disjoint with: attachment
property disjoint with: next by date
property disjoint with: moderator of
property disjoint with: owner of
property disjoint with: embeds knowledge
property disjoint with: avatar
property disjoint with: has reply
type: ObjectProperty
property disjoint with: reference
property disjoint with: reply of
property disjoint with: parent of
property disjoint with: about
property disjoint with: host of
property disjoint with: previous version
property disjoint with: account of
property disjoint with: latest version
property disjoint with: bottomObjectProperty
property disjoint with: container of
property disjoint with: administrator of
property disjoint with: next version
property disjoint with: modifier of
property disjoint with: function of
property disjoint with: has function
inverse of: administrator of
property disjoint with: member of
property disjoint with: scope of
property disjoint with: follows
property disjoint with: subscriber of
property disjoint with: has space
property disjoint with: usergroup of
property disjoint with: has member
property disjoint with: has host
property disjoint with: has parent
property disjoint with: has modifier
sub property of: topObjectProperty
property disjoint with: has usergroup
property disjoint with: email
property disjoint with: has discussion
property disjoint with: sibling
property disjoint with: addressed to
property disjoint with: later version
property disjoint with: creator of
property disjoint with: earlier version
property disjoint with: has scope
property disjoint with: previous by date
property disjoint with: has container
comment: A UserAccount that is an administrator of this Site.
domain: Site
range: User Account

UDC
date: 2008-01-14
relation: UDC-003
date: 2000-07-11
Relation: UDC-003
type: VocabularyEncodingScheme
type: Thing
Has Version: UDC-003
Date Modified: 2008-01-14
issued: 2000-07-11
comment: The set of conceptual resources specified by the Universal Decimal Classification.

Is Replaced By
type: ObjectProperty
sub property of: topObjectProperty
date: 2008-01-14
date: 2000-07-11
sub property of: relation
property disjoint with: bottomObjectProperty
relation: isReplacedBy-003
note: This term is intended to be used with non-literal values as defined in the DCMI Abstract Model (http://dublincore.org/documents/abstract-model/). As of December 2007, the DCMI Usage Board is seeking a way to express this intention with a formal range declaration.
Date Modified: 2008-01-14
issued: 2000-07-11
Relation: isReplacedBy-003
sub property of: Relation
Has Version: isReplacedBy-003
type: Thing
type: Property
comment: A related resource that supplants, displaces, or supersedes the described resource.

interest
term status: testing
type: Thing
sub property of: topObjectProperty
property disjoint with: bottomObjectProperty
type: ObjectProperty
type: Property
comment: A page about a topic of interest to this person.
domain: Agent
range: Document

work info homepage
term status: testing
type: Thing
sub property of: topObjectProperty
property disjoint with: bottomObjectProperty
type: ObjectProperty
type: Property
comment: A work info homepage of some person; a page about their work for some organization.
domain: Person
range: Document

topic
sub property of: topObjectProperty
sub property of: Subject
sub property of: subject
property disjoint with: bottomObjectProperty
type: ObjectProperty
comment: A topic of interest, linking to the appropriate URI, e.g. in the Open Directory Project or of a SKOS category.

title
term status: testing
type: Thing
sub property of: topDataProperty
property disjoint with: bottomDataProperty
type: DatatypeProperty
type: Property
comment: Title (Mr, Mrs, Ms, Dr. etc)

Has Part
property disjoint with: bottomObjectProperty
relation: hasPart-003
Date Modified: 2008-01-14
Relation: hasPart-003
type: ObjectProperty
date: 2000-07-11
type: Thing
issued: 2000-07-11
note: This term is intended to be used with non-literal values as defined in the DCMI Abstract Model (http://dublincore.org/documents/abstract-model/). As of December 2007, the DCMI Usage Board is seeking a way to express this intention with a formal range declaration.
sub property of: relation
date: 2008-01-14
Has Version: hasPart-003
sub property of: topObjectProperty
sub property of: Relation
type: Property
comment: A related resource that is included either physically or logically in the described resource.

account service homepage
term status: testing
type: Thing
sub property of: topObjectProperty
property disjoint with: bottomObjectProperty
type: ObjectProperty
type: Property
comment: Indicates a homepage of the service provide for this online account.
domain: Online Account
range: Document

funded by
term status: archaic
type: Thing
sub property of: topObjectProperty
property disjoint with: bottomObjectProperty
type: ObjectProperty
type: Property
comment: An organization funding a project or person.
domain: Thing
range: Thing

Agent
type: Thing
date: 2008-01-14
Has Version: Agent-001
type: Agent Class
subclass of: Agent
description: Examples of Agent include person, organization, and software agent.
subclass of: Thing
issued: 2008-01-14
Relation: Agent-001
relation: Agent-001
type: Class
disjoint with: Nothing
equivalent class: Agent
comment: A resource that acts or has the power to act.

Forum
disjoint with: Role
disjoint with: Usergroup
subclass of: Thing
disjoint with: Nothing
disjoint with: Post
disjoint with: User Account
type: Class
disjoint with: User
disjoint with: Item
subclass of: Container
comment: A discussion area on which Posts or entries are made.

Site
disjoint with: Role
subclass of: Thing
subclass of: Space
disjoint with: User
type: Class
disjoint with: Post
disjoint with: Nothing
disjoint with: Item
disjoint with: Usergroup
disjoint with: User Account
comment: A Site can be the location of an online community or set of communities, with UserAccounts and Usergroups creating Items in a set of Containers. It can be thought of as a web-accessible data Space.

personal mailbox
term status: stable
type: Thing
sub property of: topObjectProperty
property disjoint with: bottomObjectProperty
type: InverseFunctionalProperty
type: ObjectProperty
type: Property
comment: A personal mailbox, ie. an Internet mailbox associated with exactly one owner, the first owner of this mailbox. This is a 'static inverse functional property', in that there is (across time and change) at most one individual that ever has any particular value for foaf:mbox.
domain: Agent
range: Thing

lastName
term status: testing
type: Thing
sub property of: topDataProperty
property disjoint with: bottomDataProperty
type: DatatypeProperty
type: Property
comment: The last name of a person.
domain: Person
range: Literal

member
term status: stable
type: Thing
sub property of: topObjectProperty
property disjoint with: bottomObjectProperty
type: ObjectProperty
type: Property
comment: Indicates a member of a Group
domain: Group
range: Agent

has modifier
property disjoint with: bottomObjectProperty
property disjoint with: sibling
property disjoint with: has host
property disjoint with: scope of
property disjoint with: has moderator
property disjoint with: usergroup of
property disjoint with: moderator of
property disjoint with: has administrator
property disjoint with: has member
property disjoint with: previous version
property disjoint with: earlier version
property disjoint with: has usergroup
property disjoint with: parent of
type: ObjectProperty
property disjoint with: member of
property disjoint with: has reply
property disjoint with: modifier of
property disjoint with: account of
property disjoint with: creator of
property disjoint with: latest version
property disjoint with: next version
property disjoint with: space of
property disjoint with: email
property disjoint with: avatar
property disjoint with: has scope
property disjoint with: next by date
sub property of: topObjectProperty
property disjoint with: has subscriber
property disjoint with: function of
property disjoint with: previous by date
inverse of: modifier of
property disjoint with: container of
property disjoint with: later version
property disjoint with: has space
property disjoint with: host of
property disjoint with: has function
property disjoint with: reply of
property disjoint with: subscriber of
property disjoint with: follows
property disjoint with: owner of
property disjoint with: has container
property disjoint with: administrator of
property disjoint with: has parent
comment: A UserAccount that modified this Item.
domain: Item
range: User Account

Source
note: This term is intended to be used with non-literal values as defined in the DCMI Abstract Model (http://dublincore.org/documents/abstract-model/). As of December 2007, the DCMI Usage Board is seeking a way to express this intention with a formal range declaration.
relation: sourceT-001
description: The described resource may be derived from the related resource in whole or in part. Recommended best practice is to identify the related resource by means of a string conforming to a formal identification system.
property disjoint with: bottomObjectProperty
date: 2008-01-14
sub property of: source
sub property of: Relation
issued: 2008-01-14
sub property of: topObjectProperty
sub property of: relation
type: ObjectProperty
Relation: sourceT-001
Date Modified: 2008-01-14
type: Thing
Has Version: sourceT-001
comment: A related resource from which the described resource is derived.
type: Property

account of
type: ObjectProperty
property disjoint with: reference
property disjoint with: has host
sub property of: topObjectProperty
property disjoint with: has parent
property disjoint with: host of
property disjoint with: has discussion
property disjoint with: has scope
property disjoint with: attachment
property disjoint with: latest version
inverse of: account
property disjoint with: parent of
property disjoint with: usergroup of
property disjoint with: later version
property disjoint with: has subscriber
property disjoint with: reply of
property disjoint with: about
property disjoint with: has member
property disjoint with: previous by date
property disjoint with: has administrator
property disjoint with: earlier version
property disjoint with: next by date
property disjoint with: addressed to
property disjoint with: next version
property disjoint with: bottomObjectProperty
property disjoint with: has moderator
property disjoint with: container of
property disjoint with: sibling
property disjoint with: function of
property disjoint with: has reply
property disjoint with: has container
property disjoint with: has modifier
property disjoint with: previous version
property disjoint with: has usergroup
property disjoint with: embeds knowledge
property disjoint with: space of
comment: Refers to the foaf:Agent or foaf:Person who owns this sioc:UserAccount.
domain: User Account
range: Agent

Physical Resource
date: 2008-01-14
relation: PhysicalResource-001
subclass of: Thing
type: Class
type: Thing
Has Version: PhysicalResource-001
issued: 2008-01-14
Relation: PhysicalResource-001
disjoint with: Nothing
comment: A material thing.

Relation
note: This term is intended to be used with non-literal values as defined in the DCMI Abstract Model (http://dublincore.org/documents/abstract-model/). As of December 2007, the DCMI Usage Board is seeking a way to express this intention with a formal range declaration.
description: Recommended best practice is to identify the related resource by means of a string conforming to a formal identification system.
relation: relationT-001
date: 2008-01-14
type: Thing
type: ObjectProperty
Has Version: relationT-001
sub property of: relation
property disjoint with: bottomObjectProperty
issued: 2008-01-14
Date Modified: 2008-01-14
sub property of: topObjectProperty
Relation: relationT-001
comment: A related resource.
type: Property

Work
disjoint with: Nothing
equivalent class: Work
subclass of: Thing
subclass of: Work
type: Class
comment: a potentially copyrightable work

previous by date
property disjoint with: has subscriber
property disjoint with: scope of
property disjoint with: modifier of
property disjoint with: has member
property disjoint with: email
property disjoint with: function of
property disjoint with: has owner
property disjoint with: has usergroup
property disjoint with: has container
type: ObjectProperty
property disjoint with: bottomObjectProperty
property disjoint with: has space
property disjoint with: follows
sub property of: topObjectProperty
property disjoint with: subscriber of
property disjoint with: has creator
property disjoint with: container of
property disjoint with: has modifier
property disjoint with: host of
property disjoint with: space of
property disjoint with: has moderator
property disjoint with: has scope
property disjoint with: parent of
property disjoint with: usergroup of
property disjoint with: account
property disjoint with: administrator of
property disjoint with: owner of
property disjoint with: has function
property disjoint with: has host
property disjoint with: creator of
property disjoint with: avatar
property disjoint with: has parent
property disjoint with: moderator of
property disjoint with: has administrator
property disjoint with: account of
inverse of: next by date
property disjoint with: member of
comment: Previous Item or Post in a given Container sorted by date.
domain: Item
range: Item

Is Part Of
issued: 2000-07-11
date: 2000-07-11
sub property of: relation
sub property of: topObjectProperty
sub property of: Relation
date: 2008-01-14
Date Modified: 2008-01-14
type: ObjectProperty
note: This term is intended to be used with non-literal values as defined in the DCMI Abstract Model (http://dublincore.org/documents/abstract-model/). As of December 2007, the DCMI Usage Board is seeking a way to express this intention with a formal range declaration.
type: Thing
Has Version: isPartOf-003
Relation: isPartOf-003
property disjoint with: bottomObjectProperty
relation: isPartOf-003
type: Property
comment: A related resource in which the described resource is physically or logically included.

Requirement
disjoint with: Nothing
equivalent class: Requirement
subclass of: Thing
subclass of: Requirement
type: Class
comment: an action that may or may not be requested of you

weblog
sub property of: page
term status: testing
type: Thing
property disjoint with: bottomObjectProperty
type: InverseFunctionalProperty
type: ObjectProperty
sub property of: topObjectProperty
type: Property
range: Document
comment: A weblog of some thing (whether person, group, company etc.).
domain: Agent

Surname
term status: archaic
type: Thing
sub property of: topDataProperty
property disjoint with: bottomDataProperty
type: DatatypeProperty
type: Property
comment: The surname of some person.
domain: Person
range: Literal

Media Type
disjoint with: Nothing
subclass of: Media Type or Extent
type: Class
date: 2008-01-14
relation: MediaType-001
subclass of: Thing
type: Thing
Has Version: MediaType-001
Relation: MediaType-001
issued: 2008-01-14
comment: A file format or physical medium.

Online Account
term status: testing
type: Thing
disjoint with: Nothing
subclass of: Thing
type: Class
comment: An online account.

note
sub property of: topDataProperty
property disjoint with: bottomDataProperty
type: DatatypeProperty
comment: A note associated with this resource, for example, if it has been edited by a UserAccount.
range: Literal

reference
property disjoint with: has member
property disjoint with: email
property disjoint with: creator of
property disjoint with: has host
property disjoint with: bottomObjectProperty
property disjoint with: has usergroup
property disjoint with: avatar
property disjoint with: usergroup of
property disjoint with: owner of
type: ObjectProperty
property disjoint with: follows
property disjoint with: account of
property disjoint with: has administrator
property disjoint with: container of
sub property of: topObjectProperty
property disjoint with: moderator of
property disjoint with: has scope
property disjoint with: has parent
property disjoint with: function of
property disjoint with: administrator of
property disjoint with: parent of
property disjoint with: subscriber of
property disjoint with: has moderator
property disjoint with: member of
property disjoint with: space of
property disjoint with: modifier of
property disjoint with: host of
property disjoint with: has subscriber
type: DeprecatedProperty
comment: Links either created explicitly or extracted implicitly on the HTML level from the Post.
domain: Post
version info: Renamed to sioc:links_to.

Agent Class
date: 2008-01-14
description: Examples of Agent Class include groups seen as classes, such as students, women, charities, lecturers.
relation: AgentClass-003
Relation: AgentClass-003
subclass of: Thing
disjoint with: Nothing
Has Version: AgentClass-003
issued: 2008-01-14
date: 2012-06-14
type: Class
Date Modified: 2012-06-14
type: Thing
subclass of: Class
comment: A group of agents.

Table Of Contents
Relation: tableOfContents-003
date: 2008-01-14
property disjoint with: bottomDataProperty
relation: tableOfContents-003
sub property of: description
date: 2000-07-11
sub property of: Description
Date Modified: 2008-01-14
type: Thing
type: DatatypeProperty
Has Version: tableOfContents-003
issued: 2000-07-11
sub property of: topDataProperty
type: Property
comment: A list of subunits of the resource.

member of
property disjoint with: has parent
property disjoint with: previous version
property disjoint with: follows
property disjoint with: reply of
property disjoint with: has modifier
property disjoint with: has usergroup
property disjoint with: has moderator
property disjoint with: has host
property disjoint with: has space
property disjoint with: scope of
property disjoint with: function of
property disjoint with: administrator of
property disjoint with: next by date
property disjoint with: has scope
property disjoint with: account
property disjoint with: usergroup of
property disjoint with: previous by date
property disjoint with: has container
property disjoint with: has administrator
property disjoint with: embeds knowledge
property disjoint with: subscriber of
property disjoint with: parent of
property disjoint with: earlier version
property disjoint with: has creator
property disjoint with: latest version
property disjoint with: sibling
property disjoint with: modifier of
property disjoint with: has discussion
inverse of: has member
property disjoint with: moderator of
type: ObjectProperty
property disjoint with: about
property disjoint with: has reply
property disjoint with: space of
property disjoint with: later version
property disjoint with: has function
property disjoint with: has owner
property disjoint with: has member
property disjoint with: bottomObjectProperty
sub property of: topObjectProperty
property disjoint with: attachment
property disjoint with: has subscriber
property disjoint with: container of
property disjoint with: host of
property disjoint with: addressed to
property disjoint with: reference
property disjoint with: next version
comment: A Usergroup that this UserAccount is a member of.
domain: User Account
range: Usergroup

RFC 5646
issued: 2010-10-11
description: RFC 5646 obsoletes RFC 4646.
Relation: RFC5646-001
date: 2010-10-11
type: Thing
Has Version: RFC5646-001
relation: RFC5646-001
type: Datatype
comment: The set of tags constructed according to RFC 5646 for the identification of languages.

Date Copyrighted
sub property of: topDataProperty
date: 2008-01-14
date: 2002-07-13
sub property of: Date
property disjoint with: bottomDataProperty
relation: dateCopyrighted-002
type: Thing
sub property of: date
issued: 2002-07-13
type: DatatypeProperty
Date Modified: 2008-01-14
Has Version: dateCopyrighted-002
Relation: dateCopyrighted-002
range: Literal
type: Property
comment: Date of copyright.

Coverage
type: Thing
relation: coverageT-001
type: ObjectProperty
date: 2008-01-14
Has Version: coverageT-001
Date Modified: 2008-01-14
Relation: coverageT-001
sub property of: coverage
property disjoint with: bottomObjectProperty
sub property of: topObjectProperty
description: Spatial topic and spatial applicability may be a named place or a location specified by its geographic coordinates. Temporal topic may be a named period, date, or date range. A jurisdiction may be a named administrative entity or a geographic place to which the resource applies. Recommended best practice is to use a controlled vocabulary such as the Thesaurus of Geographic Names [TGN]. Where appropriate, named places or time periods can be used in preference to numeric identifiers such as sets of coordinates or date ranges.
issued: 2008-01-14
comment: The spatial or temporal topic of the resource, the spatial applicability of the resource, or the jurisdiction under which the resource is relevant.
type: Property
range: Location, Period, or Jurisdiction

NLM
Has Version: NLM-002
issued: 2005-06-13
date: 2005-06-13
date: 2008-01-14
Relation: NLM-002
type: VocabularyEncodingScheme
Date Modified: 2008-01-14
type: Thing
relation: NLM-002
comment: The set of conceptual resources specified by the National Library of Medicine Classification.

Accrual Policy
relation: accrualPolicy-003
Has Version: accrualPolicy-003
type: ObjectProperty
date: 2005-06-13
issued: 2005-06-13
type: Thing
property disjoint with: bottomObjectProperty
sub property of: topObjectProperty
date: 2010-10-11
Relation: accrualPolicy-003
Date Modified: 2010-10-11
type: Property
comment: The policy governing the addition of items to a collection.
domain: Collection
range: Policy

link
sub property of: topObjectProperty
property disjoint with: bottomObjectProperty
type: ObjectProperty
comment: A URI of a document which contains this SIOC object.

Online Chat Account
term status: unstable
type: Thing
disjoint with: Nothing
subclass of: Thing
subclass of: Online Account
type: Class
comment: An online chat account.

Attribution
disjoint with: Nothing
type: Requirement
subclass of: Attribution
subclass of: Thing
type: Thing
type: Class
equivalent class: Attribution
comment: credit be given to copyright holder and/or author

DNA checksum
term status: archaic
type: Thing
sub property of: topDataProperty
property disjoint with: bottomDataProperty
type: DatatypeProperty
type: Property
comment: A checksum for the DNA of some thing. Joke.
range: Literal

Post
disjoint with: Role
disjoint with: Site
disjoint with: Forum
disjoint with: Community
disjoint with: Usergroup
type: Class
subclass of: Document
disjoint with: Container
disjoint with: Thread
disjoint with: Space
disjoint with: Project
subclass of: Item
disjoint with: Organization
disjoint with: User Account
disjoint with: Nothing
subclass of: Thing
disjoint with: User
comment: An article or message that can be posted to a Forum.

membershipClass
term status: unstable
type: Thing
type: Property
type: AnnotationProperty
comment: Indicates the class of individuals that are a member of a Group

Community
disjoint with: Post
disjoint with: User
disjoint with: Role
type: Class
subclass of: Thing
disjoint with: Item
disjoint with: Nothing
disjoint with: User Account
comment: Community is a high-level concept that defines an online community and what it consists of.

Creator
sub property of: maker
type: ObjectProperty
Date Modified: 2010-10-11
Has Version: creatorT-002
type: Thing
sub property of: topObjectProperty
date: 2010-10-11
date: 2008-01-14
equivalent property: maker
description: Examples of a Creator include a person, an organization, or a service.
issued: 2008-01-14
sub property of: Contributor
sub property of: creator
property disjoint with: bottomObjectProperty
relation: creatorT-002
sub property of: contributor
inverse of: made
Relation: creatorT-002
comment: An entity primarily responsible for making the resource.
type: Property
range: Agent

knows
term status: stable
type: Thing
sub property of: topObjectProperty
property disjoint with: bottomObjectProperty
type: ObjectProperty
type: Property
comment: A person known by this person (indicating some level of reciprocated interaction between the parties).
domain: Person
range: Person

jurisdiction
sub property of: topObjectProperty
property disjoint with: bottomObjectProperty
type: ObjectProperty
type: Property
domain: License
range: Jurisdiction

Provenance
date: 2008-01-14
Has Version: provenance-002
Relation: provenance-002
issued: 2004-09-20
type: Thing
description: The statement may include a description of any changes successive custodians made to the resource.
sub property of: topObjectProperty
Date Modified: 2008-01-14
relation: provenance-002
type: ObjectProperty
date: 2004-09-20
property disjoint with: bottomObjectProperty
type: Property
comment: A statement of any changes in ownership and custody of the resource since its creation that are significant for its authenticity, integrity, and interpretation.
range: Provenance Statement

plan
term status: testing
type: Thing
sub property of: topDataProperty
property disjoint with: bottomDataProperty
type: DatatypeProperty
type: Property
comment: Aplan comment, in the tradition of finger and '.plan' files.
domain: Person
range: Literal

function of
type: ObjectProperty
property disjoint with: administrator of
property disjoint with: next version
property disjoint with: host of
property disjoint with: sibling
property disjoint with: has administrator
property disjoint with: has subscriber
property disjoint with: owner of
property disjoint with: has moderator
property disjoint with: has parent
property disjoint with: avatar
property disjoint with: embeds knowledge
property disjoint with: container of
property disjoint with: reply of
property disjoint with: modifier of
property disjoint with: creator of
sub property of: topObjectProperty
property disjoint with: parent of
property disjoint with: later version
property disjoint with: previous version
property disjoint with: previous by date
property disjoint with: next by date
property disjoint with: bottomObjectProperty
property disjoint with: has reply
property disjoint with: attachment
property disjoint with: reference
property disjoint with: account of
property disjoint with: addressed to
property disjoint with: usergroup of
property disjoint with: has discussion
property disjoint with: email
property disjoint with: has container
property disjoint with: has usergroup
property disjoint with: has host
property disjoint with: subscriber of
inverse of: has function
property disjoint with: member of
property disjoint with: has member
property disjoint with: has modifier
property disjoint with: latest version
property disjoint with: earlier version
property disjoint with: about
property disjoint with: space of
property disjoint with: moderator of
property disjoint with: follows
comment: A UserAccount that has this Role.
domain: Role

created at
property disjoint with: first name
property disjoint with: bottomDataProperty
property disjoint with: last name
property disjoint with: last item date
sub property of: topDataProperty
property disjoint with: num threads
property disjoint with: num items
property disjoint with: email sha1
type: DatatypeProperty
type: DeprecatedProperty
comment: When this was created, in ISO 8601 format.
domain: Post
range: Literal
version info: This property is deprecated. Use dcterms:created from the Dublin Core ontology instead.

sha1sum (hex)
term status: unstable
type: Thing
sub property of: topDataProperty
property disjoint with: bottomDataProperty
type: DatatypeProperty
type: Property
comment: A sha1sum hash, in hex.
domain: Document

Given name
term status: archaic
type: Thing
sub property of: topDataProperty
property disjoint with: bottomDataProperty
type: DatatypeProperty
type: Property
comment: The given name of some person.

page
term status: testing
type: Thing
sub property of: topObjectProperty
property disjoint with: bottomObjectProperty
inverse of: topic
type: ObjectProperty
type: Property
comment: A page or document about this thing.
domain: Thing
range: Document

LCC
Date Modified: 2008-01-14
issued: 2000-07-11
date: 2000-07-11
type: Thing
relation: LCC-003
date: 2008-01-14
Relation: LCC-003
Has Version: LCC-003
type: VocabularyEncodingScheme
comment: The set of conceptual resources specified by the Library of Congress Classification.

has creator
property disjoint with: has function
property disjoint with: reply of
property disjoint with: bottomObjectProperty
property disjoint with: previous version
property disjoint with: host of
inverse of: creator of
property disjoint with: previous by date
property disjoint with: has space
property disjoint with: subscriber of
property disjoint with: has host
property disjoint with: usergroup of
property disjoint with: has parent
type: ObjectProperty
property disjoint with: scope of
property disjoint with: earlier version
property disjoint with: has container
property disjoint with: next version
property disjoint with: modifier of
property disjoint with: next by date
property disjoint with: container of
property disjoint with: parent of
property disjoint with: member of
property disjoint with: latest version
property disjoint with: has reply
property disjoint with: later version
sub property of: topObjectProperty
property disjoint with: moderator of
property disjoint with: has usergroup
property disjoint with: sibling
property disjoint with: administrator of
comment: This is the UserAccount that made this resource.
range: User Account

Usergroup
disjoint with: Role
disjoint with: Space
type: Class
disjoint with: Item
subclass of: Thing
disjoint with: Thread
disjoint with: Nothing
disjoint with: Post
disjoint with: User Account
disjoint with: Forum
disjoint with: Site
disjoint with: User
disjoint with: Container
comment: A set of UserAccounts whose owners have a common purpose or interest. Can be used for access control purposes.

container of
property disjoint with: has modifier
property disjoint with: reply of
property disjoint with: has space
property disjoint with: addressed to
property disjoint with: modifier of
property disjoint with: bottomObjectProperty
property disjoint with: has parent
property disjoint with: has function
property disjoint with: has discussion
property disjoint with: previous version
property disjoint with: embeds knowledge
property disjoint with: moderator of
property disjoint with: member of
property disjoint with: later version
property disjoint with: reference
property disjoint with: email
property disjoint with: attachment
property disjoint with: account
property disjoint with: owner of
property disjoint with: avatar
property disjoint with: has usergroup
property disjoint with: scope of
property disjoint with: next version
property disjoint with: parent of
property disjoint with: administrator of
property disjoint with: has moderator
property disjoint with: subscriber of
property disjoint with: has subscriber
property disjoint with: next by date
type: ObjectProperty
property disjoint with: has owner
property disjoint with: earlier version
property disjoint with: account of
property disjoint with: has host
property disjoint with: about
sub property of: topObjectProperty
property disjoint with: previous by date
property disjoint with: follows
property disjoint with: has reply
property disjoint with: has administrator
property disjoint with: has container
property disjoint with: has member
property disjoint with: sibling
property disjoint with: function of
property disjoint with: creator of
property disjoint with: latest version
property disjoint with: has creator
property disjoint with: usergroup of
inverse of: has container
property disjoint with: host of
property disjoint with: has scope
comment: An Item that this Container contains.
domain: Container
range: Item

Title
date: 2008-01-14
date: 2010-10-11
sub property of: topDataProperty
Date Modified: 2010-10-11
sub property of: title
type: DatatypeProperty
issued: 2008-01-14
property disjoint with: bottomDataProperty
Has Version: titleT-002
Relation: titleT-002
type: Thing
relation: titleT-002
type: Property
comment: A name given to the resource.
range: Literal

IMT
issued: 2000-07-11
Relation: IMT-004
date: 2000-07-11
date: 2008-01-14
Date Modified: 2008-01-14
type: VocabularyEncodingScheme
Has Version: IMT-004
type: Thing
relation: IMT-004
comment: The set of media types specified by the Internet Assigned Numbers Authority.

Prohibition
disjoint with: Nothing
equivalent class: Prohibition
subclass of: Thing
subclass of: Prohibition
type: Class
comment: something you may be asked not to do

Location, Period, or Jurisdiction
date: 2008-01-14
disjoint with: Nothing
type: Thing
issued: 2008-01-14
Has Version: LocationPeriodOrJurisdiction-001
Relation: LocationPeriodOrJurisdiction-001
relation: LocationPeriodOrJurisdiction-001
subclass of: Thing
type: Class
comment: A location, period of time, or jurisdiction.

Medium
Relation: medium-003
relation: medium-003
date: 2000-07-11
issued: 2000-07-11
type: ObjectProperty
property disjoint with: bottomObjectProperty
sub property of: topObjectProperty
Has Version: medium-003
date: 2008-01-14
sub property of: Format
type: Thing
Date Modified: 2008-01-14
sub property of: format
range: Physical Medium
comment: The material or physical carrier of the resource.
domain: Physical Resource
type: Property

Derivative Works
type: Permission
subclass of: DerivativeWorks
subclass of: Thing
type: Class
equivalent class: DerivativeWorks
disjoint with: Nothing
type: Thing
comment: distribution of derivative works

ICQ chat ID
sub property of: nickname
term status: testing
type: Thing
property disjoint with: bottomDataProperty
sub property of: topDataProperty
type: InverseFunctionalProperty
type: DatatypeProperty
domain: Agent
range: Literal
comment: An ICQ chat ID
type: Property

follows
property disjoint with: next version
property disjoint with: has parent
property disjoint with: container of
property disjoint with: subscriber of
property disjoint with: attachment
property disjoint with: embeds knowledge
property disjoint with: has discussion
property disjoint with: next by date
property disjoint with: has subscriber
property disjoint with: member of
property disjoint with: previous by date
property disjoint with: has usergroup
property disjoint with: moderator of
property disjoint with: usergroup of
property disjoint with: later version
property disjoint with: has member
property disjoint with: has function
sub property of: topObjectProperty
property disjoint with: sibling
property disjoint with: reply of
property disjoint with: space of
property disjoint with: previous version
property disjoint with: host of
property disjoint with: about
property disjoint with: has modifier
property disjoint with: reference
type: ObjectProperty
property disjoint with: function of
property disjoint with: modifier of
property disjoint with: earlier version
property disjoint with: has space
property disjoint with: has moderator
property disjoint with: has scope
property disjoint with: parent of
property disjoint with: scope of
property disjoint with: addressed to
property disjoint with: has host
property disjoint with: bottomObjectProperty
property disjoint with: latest version
property disjoint with: has container
property disjoint with: administrator of
property disjoint with: has administrator
property disjoint with: has reply
comment: Indicates that one UserAccount follows another UserAccount (e.g. for microblog posts or other content item updates).
domain: User Account
range: User Account

Date Available
Relation: available-003
date: 2008-01-14
type: Thing
property disjoint with: bottomDataProperty
date: 2000-07-11
issued: 2000-07-11
Has Version: available-003
sub property of: date
Date Modified: 2008-01-14
relation: available-003
type: DatatypeProperty
sub property of: topDataProperty
sub property of: Date
comment: Date (often a range) that the resource became or will become available.
type: Property
range: Literal

account
property disjoint with: container of
property disjoint with: bottomObjectProperty
property disjoint with: has parent
property disjoint with: parent of
type: ObjectProperty
type: Thing
property disjoint with: has space
property disjoint with: administrator of
property disjoint with: modifier of
property disjoint with: moderator of
property disjoint with: later version
property disjoint with: has reply
property disjoint with: subscriber of
property disjoint with: scope of
property disjoint with: host of
sub property of: topObjectProperty
property disjoint with: next version
property disjoint with: has host
property disjoint with: next by date
property disjoint with: member of
property disjoint with: has container
term status: testing
property disjoint with: earlier version
property disjoint with: latest version
inverse of: account of
property disjoint with: usergroup of
property disjoint with: reply of
property disjoint with: has function
property disjoint with: sibling
property disjoint with: previous version
property disjoint with: has usergroup
property disjoint with: previous by date
type: Property
comment: Indicates an account held by this agent.
domain: Agent
range: Online Account

High Income Nation Use
type: Prohibition
type: Thing
comment: use in a non-developing country

Has Format
sub property of: topObjectProperty
relation: hasFormat-003
type: ObjectProperty
issued: 2000-07-11
Relation: hasFormat-003
date: 2000-07-11
date: 2008-01-14
Date Modified: 2008-01-14
type: Thing
property disjoint with: bottomObjectProperty
Has Version: hasFormat-003
sub property of: Relation
note: This term is intended to be used with non-literal values as defined in the DCMI Abstract Model (http://dublincore.org/documents/abstract-model/). As of December 2007, the DCMI Usage Board is seeking a way to express this intention with a formal range declaration.
sub property of: relation
type: Property
comment: A related resource that is substantially the same as the pre-existing described resource, but in another format.

homepage
sub property of: topObjectProperty
term status: stable
sub property of: page
sub property of: is primary topic of
type: Thing
property disjoint with: bottomObjectProperty
type: ObjectProperty
type: InverseFunctionalProperty
comment: A homepage for some thing.
range: Document
type: Property
domain: Thing

Label Property
term status: unstable
type: Thing
disjoint with: Nothing
subclass of: Thing
type: Class
comment: A foaf:LabelProperty is any RDF property with texual values that serve as labels.

Linguistic System
type: Class
description: Examples include written, spoken, sign, and computer languages.
relation: LinguisticSystem-001
Relation: LinguisticSystem-001
Has Version: LinguisticSystem-001
issued: 2008-01-14
subclass of: Thing
disjoint with: Nothing
type: Thing
date: 2008-01-14
comment: A system of signs, symbols, sounds, gestures, or rules used in communication.

has subscriber
property disjoint with: scope of
property disjoint with: later version
property disjoint with: reply of
property disjoint with: has modifier
property disjoint with: creator of
property disjoint with: embeds knowledge
property disjoint with: member of
property disjoint with: earlier version
property disjoint with: moderator of
property disjoint with: modifier of
sub property of: topObjectProperty
property disjoint with: administrator of
property disjoint with: has container
property disjoint with: reference
property disjoint with: latest version
property disjoint with: has usergroup
property disjoint with: subscriber of
property disjoint with: account of
property disjoint with: host of
property disjoint with: bottomObjectProperty
property disjoint with: owner of
property disjoint with: has reply
property disjoint with: follows
property disjoint with: has discussion
property disjoint with: about
property disjoint with: email
property disjoint with: addressed to
property disjoint with: sibling
property disjoint with: attachment
property disjoint with: previous version
inverse of: subscriber of
property disjoint with: usergroup of
property disjoint with: previous by date
property disjoint with: avatar
property disjoint with: has scope
property disjoint with: next by date
property disjoint with: has space
property disjoint with: has function
property disjoint with: function of
type: ObjectProperty
property disjoint with: has host
property disjoint with: has parent
property disjoint with: next version
property disjoint with: has member
property disjoint with: container of
property disjoint with: parent of
comment: A UserAccount that is subscribed to this Container.
domain: Container
range: User Account

DDC
issued: 2000-07-11
date: 2000-07-11
relation: DDC-003
type: Thing
Has Version: DDC-003
Relation: DDC-003
date: 2008-01-14
Date Modified: 2008-01-14
type: VocabularyEncodingScheme
comment: The set of conceptual resources specified by the Dewey Decimal Classification.

PersonalProfileDocument
term status: testing
disjoint with: Nothing
disjoint with: Project
type: Thing
subclass of: Thing
type: Class
subclass of: Document
disjoint with: Organization
comment: A personal profile RDF document.

Lesser Copyleft
type: Requirement
type: Thing
comment: derivative works must be licensed under specified terms, with at least the same conditions as the original work; combinations with the work may be licensed under different terms

has member
property disjoint with: owner of
property disjoint with: about
property disjoint with: bottomObjectProperty
property disjoint with: has reply
property disjoint with: next version
sub property of: topObjectProperty
property disjoint with: usergroup of
property disjoint with: sibling
property disjoint with: follows
property disjoint with: container of
property disjoint with: creator of
property disjoint with: administrator of
property disjoint with: avatar
property disjoint with: reply of
property disjoint with: later version
property disjoint with: account of
property disjoint with: scope of
property disjoint with: previous by date
property disjoint with: space of
property disjoint with: next by date
property disjoint with: modifier of
property disjoint with: subscriber of
property disjoint with: has subscriber
property disjoint with: embeds knowledge
inverse of: member of
property disjoint with: function of
type: ObjectProperty
property disjoint with: has administrator
property disjoint with: attachment
property disjoint with: email
property disjoint with: has space
property disjoint with: addressed to
property disjoint with: has modifier
property disjoint with: earlier version
property disjoint with: previous version
property disjoint with: latest version
property disjoint with: host of
property disjoint with: member of
property disjoint with: has scope
property disjoint with: parent of
property disjoint with: has usergroup
property disjoint with: has function
property disjoint with: has container
property disjoint with: has parent
property disjoint with: reference
property disjoint with: has discussion
property disjoint with: has moderator
property disjoint with: moderator of
property disjoint with: has host
comment: A UserAccount that is a member of this Usergroup.
domain: Usergroup
range: User Account

Container
disjoint with: Item
disjoint with: Post
disjoint with: User Account
subclass of: Thing
disjoint with: Role
type: Class
disjoint with: User
disjoint with: Usergroup
disjoint with: Nothing
comment: An area in which content Items are contained.

Source Code
equivalent class: SourceCode
subclass of: SourceCode
type: Thing
type: Requirement
subclass of: Thing
type: Class
disjoint with: Nothing
comment: source code (the preferred form for making modifications) must be provided when exercising some rights granted by the license.

SIOC Core Ontology Namespace
description: SIOC (Semantically-Interlinked Online Communities) is an ontology for describing the information in online communities. This information can be used to export information from online communities and to link them together. The scope of the application areas that SIOC can be used for includes (and is not limited to) weblogs, message boards, mailing lists and chat channels.
type: Thing
type: Ontology
version info: Revision: 1.35

scope of
property disjoint with: has modifier
property disjoint with: has administrator
property disjoint with: member of
property disjoint with: has reply
property disjoint with: has container
property disjoint with: usergroup of
property disjoint with: has subscriber
property disjoint with: account
property disjoint with: has parent
property disjoint with: administrator of
property disjoint with: next by date
property disjoint with: has moderator
property disjoint with: latest version
property disjoint with: has member
property disjoint with: bottomObjectProperty
sub property of: topObjectProperty
inverse of: has scope
property disjoint with: earlier version
property disjoint with: modifier of
property disjoint with: follows
property disjoint with: container of
property disjoint with: has owner
property disjoint with: host of
property disjoint with: next version
property disjoint with: subscriber of
type: ObjectProperty
property disjoint with: sibling
property disjoint with: previous version
property disjoint with: moderator of
property disjoint with: has creator
property disjoint with: later version
property disjoint with: previous by date
property disjoint with: has host
property disjoint with: parent of
property disjoint with: has usergroup
property disjoint with: has space
property disjoint with: reply of
comment: A Role that has a scope of this resource.
range: Role

permits
sub property of: topObjectProperty
property disjoint with: bottomObjectProperty
sub property of: permits
equivalent property: permits
type: ObjectProperty
type: Property
domain: License
range: Permission

theme
term status: archaic
type: Thing
sub property of: topObjectProperty
property disjoint with: bottomObjectProperty
type: ObjectProperty
type: Property
comment: A theme.
domain: Thing
range: Thing

File Format
type: Thing
type: Class
date: 2008-01-14
relation: FileFormat-001
description: Examples include the formats defined by the list of Internet Media Types.
subclass of: Media Type
Has Version: FileFormat-001
issued: 2008-01-14
disjoint with: Nothing
subclass of: Media Type or Extent
subclass of: Thing
Relation: FileFormat-001
comment: A digital resource format.

modified at
property disjoint with: num threads
property disjoint with: last item date
type: DatatypeProperty
property disjoint with: num items
property disjoint with: first name
property disjoint with: email sha1
property disjoint with: bottomDataProperty
property disjoint with: last name
sub property of: topDataProperty
type: DeprecatedProperty
comment: When this was modified, in ISO 8601 format.
domain: Post
range: Literal
version info: This property is deprecated. Use dcterms:modified from the Dublin Core ontology instead.

topic
term status: testing
type: Thing
sub property of: topObjectProperty
property disjoint with: bottomObjectProperty
inverse of: page
type: ObjectProperty
type: Property
comment: A topic of some page or document.
domain: Document
range: Thing

RFC 4646
relation: RFC4646-001
date: 2008-01-14
description: RFC 4646 obsoletes RFC 3066.
issued: 2008-01-14
Has Version: RFC4646-001
type: Thing
Relation: RFC4646-001
type: Datatype
comment: The set of tags constructed according to RFC 4646 for the identification of languages.

Frequency
subclass of: Thing
disjoint with: Nothing
type: Class
Relation: Frequency-001
relation: Frequency-001
type: Thing
date: 2008-01-14
Has Version: Frequency-001
issued: 2008-01-14
comment: A rate at which something recurs.

next by date
property disjoint with: administrator of
property disjoint with: subscriber of
property disjoint with: bottomObjectProperty
property disjoint with: moderator of
property disjoint with: has owner
property disjoint with: space of
property disjoint with: has member
property disjoint with: has subscriber
property disjoint with: usergroup of
property disjoint with: modifier of
property disjoint with: scope of
property disjoint with: has modifier
property disjoint with: has space
property disjoint with: has usergroup
type: ObjectProperty
property disjoint with: avatar
property disjoint with: account
property disjoint with: has creator
property disjoint with: function of
property disjoint with: has function
property disjoint with: has scope
property disjoint with: has moderator
property disjoint with: owner of
property disjoint with: has parent
property disjoint with: host of
property disjoint with: email
inverse of: previous by date
property disjoint with: member of
property disjoint with: follows
property disjoint with: container of
property disjoint with: has container
property disjoint with: has administrator
property disjoint with: account of
property disjoint with: creator of
property disjoint with: parent of
property disjoint with: has host
sub property of: topObjectProperty
comment: Next Item or Post in a given Container sorted by date.
domain: Item
range: Item

maker
sub property of: topObjectProperty
equivalent property: Creator
sub property of: Creator
term status: stable
sub property of: contributor
sub property of: creator
inverse of: made
property disjoint with: bottomObjectProperty
type: Thing
type: ObjectProperty
sub property of: Contributor
comment: An agent that made this thing.
domain: Thing
type: Property
range: Agent

Bibliographic Citation
date: 2003-02-15
date: 2008-01-14
Has Version: bibliographicCitation-002
description: Recommended practice is to include sufficient bibliographic detail to identify the resource as unambiguously as possible.
sub property of: topDataProperty
sub property of: identifier
property disjoint with: bottomDataProperty
type: Thing
Relation: bibliographicCitation-002
issued: 2003-02-15
Date Modified: 2008-01-14
type: DatatypeProperty
sub property of: Identifier
relation: bibliographicCitation-002
range: Literal
domain: Bibliographic Resource
comment: A bibliographic reference for the resource.
type: Property

Replaces
Has Version: replaces-003
date: 2000-07-11
note: This term is intended to be used with non-literal values as defined in the DCMI Abstract Model (http://dublincore.org/documents/abstract-model/). As of December 2007, the DCMI Usage Board is seeking a way to express this intention with a formal range declaration.
type: ObjectProperty
Date Modified: 2008-01-14
date: 2008-01-14
property disjoint with: bottomObjectProperty
sub property of: relation
sub property of: Relation
type: Thing
sub property of: topObjectProperty
Relation: replaces-003
relation: replaces-003
issued: 2000-07-11
comment: A related resource that is supplanted, displaced, or superseded by the described resource.
type: Property

has license
type: ObjectProperty
sub property of: License
equivalent property: license
property disjoint with: bottomObjectProperty
sub property of: license
sub property of: Rights
type: Thing
sub property of: topObjectProperty
sub property of: rights
type: Property
domain: Work
range: License

DCMI Box
date: 2008-01-14
Date Modified: 2008-01-14
Has Version: Box-003
issued: 2000-07-11
relation: Box-003
date: 2000-07-11
Relation: Box-003
type: Thing
type: Datatype
comment: The set of regions in space defined by their geographic coordinates according to the DCMI Box Encoding Scheme.

administrator of
property disjoint with: attachment
property disjoint with: later version
property disjoint with: host of
property disjoint with: has reply
property disjoint with: member of
property disjoint with: latest version
property disjoint with: function of
property disjoint with: reply of
property disjoint with: space of
property disjoint with: about
sub property of: topObjectProperty
property disjoint with: has discussion
property disjoint with: has owner
property disjoint with: has member
property disjoint with: bottomObjectProperty
property disjoint with: earlier version
property disjoint with: has subscriber
property disjoint with: modifier of
property disjoint with: parent of
type: ObjectProperty
property disjoint with: previous by date
property disjoint with: reference
property disjoint with: has modifier
property disjoint with: embeds knowledge
property disjoint with: scope of
property disjoint with: container of
property disjoint with: has administrator
property disjoint with: has scope
inverse of: has administrator
property disjoint with: sibling
property disjoint with: has creator
property disjoint with: has moderator
property disjoint with: has parent
property disjoint with: usergroup of
property disjoint with: has usergroup
property disjoint with: has container
property disjoint with: account
property disjoint with: has function
property disjoint with: next by date
property disjoint with: next version
property disjoint with: previous version
property disjoint with: has host
property disjoint with: addressed to
property disjoint with: follows
comment: A Site that the UserAccount is an administrator of.
domain: User Account
range: Site

DCMI Metadata Terms - other
date: 2012-06-14
Date Modified: 2012-06-14
publisher: DCMI
type: Thing

num threads
property disjoint with: content encoded
property disjoint with: subject
sub property of: topDataProperty
property disjoint with: modified at
property disjoint with: ip address
type: DatatypeProperty
property disjoint with: created at
property disjoint with: title
property disjoint with: description
property disjoint with: first name
property disjoint with: last name
property disjoint with: content
property disjoint with: email sha1
property disjoint with: bottomDataProperty
comment: The number of Threads (AKA discussion topics) in a Forum.
domain: Forum
range: nonNegativeInteger

openid
type: ObjectProperty
term status: testing
sub property of: page
property disjoint with: bottomObjectProperty
type: InverseFunctionalProperty
sub property of: is primary topic of
sub property of: topObjectProperty
type: Thing
range: Document
type: Property
domain: Agent
comment: An OpenID for an Agent.

Temporal Coverage
sub property of: Coverage
date: 2008-01-14
Has Version: temporal-003
date: 2000-07-11
property disjoint with: bottomObjectProperty
issued: 2000-07-11
Date Modified: 2008-01-14
sub property of: topObjectProperty
relation: temporal-003
type: Thing
sub property of: coverage
Relation: temporal-003
type: ObjectProperty
type: Property
range: Period of Time
comment: Temporal characteristics of the resource.

ISO 639-2
Has Version: ISO639-2-003
Date Modified: 2008-01-14
date: 2008-01-14
type: Thing
date: 2000-07-11
relation: ISO639-2-003
issued: 2000-07-11
Relation: ISO639-2-003
type: Datatype
comment: The three-letter alphabetic codes listed in ISO639-2 for the representation of names of languages.

Notice
subclass of: Notice
equivalent class: Notice
type: Thing
type: Requirement
disjoint with: Nothing
type: Class
subclass of: Thing
comment: copyright and license notices be kept intact

Date Valid
relation: valid-003
sub property of: topDataProperty
date: 2000-07-11
Relation: valid-003
issued: 2000-07-11
type: DatatypeProperty
sub property of: date
Date Modified: 2008-01-14
sub property of: Date
date: 2008-01-14
property disjoint with: bottomDataProperty
Has Version: valid-003
type: Thing
type: Property
range: Literal
comment: Date (often a range) of validity of a resource.

space of
property disjoint with: has reply
property disjoint with: sibling
property disjoint with: reference
property disjoint with: creator of
property disjoint with: has discussion
property disjoint with: usergroup of
inverse of: has space
type: ObjectProperty
property disjoint with: administrator of
property disjoint with: has modifier
property disjoint with: earlier version
property disjoint with: member of
property disjoint with: next by date
property disjoint with: has container
property disjoint with: follows
property disjoint with: has member
property disjoint with: attachment
property disjoint with: embeds knowledge
property disjoint with: about
property disjoint with: moderator of
property disjoint with: subscriber of
property disjoint with: account of
property disjoint with: addressed to
property disjoint with: function of
property disjoint with: latest version
property disjoint with: next version
property disjoint with: modifier of
property disjoint with: previous version
property disjoint with: bottomObjectProperty
property disjoint with: has scope
property disjoint with: later version
property disjoint with: previous by date
property disjoint with: reply of
property disjoint with: email
sub property of: topObjectProperty
property disjoint with: avatar
property disjoint with: owner of
comment: A resource which belongs to this data Space.
domain: Space

RFC 3066
type: Thing
date: 2002-07-13
relation: RFC3066-002
description: RFC 3066 has been obsoleted by RFC 4646.
Has Version: RFC3066-002
Relation: RFC3066-002
Date Modified: 2008-01-14
date: 2008-01-14
issued: 2002-07-13
type: Datatype
comment: The set of tags constructed according to RFC 3066 for the identification of languages.

birthday
term status: unstable
type: Thing
sub property of: topDataProperty
property disjoint with: bottomDataProperty
type: FunctionalProperty
type: DatatypeProperty
type: Property
comment: The birthday of this Agent, represented in mm-dd string form, eg. '12-31'.
domain: Agent
range: Literal

related to
sub property of: topObjectProperty
property disjoint with: bottomObjectProperty
type: ObjectProperty
comment: Related Posts for this Post, perhaps determined implicitly from topics or references.

num items
type: DatatypeProperty
property disjoint with: last name
property disjoint with: ip address
property disjoint with: content
property disjoint with: email sha1
property disjoint with: created at
property disjoint with: bottomDataProperty
property disjoint with: description
property disjoint with: first name
property disjoint with: title
property disjoint with: content encoded
property disjoint with: modified at
sub property of: topDataProperty
property disjoint with: subject
comment: The number of Posts (or Items) in a Forum (or a Container).
domain: Container
range: nonNegativeInteger

last reply date
sub property of: Date
sub property of: topDataProperty
sub property of: date
property disjoint with: bottomDataProperty
type: DatatypeProperty
comment: The date and time of the last reply Post or Comment, which could be associated with a starter Item or Post or with a Thread, and expressed in ISO 8601 format.
range: Literal

Commercial Use
type: Class
subclass of: CommercialUse
disjoint with: Nothing
subclass of: Thing
type: Prohibition
equivalent class: CommercialUse
type: Thing
comment: exercising rights for commercial purposes

Role
disjoint with: Container
disjoint with: Forum
disjoint with: Post
subclass of: Thing
disjoint with: Community
disjoint with: User
disjoint with: User Account
disjoint with: Usergroup
disjoint with: Item
disjoint with: Nothing
type: Class
disjoint with: Space
disjoint with: Thread
disjoint with: Site
comment: A Role is a function of a UserAccount within a scope of a particular Forum, Site, etc.

Extent
sub property of: topObjectProperty
relation: extent-003
issued: 2000-07-11
date: 2000-07-11
Has Version: extent-003
Date Modified: 2008-01-14
date: 2008-01-14
type: ObjectProperty
Relation: extent-003
type: Thing
sub property of: format
property disjoint with: bottomObjectProperty
sub property of: Format
type: Property
comment: The size or duration of the resource.
range: Size or Duration

has owner
property disjoint with: has function
property disjoint with: has reply
type: ObjectProperty
property disjoint with: moderator of
property disjoint with: later version
property disjoint with: has host
sub property of: topObjectProperty
property disjoint with: bottomObjectProperty
property disjoint with: previous version
inverse of: owner of
property disjoint with: earlier version
property disjoint with: has parent
property disjoint with: reply of
property disjoint with: container of
property disjoint with: next by date
property disjoint with: host of
property disjoint with: latest version
property disjoint with: scope of
property disjoint with: sibling
property disjoint with: administrator of
property disjoint with: parent of
property disjoint with: has container
property disjoint with: has space
property disjoint with: modifier of
property disjoint with: member of
property disjoint with: subscriber of
property disjoint with: previous by date
property disjoint with: usergroup of
property disjoint with: next version
property disjoint with: has usergroup
comment: A UserAccount that this resource is owned by.
range: User Account

earlier version
property disjoint with: account of
property disjoint with: scope of
type: ObjectProperty
property disjoint with: avatar
property disjoint with: moderator of
property disjoint with: member of
type: TransitiveProperty
property disjoint with: modifier of
property disjoint with: administrator of
property disjoint with: has function
property disjoint with: host of
property disjoint with: follows
property disjoint with: has creator
sub property of: topObjectProperty
property disjoint with: account
property disjoint with: has modifier
inverse of: later version
property disjoint with: has parent
property disjoint with: creator of
property disjoint with: has scope
property disjoint with: subscriber of
property disjoint with: has space
property disjoint with: has owner
property disjoint with: parent of
property disjoint with: container of
property disjoint with: space of
property disjoint with: has container
property disjoint with: function of
property disjoint with: has subscriber
property disjoint with: email
property disjoint with: usergroup of
property disjoint with: has usergroup
property disjoint with: has administrator
property disjoint with: bottomObjectProperty
property disjoint with: owner of
property disjoint with: has moderator
property disjoint with: has member
property disjoint with: has host
comment: Links to a previous (older) revision of this Item or Post.
domain: Item
range: Item

Media Type or Extent
Has Version: MediaTypeOrExtent-001
issued: 2008-01-14
Relation: MediaTypeOrExtent-001
subclass of: Thing
date: 2008-01-14
relation: MediaTypeOrExtent-001
type: Thing
type: Class
disjoint with: Nothing
comment: A media type or extent.

URI
Has Version: URI-003
date: 2000-07-11
date: 2008-01-14
type: Thing
Date Modified: 2008-01-14
relation: URI-003
Relation: URI-003
issued: 2000-07-11
type: Datatype
comment: The set of identifiers constructed according to the generic syntax for Uniform Resource Identifiers as specified by the Internet Engineering Task Force.

moderator of
property disjoint with: container of
property disjoint with: modifier of
property disjoint with: has discussion
property disjoint with: account
property disjoint with: addressed to
property disjoint with: parent of
property disjoint with: about
property disjoint with: latest version
property disjoint with: next by date
property disjoint with: has parent
property disjoint with: has container
property disjoint with: attachment
property disjoint with: has creator
property disjoint with: follows
property disjoint with: has member
property disjoint with: has modifier
property disjoint with: embeds knowledge
property disjoint with: has function
property disjoint with: has reply
property disjoint with: has administrator
property disjoint with: reference
property disjoint with: space of
property disjoint with: previous by date
type: ObjectProperty
property disjoint with: member of
property disjoint with: has scope
property disjoint with: scope of
property disjoint with: later version
property disjoint with: earlier version
property disjoint with: reply of
property disjoint with: has subscriber
property disjoint with: host of
inverse of: has moderator
property disjoint with: has moderator
property disjoint with: previous version
property disjoint with: next version
property disjoint with: sibling
sub property of: topObjectProperty
property disjoint with: has owner
property disjoint with: usergroup of
property disjoint with: has host
property disjoint with: function of
property disjoint with: bottomObjectProperty
property disjoint with: has usergroup
comment: A Forum that a UserAccount is a moderator of.
domain: User Account
range: Forum

Date
type: DatatypeProperty
issued: 2008-01-14
description: Date may be used to express temporal information at any level of granularity. Recommended best practice is to use an encoding scheme, such as the W3CDTF profile of ISO 8601 [W3CDTF].
Relation: dateT-001
sub property of: topDataProperty
Has Version: dateT-001
Date Modified: 2008-01-14
date: 2008-01-14
property disjoint with: bottomDataProperty
type: Thing
sub property of: date
relation: dateT-001
comment: A point or period of time associated with an event in the lifecycle of the resource.
type: Property
range: Literal

W3C-DTF
relation: W3CDTF-003
Date Modified: 2008-01-14
date: 2008-01-14
Relation: W3CDTF-003
date: 2000-07-11
issued: 2000-07-11
type: Thing
Has Version: W3CDTF-003
type: Datatype
comment: The set of dates and times constructed according to the W3C Date and Time Formats Specification.

Physical Medium
relation: PhysicalMedium-001
type: Class
date: 2008-01-14
description: Examples include paper, canvas, or DVD.
subclass of: Media Type or Extent
subclass of: Media Type
issued: 2008-01-14
subclass of: Thing
type: Thing
disjoint with: Nothing
Relation: PhysicalMedium-001
Has Version: PhysicalMedium-001
comment: A physical material or carrier.

name
sub property of: topDataProperty
property disjoint with: bottomDataProperty
type: DatatypeProperty
comment: The name of a SIOC concept instance, e.g. a username for a UserAccount, group name for a Usergroup, etc.
range: Literal

deprecated on
sub property of: topObjectProperty
property disjoint with: bottomObjectProperty
type: ObjectProperty
type: Property
domain: License
range: date

owner of
property disjoint with: container of
property disjoint with: embeds knowledge
sub property of: topObjectProperty
property disjoint with: earlier version
property disjoint with: has container
property disjoint with: attachment
property disjoint with: next version
property disjoint with: addressed to
property disjoint with: usergroup of
property disjoint with: has moderator
property disjoint with: has subscriber
property disjoint with: has reply
property disjoint with: reference
property disjoint with: bottomObjectProperty
property disjoint with: has parent
property disjoint with: next by date
property disjoint with: reply of
property disjoint with: space of
inverse of: has owner
property disjoint with: has modifier
property disjoint with: function of
property disjoint with: previous by date
type: ObjectProperty
property disjoint with: later version
property disjoint with: parent of
property disjoint with: has administrator
property disjoint with: about
property disjoint with: has scope
property disjoint with: sibling
property disjoint with: previous version
property disjoint with: has member
property disjoint with: has discussion
property disjoint with: host of
property disjoint with: latest version
property disjoint with: has host
property disjoint with: has usergroup
comment: A resource owned by a particular UserAccount, for example, a weblog or image gallery.
domain: User Account

Access Rights
date: 2003-02-15
type: ObjectProperty
relation: accessRights-002
sub property of: topObjectProperty
issued: 2003-02-15
type: Thing
Relation: accessRights-002
description: Access Rights may include information regarding access or restrictions based on privacy, security, or other policies.
date: 2008-01-14
sub property of: rights
sub property of: Rights
Date Modified: 2008-01-14
Has Version: accessRights-002
property disjoint with: bottomObjectProperty
range: Rights Statement
type: Property
comment: Information about who can access the resource or an indication of its security status.

creator of
property disjoint with: has scope
property disjoint with: reply of
property disjoint with: container of
property disjoint with: space of
property disjoint with: host of
property disjoint with: function of
property disjoint with: usergroup of
property disjoint with: previous version
type: ObjectProperty
sub property of: topObjectProperty
property disjoint with: has reply
property disjoint with: earlier version
property disjoint with: attachment
property disjoint with: has moderator
property disjoint with: addressed to
property disjoint with: next version
property disjoint with: has administrator
property disjoint with: has container
property disjoint with: sibling
property disjoint with: has host
property disjoint with: next by date
property disjoint with: has parent
property disjoint with: reference
property disjoint with: has subscriber
property disjoint with: has member
property disjoint with: about
property disjoint with: previous by date
property disjoint with: has discussion
property disjoint with: has usergroup
property disjoint with: has modifier
property disjoint with: bottomObjectProperty
inverse of: has creator
property disjoint with: embeds knowledge
property disjoint with: parent of
property disjoint with: later version
property disjoint with: latest version
comment: A resource that the UserAccount is a creator of.
domain: User Account

feed
sub property of: topObjectProperty
property disjoint with: bottomObjectProperty
type: ObjectProperty
comment: A feed (e.g. RSS, Atom, etc.) pertaining to this resource (e.g. for a Forum, Site, UserAccount, etc.).

has space
property disjoint with: has creator
property disjoint with: has administrator
property disjoint with: has subscriber
property disjoint with: later version
property disjoint with: next by date
property disjoint with: reply of
property disjoint with: container of
property disjoint with: has function
property disjoint with: sibling
property disjoint with: earlier version
property disjoint with: member of
inverse of: space of
property disjoint with: previous version
property disjoint with: has moderator
property disjoint with: account
property disjoint with: follows
property disjoint with: has member
property disjoint with: latest version
type: ObjectProperty
property disjoint with: modifier of
property disjoint with: next version
property disjoint with: has reply
property disjoint with: has modifier
property disjoint with: has usergroup
property disjoint with: scope of
property disjoint with: bottomObjectProperty
sub property of: topObjectProperty
property disjoint with: previous by date
property disjoint with: has owner
comment: A data Space which this resource is a part of.
range: Space

embeds knowledge
property disjoint with: administrator of
property disjoint with: member of
property disjoint with: has moderator
property disjoint with: has subscriber
property disjoint with: usergroup of
type: ObjectProperty
property disjoint with: parent of
property disjoint with: moderator of
property disjoint with: avatar
property disjoint with: space of
property disjoint with: bottomObjectProperty
property disjoint with: email
property disjoint with: has parent
sub property of: topObjectProperty
property disjoint with: owner of
property disjoint with: modifier of
property disjoint with: subscriber of
property disjoint with: account of
property disjoint with: creator of
property disjoint with: follows
property disjoint with: function of
property disjoint with: has usergroup
property disjoint with: container of
property disjoint with: host of
property disjoint with: has administrator
property disjoint with: has scope
property disjoint with: has member
property disjoint with: has host
comment: This links Items to embedded statements, facts and structured content.
domain: Item
range: Graph

Online E-commerce Account
term status: unstable
type: Thing
disjoint with: Nothing
subclass of: Thing
subclass of: Online Account
type: Class
comment: An online e-commerce account.

Friend of a Friend (FOAF) vocabulary
description: The Friend of a Friend (FOAF) RDF vocabulary, described using W3C RDF Schema and the Web Ontology Language.
type: Thing
type: Ontology

Provenance Statement
type: Thing
issued: 2008-01-14
Has Version: ProvenanceStatement-001
Relation: ProvenanceStatement-001
type: Class
subclass of: Thing
disjoint with: Nothing
date: 2008-01-14
relation: ProvenanceStatement-001
comment: A statement of any changes in ownership and custody of a resource since its creation that are significant for its authenticity, integrity, and interpretation.

TGN
date: 2000-07-11
Has Version: TGN-003
relation: TGN-003
Date Modified: 2008-01-14
date: 2008-01-14
type: Thing
Relation: TGN-003
type: VocabularyEncodingScheme
issued: 2000-07-11
comment: The set of places specified by the Getty Thesaurus of Geographic Names.

Jurisdiction
Relation: Jurisdiction-001
date: 2008-01-14
subclass of: Location, Period, or Jurisdiction
issued: 2008-01-14
Has Version: Jurisdiction-001
subclass of: Thing
type: Class
relation: Jurisdiction-001
type: Thing
disjoint with: Nothing
comment: The extent or range of judicial, law enforcement, or other authority.

content encoded
property disjoint with: num items
property disjoint with: last item date
property disjoint with: num threads
type: DatatypeProperty
property disjoint with: bottomDataProperty
property disjoint with: first name
property disjoint with: last name
sub property of: topDataProperty
property disjoint with: email sha1
type: DeprecatedProperty
comment: The encoded content of the Post, contained in CDATA areas.
domain: Post
range: Literal
version info: This property is deprecated. Use content:encoded from the RSS 1.0 content module instead.

DCMI Type Vocabulary
Date Modified: 2012-06-14
Has Version: DCMIType-005
type: Thing
date: 2012-06-14
date: 2000-07-11
relation: DCMIType-005
type: VocabularyEncodingScheme
Relation: DCMIType-005
issued: 2000-07-11
comment: The set of classes specified by the DCMI Type Vocabulary, used to categorize the nature or genre of the resource.

Group
type: Thing
subclass of: Agent
disjoint with: Nothing
type: Class
subclass of: Thing
term status: stable
comment: A class of Agents.

subscriber of
property disjoint with: next by date
property disjoint with: previous by date
property disjoint with: modifier of
property disjoint with: attachment
property disjoint with: host of
property disjoint with: space of
property disjoint with: scope of
property disjoint with: has administrator
property disjoint with: parent of
type: ObjectProperty
property disjoint with: has modifier
property disjoint with: has creator
property disjoint with: latest version
property disjoint with: has discussion
property disjoint with: earlier version
property disjoint with: has container
property disjoint with: reply of
property disjoint with: later version
property disjoint with: sibling
property disjoint with: has owner
property disjoint with: bottomObjectProperty
sub property of: topObjectProperty
property disjoint with: follows
property disjoint with: previous version
property disjoint with: embeds knowledge
property disjoint with: has scope
property disjoint with: addressed to
property disjoint with: function of
property disjoint with: about
property disjoint with: next version
property disjoint with: reference
property disjoint with: has parent
property disjoint with: usergroup of
property disjoint with: account
property disjoint with: has subscriber
property disjoint with: has reply
property disjoint with: has host
inverse of: has subscriber
property disjoint with: has usergroup
property disjoint with: has moderator
property disjoint with: has member
property disjoint with: container of
property disjoint with: has function
property disjoint with: member of
comment: A Container that a UserAccount is subscribed to.
domain: User Account
range: Container

workplace homepage
term status: testing
type: Thing
sub property of: topObjectProperty
property disjoint with: bottomObjectProperty
type: ObjectProperty
type: Property
comment: A workplace homepage of some person; the homepage of an organization they work for.
domain: Person
range: Document

Language
sub property of: topObjectProperty
description: Recommended best practice is to use a controlled vocabulary such as RFC 4646 [RFC4646].
Date Modified: 2008-01-14
Relation: languageT-001
Has Version: languageT-001
relation: languageT-001
date: 2008-01-14
type: ObjectProperty
sub property of: language
type: Thing
issued: 2008-01-14
property disjoint with: bottomObjectProperty
type: Property
comment: A language of the resource.
range: Linguistic System

has scope
property disjoint with: about
property disjoint with: later version
property disjoint with: subscriber of
type: ObjectProperty
property disjoint with: owner of
property disjoint with: host of
property disjoint with: usergroup of
property disjoint with: parent of
property disjoint with: modifier of
sub property of: topObjectProperty
property disjoint with: has reply
property disjoint with: has administrator
property disjoint with: follows
property disjoint with: member of
property disjoint with: has container
property disjoint with: reply of
property disjoint with: previous version
property disjoint with: has modifier
property disjoint with: moderator of
property disjoint with: addressed to
property disjoint with: next version
property disjoint with: has usergroup
property disjoint with: sibling
property disjoint with: container of
property disjoint with: email
property disjoint with: bottomObjectProperty
property disjoint with: account of
property disjoint with: has parent
property disjoint with: has discussion
property disjoint with: has subscriber
property disjoint with: reference
property disjoint with: latest version
property disjoint with: next by date
property disjoint with: has host
property disjoint with: creator of
inverse of: scope of
property disjoint with: has moderator
property disjoint with: earlier version
property disjoint with: has member
property disjoint with: space of
property disjoint with: administrator of
property disjoint with: attachment
property disjoint with: previous by date
property disjoint with: avatar
property disjoint with: embeds knowledge
comment: A resource that this Role applies to.
domain: Role

later version
property disjoint with: has administrator
property disjoint with: follows
property disjoint with: avatar
property disjoint with: owner of
inverse of: earlier version
property disjoint with: function of
property disjoint with: moderator of
property disjoint with: has moderator
property disjoint with: has subscriber
property disjoint with: has owner
property disjoint with: parent of
property disjoint with: has creator
property disjoint with: container of
property disjoint with: usergroup of
property disjoint with: modifier of
property disjoint with: has scope
property disjoint with: has space
type: TransitiveProperty
property disjoint with: creator of
property disjoint with: host of
property disjoint with: scope of
type: ObjectProperty
property disjoint with: has host
property disjoint with: has parent
property disjoint with: subscriber of
sub property of: topObjectProperty
property disjoint with: member of
property disjoint with: has usergroup
property disjoint with: administrator of
property disjoint with: account of
property disjoint with: has member
property disjoint with: has function
property disjoint with: space of
property disjoint with: bottomObjectProperty
property disjoint with: has modifier
property disjoint with: account
property disjoint with: has container
property disjoint with: email
comment: Links to a later (newer) revision of this Item or Post.
domain: Item
range: Item

account
term status: archaic
type: Thing
sub property of: topObjectProperty
property disjoint with: bottomObjectProperty
type: ObjectProperty
type: Property
comment: Indicates an account held by this agent.
domain: Agent
range: Online Account

User Account
type: Class
disjoint with: Role
subclass of: Thing
disjoint with: Site
equivalent class: User
subclass of: Online Account
subclass of: User
disjoint with: Thread
disjoint with: Usergroup
disjoint with: Nothing
disjoint with: Space
disjoint with: Community
disjoint with: Forum
disjoint with: Container
disjoint with: Post
disjoint with: Item
comment: A user account in an online community site.

Image
type: Class
disjoint with: Organization
subclass of: Thing
type: Thing
disjoint with: Project
subclass of: Document
disjoint with: Nothing
term status: testing
comment: An image.

Person
term status: stable
subclass of: SpatialThing
disjoint with: Nothing
subclass of: Agent
disjoint with: Project
subclass of: Person
subclass of: Thing
type: Class
type: Thing
disjoint with: Organization
comment: A person.

Thread
type: Class
disjoint with: Post
disjoint with: Usergroup
disjoint with: Nothing
disjoint with: Role
disjoint with: User
disjoint with: Item
subclass of: Container
subclass of: Thing
disjoint with: User Account
comment: A container for a series of threaded discussion Posts or Items.

phone
term status: testing
type: Thing
sub property of: topObjectProperty
property disjoint with: bottomObjectProperty
type: ObjectProperty
type: Property
comment: A phone, specified using fully qualified tel: URI scheme (refs: http://www.w3.org/Addressing/schemes.html#tel).

Given name
term status: testing
type: Thing
sub property of: topDataProperty
property disjoint with: bottomDataProperty
type: DatatypeProperty
type: Property
comment: The given name of some person.

Distribution
type: Permission
disjoint with: Nothing
type: Class
type: Thing
subclass of: Thing
subclass of: Distribution
equivalent class: Distribution
comment: distribution, public display, and publicly performance

Is Required By
date: 2000-07-11
date: 2008-01-14
property disjoint with: bottomObjectProperty
relation: isRequiredBy-003
Relation: isRequiredBy-003
Date Modified: 2008-01-14
sub property of: relation
note: This term is intended to be used with non-literal values as defined in the DCMI Abstract Model (http://dublincore.org/documents/abstract-model/). As of December 2007, the DCMI Usage Board is seeking a way to express this intention with a formal range declaration.
Has Version: isRequiredBy-003
sub property of: topObjectProperty
type: ObjectProperty
issued: 2000-07-11
sub property of: Relation
type: Thing
comment: A related resource that requires the described resource to support its function, delivery, or coherence.
type: Property

depicts
term status: testing
type: Thing
sub property of: topObjectProperty
property disjoint with: bottomObjectProperty
inverse of: depiction
type: ObjectProperty
type: Property
comment: A thing depicted in this representation.
domain: Image
range: Thing

ISO 639-3
date: 2008-01-14
relation: ISO639-3-001
Has Version: ISO639-3-001
Relation: ISO639-3-001
issued: 2008-01-14
type: Thing
type: Datatype
comment: The set of three-letter codes listed in ISO 639-3 for the representation of names of languages.

sibling
property disjoint with: has moderator
property disjoint with: has owner
property disjoint with: space of
property disjoint with: has parent
property disjoint with: has host
property disjoint with: has scope
property disjoint with: has container
property disjoint with: has usergroup
property disjoint with: owner of
type: ObjectProperty
property disjoint with: has space
property disjoint with: parent of
property disjoint with: modifier of
property disjoint with: has member
property disjoint with: bottomObjectProperty
property disjoint with: email
sub property of: topObjectProperty
property disjoint with: has subscriber
property disjoint with: has function
property disjoint with: function of
property disjoint with: has modifier
property disjoint with: has creator
property disjoint with: subscriber of
property disjoint with: administrator of
property disjoint with: scope of
property disjoint with: account
type: SymmetricProperty
property disjoint with: account of
property disjoint with: usergroup of
property disjoint with: follows
property disjoint with: member of
property disjoint with: creator of
property disjoint with: has administrator
property disjoint with: host of
property disjoint with: moderator of
property disjoint with: container of
property disjoint with: avatar
comment: An Item may have a sibling or a twin that exists in a different Container, but the siblings may differ in some small way (for example, language, category, etc.). The sibling of this Item should be self-describing (that is, it should contain all available information).
domain: Item
range: Item

name
term status: testing
type: Thing
sub property of: topDataProperty
property disjoint with: bottomDataProperty
type: DatatypeProperty
type: Property
comment: A name for some thing.
domain: Thing
range: Literal
sub property of: label

part of
sub property of: topObjectProperty
property disjoint with: bottomObjectProperty
inverse of: has part
type: ObjectProperty
type: DeprecatedProperty
comment: A resource that the subject is a part of.
version info: This property is deprecated. Use dcterms:isPartOf from the Dublin Core ontology instead.

description
property disjoint with: last name
property disjoint with: num threads
property disjoint with: num items
property disjoint with: email sha1
type: DatatypeProperty
property disjoint with: last item date
property disjoint with: first name
sub property of: topDataProperty
property disjoint with: bottomDataProperty
type: DeprecatedProperty
comment: The content of the Post.
domain: Post
range: Literal
version info: This property is deprecated. Use sioc:content or other methods (AtomOwl, content:encoded from RSS 1.0, etc.) instead.

has discussion
property disjoint with: usergroup of
property disjoint with: avatar
property disjoint with: has subscriber
property disjoint with: container of
property disjoint with: administrator of
property disjoint with: follows
property disjoint with: has usergroup
property disjoint with: account of
property disjoint with: has host
property disjoint with: has member
property disjoint with: owner of
type: ObjectProperty
property disjoint with: modifier of
property disjoint with: bottomObjectProperty
property disjoint with: has scope
property disjoint with: creator of
property disjoint with: has administrator
property disjoint with: subscriber of
property disjoint with: space of
property disjoint with: host of
property disjoint with: function of
property disjoint with: email
sub property of: topObjectProperty
property disjoint with: moderator of
property disjoint with: has parent
property disjoint with: member of
property disjoint with: has moderator
property disjoint with: parent of
comment: The discussion that is related to this Item.
domain: Item

prohibits
sub property of: topObjectProperty
property disjoint with: bottomObjectProperty
sub property of: prohibits
equivalent property: prohibits
type: ObjectProperty
type: Property
domain: License
range: Prohibition

nickname
term status: testing
type: Thing
sub property of: topDataProperty
property disjoint with: bottomDataProperty
type: DatatypeProperty
type: Property
comment: A short informal nickname characterising an agent (includes login identifiers, IRC and other chat nicknames).

Is Version Of
note: This term is intended to be used with non-literal values as defined in the DCMI Abstract Model (http://dublincore.org/documents/abstract-model/). As of December 2007, the DCMI Usage Board is seeking a way to express this intention with a formal range declaration.
date: 2008-01-14
type: ObjectProperty
Has Version: isVersionOf-003
sub property of: Relation
sub property of: relation
date: 2000-07-11
sub property of: topObjectProperty
type: Thing
description: Changes in version imply substantive changes in content rather than differences in format.
issued: 2000-07-11
relation: isVersionOf-003
Relation: isVersionOf-003
property disjoint with: bottomObjectProperty
Date Modified: 2008-01-14
type: Property
comment: A related resource of which the described resource is a version, edition, or adaptation.

Sharing
type: Thing
type: Permission
comment: permits commercial derivatives, but only non-commercial distribution

Conforms To
date: 2001-05-21
issued: 2001-05-21
type: ObjectProperty
Date Modified: 2008-01-14
property disjoint with: bottomObjectProperty
date: 2008-01-14
sub property of: relation
Has Version: conformsTo-003
relation: conformsTo-003
sub property of: topObjectProperty
sub property of: Relation
type: Thing
Relation: conformsTo-003
range: Standard
comment: An established standard to which the described resource conforms.
type: Property

attachment
property disjoint with: has member
property disjoint with: member of
property disjoint with: account of
property disjoint with: avatar
property disjoint with: has host
property disjoint with: subscriber of
property disjoint with: has moderator
property disjoint with: follows
property disjoint with: has usergroup
property disjoint with: owner of
property disjoint with: moderator of
property disjoint with: parent of
type: ObjectProperty
property disjoint with: space of
property disjoint with: creator of
property disjoint with: has administrator
property disjoint with: has scope
property disjoint with: has parent
property disjoint with: bottomObjectProperty
sub property of: topObjectProperty
property disjoint with: has subscriber
property disjoint with: container of
property disjoint with: host of
property disjoint with: email
property disjoint with: usergroup of
property disjoint with: function of
property disjoint with: administrator of
property disjoint with: modifier of
comment: The URI of a file attached to an Item.
domain: Item

Date Issued
date: 2008-01-14
relation: issued-003
sub property of: Date
sub property of: topDataProperty
type: DatatypeProperty
property disjoint with: bottomDataProperty
type: Thing
Relation: issued-003
Has Version: issued-003
date: 2000-07-11
Date Modified: 2008-01-14
sub property of: date
issued: 2000-07-11
range: Literal
comment: Date of formal issuance (e.g., publication) of the resource.
type: Property

Yahoo chat ID
term status: testing
type: DatatypeProperty
type: Thing
sub property of: topDataProperty
property disjoint with: bottomDataProperty
sub property of: nickname
type: InverseFunctionalProperty
domain: Agent
range: Literal
comment: A Yahoo chat ID
type: Property

Abstract
date: 2008-01-14
sub property of: topDataProperty
type: DatatypeProperty
sub property of: Description
property disjoint with: bottomDataProperty
type: Thing
issued: 2000-07-11
sub property of: description
relation: abstract-003
date: 2000-07-11
Relation: abstract-003
Has Version: abstract-003
Date Modified: 2008-01-14
type: Property
comment: A summary of the resource.

current project
term status: testing
type: Thing
sub property of: topObjectProperty
property disjoint with: bottomObjectProperty
type: ObjectProperty
type: Property
comment: A current project this person works on.
domain: Person
range: Thing

Method of Accrual
type: Thing
disjoint with: Nothing
Has Version: MethodOfAccrual-001
relation: MethodOfAccrual-001
issued: 2008-01-14
date: 2008-01-14
Relation: MethodOfAccrual-001
type: Class
subclass of: Thing
comment: A method by which resources are added to a collection.

AIM chat ID
type: DatatypeProperty
property disjoint with: bottomDataProperty
sub property of: topDataProperty
type: InverseFunctionalProperty
term status: testing
type: Thing
sub property of: nickname
type: Property
domain: Agent
comment: An AIM chat ID
range: Literal

id
sub property of: topDataProperty
property disjoint with: bottomDataProperty
type: DatatypeProperty
comment: An identifier of a SIOC concept instance. For example, a user ID. Must be unique for instances of each type of SIOC concept within the same site.
range: Literal

Audience
property disjoint with: bottomObjectProperty
date: 2001-05-21
Date Modified: 2008-01-14
date: 2008-01-14
sub property of: topObjectProperty
issued: 2001-05-21
Has Version: audience-003
Relation: audience-003
type: ObjectProperty
type: Thing
relation: audience-003
type: Property
comment: A class of entity for whom the resource is intended or useful.
range: Agent Class

References
relation: references-003
Relation: references-003
note: This term is intended to be used with non-literal values as defined in the DCMI Abstract Model (http://dublincore.org/documents/abstract-model/). As of December 2007, the DCMI Usage Board is seeking a way to express this intention with a formal range declaration.
issued: 2000-07-11
date: 2000-07-11
sub property of: topObjectProperty
property disjoint with: bottomObjectProperty
Date Modified: 2008-01-14
date: 2008-01-14
type: ObjectProperty
type: Thing
sub property of: relation
Has Version: references-003
sub property of: Relation
type: Property
comment: A related resource that is referenced, cited, or otherwise pointed to by the described resource.

has container
property disjoint with: has subscriber
property disjoint with: has function
type: ObjectProperty
property disjoint with: function of
property disjoint with: email
property disjoint with: container of
property disjoint with: account of
property disjoint with: host of
property disjoint with: previous version
property disjoint with: has moderator
property disjoint with: later version
property disjoint with: avatar
property disjoint with: has owner
property disjoint with: owner of
property disjoint with: moderator of
property disjoint with: has parent
property disjoint with: bottomObjectProperty
property disjoint with: has scope
property disjoint with: latest version
property disjoint with: earlier version
property disjoint with: next version
property disjoint with: usergroup of
property disjoint with: account
property disjoint with: has creator
property disjoint with: member of
sub property of: topObjectProperty
property disjoint with: has administrator
property disjoint with: administrator of
property disjoint with: modifier of
property disjoint with: has reply
property disjoint with: space of
property disjoint with: has member
property disjoint with: scope of
property disjoint with: has modifier
property disjoint with: previous by date
property disjoint with: subscriber of
property disjoint with: next by date
property disjoint with: has host
inverse of: container of
property disjoint with: follows
property disjoint with: sibling
property disjoint with: parent of
property disjoint with: creator of
property disjoint with: has usergroup
property disjoint with: reply of
comment: The Container to which this Item belongs.
domain: Item
range: Container

Alternative Title
property disjoint with: bottomDataProperty
sub property of: Title
Relation: alternative-003
date: 2000-07-11
description: The distinction between titles and alternative titles is application-specific.
date: 2010-10-11
sub property of: title
type: Thing
Date Modified: 2010-10-11
issued: 2000-07-11
sub property of: topDataProperty
Has Version: alternative-003
relation: alternative-003
type: DatatypeProperty
type: Property
range: Literal
comment: An alternative name for the resource.

Reproduction
type: Class
type: Permission
equivalent class: Reproduction
disjoint with: Nothing
type: Thing
subclass of: Thing
subclass of: Reproduction
comment: making multiple copies

parent of
property disjoint with: avatar
property disjoint with: function of
property disjoint with: follows
property disjoint with: modifier of
property disjoint with: later version
property disjoint with: has subscriber
property disjoint with: earlier version
property disjoint with: next version
property disjoint with: bottomObjectProperty
property disjoint with: email
type: ObjectProperty
property disjoint with: has discussion
property disjoint with: about
property disjoint with: has reply
property disjoint with: scope of
property disjoint with: reference
property disjoint with: container of
property disjoint with: previous by date
property disjoint with: subscriber of
property disjoint with: next by date
property disjoint with: account of
property disjoint with: member of
sub property of: topObjectProperty
property disjoint with: has owner
property disjoint with: has creator
property disjoint with: reply of
property disjoint with: has container
inverse of: has parent
property disjoint with: has member
property disjoint with: embeds knowledge
property disjoint with: attachment
property disjoint with: has moderator
property disjoint with: has modifier
property disjoint with: previous version
property disjoint with: sibling
property disjoint with: addressed to
property disjoint with: account
property disjoint with: usergroup of
property disjoint with: moderator of
property disjoint with: has usergroup
property disjoint with: creator of
property disjoint with: latest version
property disjoint with: has administrator
property disjoint with: owner of
property disjoint with: administrator of
property disjoint with: has scope
property disjoint with: has function
comment: A child Container or Forum that this Container or Forum is a parent of.
domain: Container
range: Container

Identifier
sub property of: identifier
type: DatatypeProperty
relation: identifierT-001
sub property of: topDataProperty
Has Version: identifierT-001
date: 2008-01-14
description: Recommended best practice is to identify the resource by means of a string conforming to a formal identification system.
issued: 2008-01-14
property disjoint with: bottomDataProperty
Relation: identifierT-001
Date Modified: 2008-01-14
type: Thing
range: Literal
type: Property
comment: An unambiguous reference to the resource within a given context.

Instructional Method
description: Instructional Method will typically include ways of presenting instructional materials or conducting instructional activities, patterns of learner-to-learner and learner-to-instructor interactions, and mechanisms by which group and individual levels of learning are measured. Instructional methods include all aspects of the instruction and learning processes from planning and implementation through evaluation and feedback.
property disjoint with: bottomObjectProperty
Date Modified: 2008-01-14
Relation: instructionalMethod-002
Has Version: instructionalMethod-002
sub property of: topObjectProperty
date: 2008-01-14
type: Thing
date: 2005-06-13
type: ObjectProperty
issued: 2005-06-13
relation: instructionalMethod-002
type: Property
comment: A process, used to engender knowledge, attitudes and skills, that the described resource is designed to support.
range: Method of Instruction

schoolHomepage
term status: testing
type: Thing
sub property of: topObjectProperty
property disjoint with: bottomObjectProperty
type: ObjectProperty
type: Property
comment: A homepage of a school attended by the person.
domain: Person
range: Document

geekcode
term status: archaic
type: Thing
sub property of: topDataProperty
property disjoint with: bottomDataProperty
type: DatatypeProperty
type: Property
comment: A textual geekcode for this person, see http://www.geekcode.com/geek.html
domain: Person
range: Literal

family_name
term status: archaic
type: Thing
sub property of: topDataProperty
property disjoint with: bottomDataProperty
type: DatatypeProperty
type: Property
comment: The family name of some person.
domain: Person
range: Literal

Date Submitted
date: 2002-07-13
property disjoint with: bottomDataProperty
sub property of: date
type: Thing
description: Examples of resources to which a Date Submitted may be relevant are a thesis (submitted to a university department) or an article (submitted to a journal).
relation: dateSubmitted-002
sub property of: Date
date: 2008-01-14
Date Modified: 2008-01-14
issued: 2002-07-13
type: DatatypeProperty
sub property of: topDataProperty
Has Version: dateSubmitted-002
Relation: dateSubmitted-002
type: Property
range: Literal
comment: Date of submission of the resource.

Is Format Of
date: 2000-07-11
date: 2008-01-14
relation: isFormatOf-003
Has Version: isFormatOf-003
property disjoint with: bottomObjectProperty
Date Modified: 2008-01-14
issued: 2000-07-11
sub property of: relation
note: This term is intended to be used with non-literal values as defined in the DCMI Abstract Model (http://dublincore.org/documents/abstract-model/). As of December 2007, the DCMI Usage Board is seeking a way to express this intention with a formal range declaration.
type: Thing
type: ObjectProperty
sub property of: topObjectProperty
sub property of: Relation
Relation: isFormatOf-003
type: Property
comment: A related resource that is substantially the same as the described resource, but in another format.

Mediator
type: ObjectProperty
description: In an educational context, a mediator might be a parent, teacher, teaching assistant, or care-giver.
Relation: mediator-003
date: 2008-01-14
issued: 2001-05-21
relation: mediator-003
sub property of: topObjectProperty
Has Version: mediator-003
property disjoint with: bottomObjectProperty
Date Modified: 2008-01-14
date: 2001-05-21
type: Thing
sub property of: Audience
type: Property
range: Agent Class
comment: An entity that mediates access to the resource and for whom the resource is intended or useful.

Organization
term status: stable
disjoint with: Image
subclass of: Agent
disjoint with: Nothing
disjoint with: Post
disjoint with: Person
disjoint with: Document
subclass of: Thing
type: Thing
disjoint with: PersonalProfileDocument
type: Class
comment: An organization.

Policy
Relation: Policy-001
type: Class
relation: Policy-001
date: 2008-01-14
issued: 2008-01-14
Has Version: Policy-001
type: Thing
disjoint with: Nothing
subclass of: Thing
comment: A plan or course of action by an authority, intended to influence and determine decisions, actions, and other matters.

Method of Instruction
issued: 2008-01-14
subclass of: Thing
type: Thing
Relation: MethodOfInstruction-001
type: Class
disjoint with: Nothing
date: 2008-01-14
relation: MethodOfInstruction-001
Has Version: MethodOfInstruction-001
comment: A process that is used to engender knowledge, attitudes, and skills.

content
property disjoint with: num items
property disjoint with: first name
sub property of: topDataProperty
property disjoint with: bottomDataProperty
property disjoint with: num threads
property disjoint with: last name
property disjoint with: last item date
property disjoint with: email sha1
type: DatatypeProperty
comment: The content of the Item in plain text format.
domain: Item
range: Literal

focus
term status: testing
type: Thing
sub property of: topObjectProperty
property disjoint with: bottomObjectProperty
type: ObjectProperty
type: Property
comment: The underlying or 'focal' entity associated with some SKOS-described concept.
domain: Concept
range: Thing

has part
sub property of: topObjectProperty
property disjoint with: bottomObjectProperty
inverse of: part of
type: ObjectProperty
type: DeprecatedProperty
comment: An resource that is a part of this subject.
version info: This property is deprecated. Use dcterms:hasPart from the Dublin Core ontology instead.

Item
disjoint with: User
disjoint with: Thread
disjoint with: Community
disjoint with: User Account
type: Class
disjoint with: Usergroup
disjoint with: Nothing
disjoint with: Role
disjoint with: Container
disjoint with: Site
disjoint with: Forum
disjoint with: Space
subclass of: Thing
comment: An Item is something which can be in a Container.

Copyleft
type: Requirement
type: Thing
comment: derivative and combined works must be licensed under specified terms, similar to those on the original work

modifier of
property disjoint with: space of
property disjoint with: has scope
property disjoint with: has usergroup
property disjoint with: has discussion
inverse of: has modifier
property disjoint with: has reply
property disjoint with: subscriber of
property disjoint with: administrator of
property disjoint with: has creator
property disjoint with: has modifier
property disjoint with: function of
property disjoint with: host of
property disjoint with: usergroup of
property disjoint with: has function
property disjoint with: previous version
property disjoint with: has owner
property disjoint with: bottomObjectProperty
property disjoint with: has space
sub property of: topObjectProperty
property disjoint with: account
property disjoint with: latest version
property disjoint with: has administrator
property disjoint with: parent of
property disjoint with: reply of
property disjoint with: reference
property disjoint with: has subscriber
property disjoint with: attachment
property disjoint with: has moderator
property disjoint with: container of
property disjoint with: has member
property disjoint with: has container
property disjoint with: follows
property disjoint with: moderator of
property disjoint with: addressed to
type: ObjectProperty
property disjoint with: sibling
property disjoint with: previous by date
property disjoint with: about
property disjoint with: scope of
property disjoint with: member of
property disjoint with: next by date
property disjoint with: later version
property disjoint with: embeds knowledge
property disjoint with: earlier version
property disjoint with: has host
property disjoint with: has parent
property disjoint with: next version
comment: An Item that this UserAccount has modified.
domain: User Account
range: Item

Size or Duration
description: Examples include a number of pages, a specification of length, width, and breadth, or a period in hours, minutes, and seconds.
subclass of: Thing
disjoint with: Nothing
type: Thing
relation: SizeOrDuration-001
date: 2008-01-14
type: Class
subclass of: Media Type or Extent
Has Version: SizeOrDuration-001
issued: 2008-01-14
Relation: SizeOrDuration-001
comment: A dimension or extent, or a time taken to play or execute.

topic_interest
term status: testing
type: Thing
sub property of: topObjectProperty
property disjoint with: bottomObjectProperty
type: ObjectProperty
type: Property
comment: A thing of interest to this person.
domain: Agent
range: Thing

made
inverse of: maker
type: ObjectProperty
type: Thing
inverse of: Creator
property disjoint with: bottomObjectProperty
sub property of: topObjectProperty
term status: stable
type: Property
comment: Something that was made by this agent.
domain: Agent
range: Thing

past project
term status: testing
type: Thing
sub property of: topObjectProperty
property disjoint with: bottomObjectProperty
type: ObjectProperty
type: Property
comment: A project this person has previously worked on.
domain: Person
range: Thing

last activity date
sub property of: Date
sub property of: topDataProperty
sub property of: date
property disjoint with: bottomDataProperty
type: DatatypeProperty
comment: The date and time of the last activity associated with a SIOC concept instance, and expressed in ISO 8601 format. This could be due to a reply Post or Comment, a modification to an Item, etc.
range: Literal

RFC 1766
Has Version: RFC1766-003
date: 2008-01-14
date: 2000-07-11
Date Modified: 2008-01-14
type: Thing
relation: RFC1766-003
Relation: RFC1766-003
issued: 2000-07-11
type: Datatype
comment: The set of tags, constructed according to RFC 1766, for the identification of languages.

MSN chat ID
sub property of: nickname
property disjoint with: bottomDataProperty
type: Thing
sub property of: topDataProperty
type: InverseFunctionalProperty
term status: testing
type: DatatypeProperty
comment: An MSN chat ID
domain: Agent
type: Property
range: Literal

Is Referenced By
type: ObjectProperty
property disjoint with: bottomObjectProperty
date: 2008-01-14
Date Modified: 2008-01-14
date: 2000-07-11
sub property of: topObjectProperty
issued: 2000-07-11
sub property of: relation
type: Thing
note: This term is intended to be used with non-literal values as defined in the DCMI Abstract Model (http://dublincore.org/documents/abstract-model/). As of December 2007, the DCMI Usage Board is seeking a way to express this intention with a formal range declaration.
Relation: isReferencedBy-003
sub property of: Relation
relation: isReferencedBy-003
Has Version: isReferencedBy-003
comment: A related resource that references, cites, or otherwise points to the described resource.
type: Property

group of
sub property of: topObjectProperty
property disjoint with: bottomObjectProperty
inverse of: has group
type: ObjectProperty
type: DeprecatedProperty
version info: This property has been renamed. Use sioc:usergroup_of instead.

DCMI Point
date: 2008-01-14
relation: Point-003
Date Modified: 2008-01-14
type: Thing
date: 2000-07-11
issued: 2000-07-11
Has Version: Point-003
Relation: Point-003
type: Datatype
comment: The set of points in space defined by their geographic coordinates according to the DCMI Point Encoding Scheme.

Permission
disjoint with: Nothing
equivalent class: Permission
subclass of: Thing
subclass of: Permission
type: Class
comment: an action that may or may not be allowed or desired

Requires
relation: requires-003
Has Version: requires-003
Relation: requires-003
sub property of: topObjectProperty
issued: 2000-07-11
date: 2008-01-14
sub property of: relation
date: 2000-07-11
note: This term is intended to be used with non-literal values as defined in the DCMI Abstract Model (http://dublincore.org/documents/abstract-model/). As of December 2007, the DCMI Usage Board is seeking a way to express this intention with a formal range declaration.
property disjoint with: bottomObjectProperty
Date Modified: 2008-01-14
type: Thing
sub property of: Relation
type: ObjectProperty
type: Property
comment: A related resource that is required by the described resource to support its function, delivery, or coherence.

based near
term status: testing
type: Thing
sub property of: topObjectProperty
property disjoint with: bottomObjectProperty
type: ObjectProperty
type: Property
comment: A location that something is based near, for some broadly human notion of near.
domain: SpatialThing
range: SpatialThing

primary topic
type: FunctionalProperty
sub property of: topic
term status: stable
type: ObjectProperty
type: Thing
inverse of: is primary topic of
sub property of: topObjectProperty
property disjoint with: bottomObjectProperty
domain: Document
range: Thing
type: Property
comment: The primary topic of some page or document.

Rights
description: Typically, rights information includes a statement about various property rights associated with the resource, including intellectual property rights.
property disjoint with: bottomObjectProperty
type: Thing
issued: 2008-01-14
relation: rightsT-001
Date Modified: 2008-01-14
sub property of: topObjectProperty
Has Version: rightsT-001
date: 2008-01-14
sub property of: rights
Relation: rightsT-001
type: ObjectProperty
range: Rights Statement
comment: Information about rights held in and over the resource.
type: Property

Subject
Has Version: subjectT-002
Date Modified: 2012-06-14
description: Typically, the subject will be represented using keywords, key phrases, or classification codes. Recommended best practice is to use a controlled vocabulary.
Relation: subjectT-002
type: ObjectProperty
type: Thing
date: 2012-06-14
property disjoint with: bottomObjectProperty
issued: 2008-01-14
sub property of: subject
sub property of: topObjectProperty
date: 2008-01-14
relation: subjectT-002
note: This term is intended to be used with non-literal values as defined in the DCMI Abstract Model (http://dublincore.org/documents/abstract-model/). As of December 2007, the DCMI Usage Board is seeking a way to express this intention with a formal range declaration.
type: Property
comment: The topic of the resource.

Period of Time
subclass of: Thing
type: Thing
issued: 2008-01-14
date: 2008-01-14
type: Class
subclass of: Location, Period, or Jurisdiction
Has Version: PeriodOfTime-001
relation: PeriodOfTime-001
disjoint with: Nothing
Relation: PeriodOfTime-001
comment: An interval of time that is named or defined by its start and end dates.

Jurisdiction
disjoint with: Nothing
subclass of: Thing
type: Class
comment: the legal jurisdiction of a license

usergroup of
property disjoint with: next by date
property disjoint with: previous version
property disjoint with: has administrator
property disjoint with: has subscriber
property disjoint with: has host
property disjoint with: later version
property disjoint with: scope of
property disjoint with: bottomObjectProperty
property disjoint with: has parent
property disjoint with: administrator of
property disjoint with: container of
property disjoint with: sibling
property disjoint with: has discussion
property disjoint with: has creator
property disjoint with: moderator of
property disjoint with: parent of
inverse of: has usergroup
property disjoint with: earlier version
property disjoint with: account of
property disjoint with: has modifier
property disjoint with: owner of
property disjoint with: has member
property disjoint with: creator of
property disjoint with: reply of
property disjoint with: previous by date
property disjoint with: reference
property disjoint with: member of
property disjoint with: addressed to
property disjoint with: embeds knowledge
property disjoint with: account
property disjoint with: next version
property disjoint with: has moderator
property disjoint with: has container
property disjoint with: has function
property disjoint with: space of
property disjoint with: function of
property disjoint with: has usergroup
type: ObjectProperty
property disjoint with: email
property disjoint with: has owner
sub property of: topObjectProperty
property disjoint with: has scope
property disjoint with: subscriber of
property disjoint with: has reply
property disjoint with: avatar
property disjoint with: about
property disjoint with: attachment
property disjoint with: latest version
property disjoint with: follows
property disjoint with: host of
property disjoint with: modifier of
comment: A Space that the Usergroup has access to.
domain: Usergroup
range: Space

sha1sum of a personal mailbox URI name
term status: testing
type: Thing
sub property of: topDataProperty
property disjoint with: bottomDataProperty
type: InverseFunctionalProperty
type: DatatypeProperty
type: Property
comment: The sha1sum of the URI of an Internet mailbox associated with exactly one owner, the first owner of the mailbox.
domain: Agent
range: Literal

is primary topic of
sub property of: topObjectProperty
property disjoint with: bottomObjectProperty
type: Thing
type: ObjectProperty
sub property of: page
type: InverseFunctionalProperty
term status: stable
inverse of: primary topic
comment: A document that this thing is the primary topic of.
domain: Thing
range: Document
type: Property

ip address
type: DatatypeProperty
property disjoint with: bottomDataProperty
property disjoint with: email sha1
sub property of: topDataProperty
property disjoint with: first name
property disjoint with: num threads
property disjoint with: num items
property disjoint with: last name
property disjoint with: last item date
comment: The IP address used when creating this Item. This can be associated with a creator. Some wiki articles list the IP addresses for the creator or modifiers when the usernames are absent.
domain: Item
range: Literal

Spatial Coverage
date: 2008-01-14
type: ObjectProperty
relation: spatial-003
date: 2000-07-11
Relation: spatial-003
issued: 2000-07-11
Date Modified: 2008-01-14
property disjoint with: bottomObjectProperty
Has Version: spatial-003
sub property of: topObjectProperty
sub property of: Coverage
sub property of: coverage
type: Thing
type: Property
range: Location
comment: Spatial characteristics of the resource.

Rights Holder
date: 2004-06-14
relation: rightsHolder-002
issued: 2004-06-14
type: Thing
date: 2008-01-14
type: ObjectProperty
property disjoint with: bottomObjectProperty
sub property of: topObjectProperty
Date Modified: 2008-01-14
Relation: rightsHolder-002
Has Version: rightsHolder-002
type: Property
comment: A person or organization owning or managing rights over the resource.
range: Agent

requires
sub property of: topObjectProperty
property disjoint with: bottomObjectProperty
sub property of: requires
equivalent property: requires
type: ObjectProperty
type: Property
domain: License
range: Requirement

Publisher
Relation: publisherT-001
Date Modified: 2010-10-11
date: 2008-01-14
issued: 2008-01-14
date: 2010-10-11
relation: publisherT-001
type: Thing
Has Version: publisherT-001
sub property of: topObjectProperty
property disjoint with: bottomObjectProperty
description: Examples of a Publisher include a person, an organization, or a service.
sub property of: publisher
type: ObjectProperty
range: Agent
comment: An entity responsible for making the resource available.
type: Property

logo
term status: testing
type: Thing
sub property of: topObjectProperty
property disjoint with: bottomObjectProperty
type: InverseFunctionalProperty
type: ObjectProperty
type: Property
comment: A logo representing some thing.
domain: Thing
range: Thing

Rights Statement
type: Thing
subclass of: Thing
Has Version: RightsStatement-001
relation: RightsStatement-001
disjoint with: Nothing
date: 2008-01-14
type: Class
issued: 2008-01-14
Relation: RightsStatement-001
comment: A statement about the intellectual property rights (IPR) held in or over a Resource, a legal document giving official permission to do something with a resource, or a statement about access rights.

has group
sub property of: topObjectProperty
property disjoint with: bottomObjectProperty
inverse of: group of
type: ObjectProperty
type: DeprecatedProperty
version info: This property has been renamed. Use sioc:has_usergroup instead.

title
property disjoint with: num items
property disjoint with: last name
property disjoint with: last item date
property disjoint with: bottomDataProperty
sub property of: topDataProperty
type: DatatypeProperty
property disjoint with: num threads
property disjoint with: first name
property disjoint with: email sha1
type: DeprecatedProperty
comment: This is the title (subject line) of the Post. Note that for a Post within a threaded discussion that has no parents, it would detail the topic thread.
domain: Post
range: Literal
version info: This property is deprecated. Use dcterms:title from the Dublin Core ontology instead.

reply of
property disjoint with: usergroup of
property disjoint with: has moderator
property disjoint with: has function
sub property of: topObjectProperty
property disjoint with: has usergroup
property disjoint with: function of
property disjoint with: owner of
property disjoint with: host of
property disjoint with: administrator of
property disjoint with: member of
property disjoint with: has owner
inverse of: has reply
sub property of: related to
property disjoint with: creator of
property disjoint with: account
property disjoint with: email
property disjoint with: follows
property disjoint with: has subscriber
property disjoint with: has container
property disjoint with: modifier of
property disjoint with: has creator
property disjoint with: container of
property disjoint with: scope of
type: ObjectProperty
property disjoint with: avatar
property disjoint with: space of
property disjoint with: has member
property disjoint with: has administrator
property disjoint with: account of
property disjoint with: has host
property disjoint with: bottomObjectProperty
property disjoint with: has scope
property disjoint with: has modifier
property disjoint with: has space
property disjoint with: moderator of
property disjoint with: has parent
property disjoint with: subscriber of
property disjoint with: parent of
comment: Links to an Item or Post which this Item or Post is a reply to.
domain: Item
range: Item

first name
property disjoint with: content
property disjoint with: title
property disjoint with: subject
property disjoint with: content encoded
property disjoint with: description
sub property of: topDataProperty
property disjoint with: num threads
type: DatatypeProperty
property disjoint with: last item date
property disjoint with: modified at
property disjoint with: created at
property disjoint with: bottomDataProperty
property disjoint with: ip address
property disjoint with: num items
type: DeprecatedProperty
comment: First (real) name of this User. Synonyms include given name or christian name.
domain: User Account
range: Literal
version info: This property is deprecated. Use foaf:name or foaf:firstName from the FOAF vocabulary instead.

MeSH
Date Modified: 2008-01-14
date: 2008-01-14
date: 2000-07-11
Has Version: MESH-003
type: Thing
issued: 2000-07-11
Relation: MESH-003
type: VocabularyEncodingScheme
relation: MESH-003
comment: The set of labeled concepts specified by the Medical Subject Headings.

image
term status: testing
type: Thing
sub property of: topObjectProperty
sub property of: depiction
property disjoint with: bottomObjectProperty
type: ObjectProperty
type: Property
comment: An image that can be used to represent some thing (ie. those depictions which are particularly representative of something, eg. one's photo on a homepage).
domain: Person
range: Image

Project
disjoint with: PersonalProfileDocument
type: Class
term status: testing
disjoint with: Document
disjoint with: Post
subclass of: Thing
disjoint with: Nothing
disjoint with: Image
disjoint with: Person
type: Thing
comment: A project (a collective endeavour of some kind).

next version
property disjoint with: has scope
property disjoint with: has host
property disjoint with: space of
property disjoint with: has subscriber
property disjoint with: email
property disjoint with: has administrator
property disjoint with: usergroup of
property disjoint with: has function
property disjoint with: has usergroup
sub property of: topObjectProperty
property disjoint with: subscriber of
property disjoint with: moderator of
property disjoint with: parent of
property disjoint with: has owner
property disjoint with: host of
property disjoint with: has space
property disjoint with: member of
property disjoint with: modifier of
sub property of: later version
property disjoint with: scope of
property disjoint with: has member
property disjoint with: function of
inverse of: previous version
property disjoint with: has modifier
property disjoint with: follows
property disjoint with: account
property disjoint with: administrator of
property disjoint with: has container
property disjoint with: bottomObjectProperty
property disjoint with: has creator
property disjoint with: account of
property disjoint with: container of
property disjoint with: has parent
property disjoint with: has moderator
property disjoint with: avatar
property disjoint with: owner of
type: ObjectProperty
property disjoint with: creator of
comment: Links to the next revision of this Item or Post.
domain: Item
range: Item

account name
term status: testing
type: Thing
sub property of: topDataProperty
property disjoint with: bottomDataProperty
type: DatatypeProperty
type: Property
comment: Indicates the name (identifier) associated with this online account.
domain: Online Account
range: Literal

Location
Relation: Location-001
date: 2008-01-14
type: Class
subclass of: Location, Period, or Jurisdiction
relation: Location-001
type: Thing
issued: 2008-01-14
Has Version: Location-001
subclass of: Thing
disjoint with: Nothing
comment: A spatial region or named place.

has reply
property disjoint with: has parent
property disjoint with: has scope
property disjoint with: has owner
property disjoint with: creator of
property disjoint with: account
property disjoint with: avatar
sub property of: topObjectProperty
property disjoint with: owner of
property disjoint with: subscriber of
property disjoint with: space of
property disjoint with: has function
property disjoint with: moderator of
property disjoint with: function of
sub property of: related to
property disjoint with: has member
property disjoint with: has space
property disjoint with: scope of
property disjoint with: modifier of
property disjoint with: has modifier
property disjoint with: parent of
property disjoint with: follows
property disjoint with: email
property disjoint with: container of
property disjoint with: has container
property disjoint with: has subscriber
property disjoint with: has creator
property disjoint with: has moderator
property disjoint with: member of
property disjoint with: bottomObjectProperty
property disjoint with: account of
type: ObjectProperty
property disjoint with: has administrator
property disjoint with: has usergroup
property disjoint with: usergroup of
property disjoint with: host of
property disjoint with: administrator of
property disjoint with: has host
inverse of: reply of
comment: Points to an Item or Post that is a reply or response to this Item or Post.
domain: Item
range: Item

email
property disjoint with: has usergroup
property disjoint with: attachment
property disjoint with: reply of
property disjoint with: bottomObjectProperty
property disjoint with: has scope
property disjoint with: has modifier
property disjoint with: sibling
property disjoint with: previous by date
property disjoint with: host of
property disjoint with: reference
property disjoint with: has member
property disjoint with: previous version
property disjoint with: has parent
property disjoint with: has container
property disjoint with: has moderator
property disjoint with: latest version
property disjoint with: parent of
sub property of: topObjectProperty
property disjoint with: function of
property disjoint with: later version
property disjoint with: container of
property disjoint with: earlier version
property disjoint with: about
property disjoint with: next version
property disjoint with: space of
property disjoint with: has administrator
type: ObjectProperty
property disjoint with: usergroup of
property disjoint with: next by date
property disjoint with: embeds knowledge
property disjoint with: has reply
property disjoint with: addressed to
property disjoint with: has discussion
property disjoint with: has subscriber
property disjoint with: has host
comment: An electronic mail address of the UserAccount.
domain: User Account

jabber ID
term status: testing
type: Thing
sub property of: topDataProperty
property disjoint with: bottomDataProperty
type: InverseFunctionalProperty
type: DatatypeProperty
type: Property
comment: A jabber ID for something.
domain: Agent
range: Literal

has usergroup
property disjoint with: later version
property disjoint with: about
property disjoint with: usergroup of
property disjoint with: has space
property disjoint with: account
property disjoint with: has parent
property disjoint with: member of
sub property of: topObjectProperty
property disjoint with: account of
property disjoint with: owner of
property disjoint with: scope of
property disjoint with: bottomObjectProperty
property disjoint with: container of
property disjoint with: has owner
property disjoint with: reference
type: ObjectProperty
property disjoint with: has moderator
property disjoint with: previous by date
property disjoint with: subscriber of
property disjoint with: reply of
property disjoint with: earlier version
property disjoint with: has creator
property disjoint with: embeds knowledge
property disjoint with: has member
property disjoint with: has container
property disjoint with: addressed to
property disjoint with: email
property disjoint with: has function
property disjoint with: parent of
property disjoint with: previous version
property disjoint with: has discussion
property disjoint with: has subscriber
property disjoint with: has administrator
property disjoint with: function of
inverse of: usergroup of
property disjoint with: moderator of
property disjoint with: has reply
property disjoint with: has host
property disjoint with: creator of
property disjoint with: attachment
property disjoint with: modifier of
property disjoint with: host of
property disjoint with: avatar
property disjoint with: has modifier
property disjoint with: next by date
property disjoint with: latest version
property disjoint with: sibling
property disjoint with: has scope
property disjoint with: administrator of
property disjoint with: next version
property disjoint with: follows
comment: Points to a Usergroup that has certain access to this Space.
domain: Space
range: Usergroup

Format
relation: formatT-001
description: Examples of dimensions include size and duration. Recommended best practice is to use a controlled vocabulary such as the list of Internet Media Types [MIME].
Has Version: formatT-001
Date Modified: 2008-01-14
date: 2008-01-14
sub property of: topObjectProperty
issued: 2008-01-14
sub property of: format
type: ObjectProperty
property disjoint with: bottomObjectProperty
type: Thing
Relation: formatT-001
type: Property
comment: The file format, physical medium, or dimensions of the resource.
range: Media Type or Extent

LCSH
issued: 2000-07-11
type: VocabularyEncodingScheme
Has Version: LCSH-003
Date Modified: 2008-01-14
relation: LCSH-003
date: 2000-07-11
Relation: LCSH-003
type: Thing
date: 2008-01-14
comment: The set of labeled concepts specified by the Library of Congress Subject Headings.

Online Gaming Account
term status: unstable
type: Thing
disjoint with: Nothing
subclass of: Thing
subclass of: Online Account
type: Class
comment: An online gaming account.

Document
term status: testing
subclass of: Thing
disjoint with: Nothing
type: Class
disjoint with: Project
type: Thing
disjoint with: Organization
comment: A document.

previous version
property disjoint with: has space
property disjoint with: account of
property disjoint with: has moderator
property disjoint with: follows
property disjoint with: usergroup of
sub property of: earlier version
property disjoint with: email
property disjoint with: bottomObjectProperty
property disjoint with: host of
property disjoint with: administrator of
property disjoint with: container of
property disjoint with: has usergroup
property disjoint with: modifier of
property disjoint with: space of
property disjoint with: has modifier
property disjoint with: scope of
property disjoint with: subscriber of
property disjoint with: parent of
property disjoint with: has parent
property disjoint with: account
property disjoint with: moderator of
property disjoint with: has member
property disjoint with: function of
inverse of: next version
property disjoint with: has container
property disjoint with: has function
property disjoint with: has host
property disjoint with: has owner
property disjoint with: has subscriber
type: ObjectProperty
property disjoint with: has creator
sub property of: topObjectProperty
property disjoint with: has administrator
property disjoint with: avatar
property disjoint with: has scope
property disjoint with: member of
property disjoint with: owner of
property disjoint with: creator of
comment: Links to the previous revision of this Item or Post.
domain: Item
range: Item

Space
subclass of: Thing
disjoint with: Post
disjoint with: Nothing
type: Class
disjoint with: Usergroup
disjoint with: User Account
disjoint with: Item
disjoint with: User
disjoint with: Role
comment: A Space is a place where data resides, e.g. on a website, desktop, fileshare, etc.

avatar
property disjoint with: has discussion
property disjoint with: has usergroup
property disjoint with: host of
property disjoint with: function of
property disjoint with: next version
property disjoint with: later version
property disjoint with: latest version
property disjoint with: has reply
property disjoint with: addressed to
property disjoint with: earlier version
property disjoint with: embeds knowledge
property disjoint with: has member
property disjoint with: has moderator
property disjoint with: sibling
sub property of: topObjectProperty
property disjoint with: has modifier
property disjoint with: previous version
property disjoint with: reference
property disjoint with: has container
property disjoint with: container of
property disjoint with: bottomObjectProperty
property disjoint with: has host
property disjoint with: space of
property disjoint with: has scope
type: ObjectProperty
property disjoint with: has administrator
property disjoint with: usergroup of
property disjoint with: attachment
sub property of: depiction
property disjoint with: has subscriber
property disjoint with: reply of
property disjoint with: parent of
property disjoint with: about
property disjoint with: previous by date
property disjoint with: next by date
property disjoint with: has parent
comment: An image or depiction used to represent this UserAccount.
domain: User Account

tipjar
term status: testing
type: Thing
sub property of: topObjectProperty
sub property of: page
property disjoint with: bottomObjectProperty
type: ObjectProperty
type: Property
comment: A tipjar document for this agent, describing means for payment and reward.
domain: Agent
range: Document

num authors
sub property of: topDataProperty
property disjoint with: bottomDataProperty
type: DatatypeProperty
comment: The number of unique authors (UserAccounts and unregistered posters) who have contributed to this Item, Thread, Post, etc.
range: nonNegativeInteger

age
term status: unstable
type: Thing
sub property of: topDataProperty
property disjoint with: bottomDataProperty
type: FunctionalProperty
type: DatatypeProperty
type: Property
comment: The age in years of some agent.
domain: Agent
range: Literal

host of
property disjoint with: reply of
property disjoint with: creator of
property disjoint with: email
property disjoint with: has function
property disjoint with: has scope
property disjoint with: has administrator
property disjoint with: function of
property disjoint with: subscriber of
property disjoint with: has discussion
property disjoint with: addressed to
property disjoint with: attachment
property disjoint with: has owner
property disjoint with: next by date
property disjoint with: administrator of
property disjoint with: has subscriber
property disjoint with: moderator of
property disjoint with: sibling
property disjoint with: has member
property disjoint with: previous by date
property disjoint with: latest version
property disjoint with: member of
property disjoint with: later version
property disjoint with: reference
property disjoint with: avatar
property disjoint with: has usergroup
property disjoint with: container of
property disjoint with: owner of
property disjoint with: modifier of
property disjoint with: account
type: ObjectProperty
property disjoint with: embeds knowledge
property disjoint with: has moderator
inverse of: has host
property disjoint with: scope of
sub property of: topObjectProperty
property disjoint with: account of
property disjoint with: previous version
property disjoint with: bottomObjectProperty
property disjoint with: has creator
property disjoint with: has reply
property disjoint with: has modifier
property disjoint with: earlier version
property disjoint with: about
property disjoint with: has container
property disjoint with: usergroup of
property disjoint with: follows
property disjoint with: next version
comment: A Forum that is hosted on this Site.
domain: Site
range: Forum

publications
term status: testing
type: Thing
sub property of: topObjectProperty
property disjoint with: bottomObjectProperty
type: ObjectProperty
type: Property
comment: A link to the publications of this person.
domain: Person
range: Document

last item date
property disjoint with: content encoded
property disjoint with: email sha1
property disjoint with: subject
property disjoint with: title
property disjoint with: ip address
sub property of: date
property disjoint with: last name
type: DatatypeProperty
property disjoint with: description
property disjoint with: first name
property disjoint with: bottomDataProperty
sub property of: Date
sub property of: topDataProperty
property disjoint with: created at
property disjoint with: modified at
property disjoint with: content
comment: The date and time of the last Post (or Item) in a Forum (or a Container), in ISO 8601 format.
domain: Container
range: Literal

Share Alike
type: Requirement
type: Class
equivalent class: ShareAlike
subclass of: Thing
type: Thing
disjoint with: Nothing
subclass of: ShareAlike
comment: derivative works be licensed under the same terms or compatible terms as the original work

links to
sub property of: topObjectProperty
sub property of: relation
sub property of: Relation
sub property of: References
property disjoint with: bottomObjectProperty
type: ObjectProperty
comment: Links extracted from hyperlinks within a SIOC concept, e.g. Post or Site.

addressed to
property disjoint with: administrator of
property disjoint with: host of
property disjoint with: email
property disjoint with: has host
property disjoint with: parent of
property disjoint with: owner of
property disjoint with: usergroup of
type: ObjectProperty
property disjoint with: has usergroup
property disjoint with: has subscriber
property disjoint with: creator of
property disjoint with: moderator of
property disjoint with: bottomObjectProperty
property disjoint with: has member
sub property of: topObjectProperty
property disjoint with: avatar
property disjoint with: modifier of
property disjoint with: follows
property disjoint with: space of
property disjoint with: container of
property disjoint with: account of
property disjoint with: has moderator
property disjoint with: has parent
property disjoint with: has scope
property disjoint with: has administrator
property disjoint with: function of
property disjoint with: subscriber of
property disjoint with: member of
comment: Refers to who (e.g. a UserAccount, e-mail address, etc.) a particular Item is addressed to.
domain: Item

about
property disjoint with: has subscriber
sub property of: topObjectProperty
property disjoint with: follows
property disjoint with: container of
property disjoint with: has host
property disjoint with: has administrator
property disjoint with: moderator of
property disjoint with: space of
property disjoint with: usergroup of
property disjoint with: member of
property disjoint with: modifier of
property disjoint with: has moderator
property disjoint with: has parent
property disjoint with: account of
property disjoint with: owner of
property disjoint with: bottomObjectProperty
property disjoint with: host of
property disjoint with: has member
property disjoint with: has usergroup
property disjoint with: function of
property disjoint with: has scope
property disjoint with: creator of
property disjoint with: avatar
type: ObjectProperty
property disjoint with: email
property disjoint with: subscriber of
property disjoint with: parent of
property disjoint with: administrator of
comment: Specifies that this Item is about a particular resource, e.g. a Post describing a book, hotel, etc.
domain: Item

User
disjoint with: Role
disjoint with: Nothing
type: Class
disjoint with: Thread
disjoint with: Usergroup
disjoint with: Forum
disjoint with: Container
disjoint with: Item
equivalent class: User Account
disjoint with: Community
disjoint with: Space
subclass of: Thing
subclass of: Online Account
disjoint with: Site
disjoint with: Post
subclass of: User Account
version info: This class is deprecated. Use sioc:UserAccount from the SIOC ontology instead.
type: DeprecatedClass
comment: UserAccount is now preferred. This is a deprecated class for a User in an online community site.

License
date: 2008-01-14
type: ObjectProperty
sub property of: topObjectProperty
sub property of: rights
issued: 2004-06-14
Relation: license-002
date: 2004-06-14
relation: license-002
Date Modified: 2008-01-14
property disjoint with: bottomObjectProperty
Has Version: license-002
type: Thing
sub property of: Rights
comment: A legal document giving official permission to do something with the resource.
type: Property
range: License Document

License
disjoint with: Nothing
equivalent class: License
subclass of: License Document
subclass of: Rights Statement
subclass of: Thing
subclass of: License
type: Class
comment: a set of requests/permissions to users of a Work, e.g. a copyright license, the public domain, information for distributors

firstName
term status: testing
type: Thing
sub property of: topDataProperty
property disjoint with: bottomDataProperty
type: DatatypeProperty
type: Property
comment: The first name of a person.
domain: Person
range: Literal

Type
property disjoint with: bottomObjectProperty
sub property of: topObjectProperty
date: 2008-01-14
Has Version: typeT-001
sub property of: type
type: Thing
description: Recommended best practice is to use a controlled vocabulary such as the DCMI Type Vocabulary [DCMITYPE]. To describe the file format, physical medium, or dimensions of the resource, use the Format element.
Date Modified: 2008-01-14
Relation: typeT-001
relation: typeT-001
type: ObjectProperty
issued: 2008-01-14
range: Class
type: Property
comment: The nature or genre of the resource.

has host
property disjoint with: has reply
property disjoint with: has modifier
inverse of: host of
property disjoint with: administrator of
property disjoint with: bottomObjectProperty
property disjoint with: previous by date
property disjoint with: attachment
property disjoint with: has discussion
property disjoint with: has moderator
property disjoint with: modifier of
sub property of: topObjectProperty
property disjoint with: moderator of
property disjoint with: has subscriber
property disjoint with: owner of
property disjoint with: creator of
property disjoint with: member of
property disjoint with: has member
property disjoint with: avatar
property disjoint with: has creator
property disjoint with: reply of
property disjoint with: scope of
property disjoint with: account of
property disjoint with: about
property disjoint with: earlier version
property disjoint with: later version
property disjoint with: embeds knowledge
property disjoint with: has container
property disjoint with: account
property disjoint with: sibling
property disjoint with: addressed to
property disjoint with: has scope
property disjoint with: previous version
property disjoint with: has usergroup
property disjoint with: has administrator
property disjoint with: usergroup of
property disjoint with: follows
property disjoint with: container of
property disjoint with: function of
property disjoint with: subscriber of
property disjoint with: next by date
type: ObjectProperty
property disjoint with: next version
property disjoint with: latest version
property disjoint with: has function
property disjoint with: reference
property disjoint with: email
property disjoint with: has owner
comment: The Site that hosts this Forum.
domain: Forum
range: Site

has moderator
property disjoint with: moderator of
property disjoint with: parent of
property disjoint with: owner of
property disjoint with: account of
property disjoint with: has container
sub property of: topObjectProperty
inverse of: moderator of
property disjoint with: has scope
property disjoint with: reply of
property disjoint with: later version
property disjoint with: email
property disjoint with: previous by date
property disjoint with: has host
property disjoint with: creator of
property disjoint with: has usergroup
property disjoint with: addressed to
property disjoint with: function of
property disjoint with: previous version
property disjoint with: sibling
property disjoint with: latest version
property disjoint with: subscriber of
property disjoint with: has reply
property disjoint with: avatar
property disjoint with: next version
property disjoint with: modifier of
type: ObjectProperty
property disjoint with: administrator of
property disjoint with: has function
property disjoint with: scope of
property disjoint with: has parent
property disjoint with: has discussion
property disjoint with: attachment
property disjoint with: host of
property disjoint with: has member
property disjoint with: follows
property disjoint with: earlier version
property disjoint with: member of
property disjoint with: reference
property disjoint with: container of
property disjoint with: has modifier
property disjoint with: embeds knowledge
property disjoint with: usergroup of
property disjoint with: about
property disjoint with: next by date
property disjoint with: has space
property disjoint with: bottomObjectProperty
comment: A UserAccount that is a moderator of this Forum.
domain: Forum
range: User Account

ISO 3166
issued: 2000-07-11
type: Thing
date: 2000-07-11
date: 2008-01-14
Date Modified: 2008-01-14
relation: ISO3166-004
Has Version: ISO3166-004
Relation: ISO3166-004
type: Datatype
comment: The set of codes listed in ISO 3166-1 for the representation of names of countries.

Contributor
date: 2008-01-14
sub property of: topObjectProperty
description: Examples of a Contributor include a person, an organization, or a service.
Relation: contributorT-001
type: ObjectProperty
date: 2010-10-11
type: Thing
Date Modified: 2010-10-11
issued: 2008-01-14
sub property of: contributor
relation: contributorT-001
property disjoint with: bottomObjectProperty
Has Version: contributorT-001
comment: An entity responsible for making contributions to the resource.
type: Property
range: Agent

depiction
term status: testing
type: Thing
sub property of: topObjectProperty
property disjoint with: bottomObjectProperty
inverse of: depicts
type: ObjectProperty
type: Property
comment: A depiction of some thing.
domain: Thing
range: Image

status
term status: unstable
type: Thing
sub property of: topDataProperty
property disjoint with: bottomDataProperty
type: DatatypeProperty
type: Property
comment: A string expressing what the user is happy for the general public (normally) to know about their current activity.
domain: Agent
range: Literal

Agent
type: Class
subclass of: Agent
equivalent class: Agent
subclass of: Thing
disjoint with: Nothing
type: Thing
term status: stable
comment: An agent (eg. person, group, software or physical artifact).

gender
term status: testing
type: Thing
sub property of: topDataProperty
property disjoint with: bottomDataProperty
type: FunctionalProperty
type: DatatypeProperty
type: Property
comment: The gender of this Agent (typically but not necessarily 'male' or 'female').
domain: Agent
range: Literal

Standard
Relation: Standard-001
date: 2008-01-14
subclass of: Thing
disjoint with: Nothing
Has Version: Standard-001
relation: Standard-001
type: Class
issued: 2008-01-14
type: Thing
comment: A basis for comparison; a reference point against which other things can be evaluated.

num views
sub property of: topDataProperty
property disjoint with: bottomDataProperty
type: DatatypeProperty
comment: The number of times this Item, Thread, UserAccount profile, etc. has been viewed.
range: nonNegativeInteger

myersBriggs
term status: testing
type: Thing
sub property of: topDataProperty
property disjoint with: bottomDataProperty
type: DatatypeProperty
type: Property
comment: A Myers Briggs (MBTI) personality classification.
domain: Person
range: Literal

has parent
property disjoint with: has moderator
property disjoint with: has creator
property disjoint with: owner of
property disjoint with: has modifier
property disjoint with: reply of
property disjoint with: container of
property disjoint with: creator of
property disjoint with: bottomObjectProperty
property disjoint with: about
property disjoint with: account of
property disjoint with: has container
property disjoint with: has owner
property disjoint with: usergroup of
property disjoint with: follows
property disjoint with: scope of
property disjoint with: later version
property disjoint with: has reply
property disjoint with: previous version
property disjoint with: administrator of
property disjoint with: previous by date
property disjoint with: next by date
property disjoint with: sibling
property disjoint with: member of
property disjoint with: subscriber of
property disjoint with: modifier of
property disjoint with: has member
property disjoint with: has scope
property disjoint with: latest version
property disjoint with: account
property disjoint with: avatar
property disjoint with: has discussion
property disjoint with: email
inverse of: parent of
property disjoint with: has subscriber
property disjoint with: has function
property disjoint with: function of
type: ObjectProperty
property disjoint with: attachment
property disjoint with: addressed to
sub property of: topObjectProperty
property disjoint with: moderator of
property disjoint with: has usergroup
property disjoint with: reference
property disjoint with: next version
property disjoint with: earlier version
property disjoint with: embeds knowledge
property disjoint with: has administrator
comment: A Container or Forum that this Container or Forum is a child of.
domain: Container
range: Container

DCMI Period
date: 2000-07-11
relation: Period-003
Relation: Period-003
type: Thing
Date Modified: 2008-01-14
issued: 2000-07-11
date: 2008-01-14
Has Version: Period-003
type: Datatype
comment: The set of time intervals defined by their limits according to the DCMI Period Encoding Scheme.

Date Modified
type: DatatypeProperty
sub property of: topDataProperty
date: 2000-07-11
Date Modified: 2008-01-14
date: 2008-01-14
sub property of: Date
relation: modified-003
property disjoint with: bottomDataProperty
type: Thing
issued: 2000-07-11
Relation: modified-003
sub property of: date
Has Version: modified-003
type: Property
range: Literal
comment: Date on which the resource was changed.

Date Accepted
date: 2008-01-14
Relation: dateAccepted-002
Date Modified: 2008-01-14
type: Thing
type: DatatypeProperty
sub property of: date
description: Examples of resources to which a Date Accepted may be relevant are a thesis (accepted by a university department) or an article (accepted by a journal).
property disjoint with: bottomDataProperty
sub property of: topDataProperty
date: 2002-07-13
Has Version: dateAccepted-002
sub property of: Date
issued: 2002-07-13
relation: dateAccepted-002
range: Literal
comment: Date of acceptance of the resource.
type: Property

Audience Education Level
type: Thing
relation: educationLevel-002
issued: 2002-07-13
Has Version: educationLevel-002
sub property of: Audience
date: 2002-07-13
date: 2008-01-14
sub property of: topObjectProperty
type: ObjectProperty
property disjoint with: bottomObjectProperty
Date Modified: 2008-01-14
Relation: educationLevel-002
type: Property
comment: A class of entity, defined in terms of progression through an educational or training context, for which the described resource is intended.
range: Agent Class

subject
property disjoint with: email sha1
property disjoint with: num threads
sub property of: topDataProperty
property disjoint with: last name
type: DatatypeProperty
property disjoint with: first name
property disjoint with: last item date
property disjoint with: bottomDataProperty
property disjoint with: num items
type: DeprecatedProperty
comment: Keyword(s) describing subject of the Post.
domain: Post
range: Literal
version info: This property is deprecated. Use dcterms:subject from the Dublin Core ontology for text keywords and sioc:topic if the subject can be represented by a URI instead.

num replies
sub property of: topDataProperty
property disjoint with: bottomDataProperty
type: DatatypeProperty
comment: The number of replies that this Item, Thread, Post, etc. has. Useful for when the reply structure is absent.
range: nonNegativeInteger

latest version
property disjoint with: function of
sub property of: topObjectProperty
property disjoint with: account of
property disjoint with: avatar
property disjoint with: space of
property disjoint with: has administrator
property disjoint with: account
property disjoint with: has moderator
property disjoint with: subscriber of
property disjoint with: host of
property disjoint with: has space
property disjoint with: parent of
property disjoint with: has member
property disjoint with: email
property disjoint with: has usergroup
property disjoint with: has scope
property disjoint with: modifier of
property disjoint with: has owner
property disjoint with: has modifier
property disjoint with: container of
property disjoint with: creator of
property disjoint with: bottomObjectProperty
property disjoint with: has function
property disjoint with: owner of
property disjoint with: has creator
property disjoint with: has parent
property disjoint with: usergroup of
property disjoint with: has container
property disjoint with: administrator of
property disjoint with: moderator of
property disjoint with: follows
property disjoint with: has subscriber
property disjoint with: has host
type: ObjectProperty
property disjoint with: scope of
property disjoint with: member of
comment: Links to the latest revision of this Item or Post.
domain: Item
range: Item

Has Version
relation: hasVersion-003
sub property of: topObjectProperty
Has Version: hasVersion-003
sub property of: relation
property disjoint with: bottomObjectProperty
Date Modified: 2008-01-14
date: 2008-01-14
note: This term is intended to be used with non-literal values as defined in the DCMI Abstract Model (http://dublincore.org/documents/abstract-model/). As of December 2007, the DCMI Usage Board is seeking a way to express this intention with a formal range declaration.
issued: 2000-07-11
date: 2000-07-11
type: Thing
type: ObjectProperty
Relation: hasVersion-003
sub property of: Relation
comment: A related resource that is a version, edition, or adaptation of the described resource.
type: Property

last name
property disjoint with: ip address
property disjoint with: content
property disjoint with: last item date
type: DatatypeProperty
property disjoint with: subject
property disjoint with: created at
property disjoint with: bottomDataProperty
property disjoint with: num items
sub property of: topDataProperty
property disjoint with: modified at
property disjoint with: title
property disjoint with: description
property disjoint with: num threads
property disjoint with: content encoded
type: DeprecatedProperty
comment: Last (real) name of this user. Synonyms include surname or family name.
domain: User Account
range: Literal
version info: This property is deprecated. Use foaf:name or foaf:surname from the FOAF vocabulary instead.

thumbnail
term status: testing
type: Thing
sub property of: topObjectProperty
property disjoint with: bottomObjectProperty
type: ObjectProperty
type: Property
comment: A derived thumbnail image.
domain: Image
range: Image

SIOC Core Ontology Specification