has citation characterization
range: Thing
domain: Thing
comment: A property that links a cito:CitationAct to its characterization made by using a CiTO citation characterization property such as cito:extends. This usage involved OWL2 punning, whenby a CiTO object property, such as the aforementioned cito:extends, is used as the object of an OWL assertion: :thisCitation cito:hasCitationCharacterization cito:extends In such cases of OWL punning, the CiTO object properties are simultaneously considered both as normal object properties and also as proper named individuals of the class owl:Thing.
type: ObjectProperty
sub property of: isSettingFor
type: Property
range: Resource
domain: Resource

http://lodlaundromat.org/.well-known/genid/samples/jena///predicate//d015487fc59044ca316d6c6344e7afa6/010554247447337669685a3ec311d6ea#1
type: Class
subclass of: Thing
subclass of: Resource
on property: has citation characterization
type: Restriction
cardinality: 1
subclass of: http://lodlaundromat.org/.well-known/genid/samples/jena///predicate//d015487fc59044ca316d6c6344e7afa6/69c3b512152bcf0ad31f557dc516a970#4
subclass of: http://lodlaundromat.org/.well-known/genid/samples/jena///predicate//d015487fc59044ca316d6c6344e7afa6/7b2fc0fec5f606b68f385615fedf7846#2
subclass of: http://lodlaundromat.org/.well-known/genid/samples/jena///predicate//d015487fc59044ca316d6c6344e7afa6/c60ad03589cdf703d8c0bb969239bbfb#1
equivalent class: http://lodlaundromat.org/.well-known/genid/samples/jena///predicate//d015487fc59044ca316d6c6344e7afa6/c60ad03589cdf703d8c0bb969239bbfb#1
equivalent class: http://lodlaundromat.org/.well-known/genid/samples/jena///predicate//d015487fc59044ca316d6c6344e7afa6/7b2fc0fec5f606b68f385615fedf7846#2
equivalent class: http://lodlaundromat.org/.well-known/genid/samples/jena///predicate//d015487fc59044ca316d6c6344e7afa6/69c3b512152bcf0ad31f557dc516a970#4

properly contains
sub property of: overlaps
sub property of: connects with
range: Thing
domain: Thing
inverse of: is proper part of
type: ObjectProperty
type: TransitiveProperty
comment: Relation PPi(x,y), read as 'x properly contains y'. Inverse of the PP(x,y) relation.
domain: Feature
range: Feature
sub property of: contains
term status: testing
type: Property
range: Resource
domain: Resource

is extended by
range: Thing
domain: Thing
comment: The cited entity presents facts, ideas or understandings that are extended by the citing entity.
type: ObjectProperty
sub property of: is cited by
inverse of: extends
type: Property
range: Resource
domain: Resource

has narrower transitive
range: Thing
domain: Thing
definition: skos:narrowerTransitive is a transitive superproperty of skos:narrower.
scope note: By convention, skos:narrowerTransitive is not used to make assertions. Rather, the properties can be used to draw inferences about the transitive closure of the hierarchical relation, which is useful e.g. when implementing a simple query expansion algorithm in a search application.
type: ObjectProperty
sub property of: is in semantic relation with
type: TransitiveProperty
inverse of: has broader transitive
type: Property
note: By convention, skos:narrowerTransitive is not used to make assertions. Rather, the properties can be used to draw inferences about the transitive closure of the hierarchical relation, which is useful e.g. when implementing a simple query expansion algorithm in a search application.
note: skos:narrowerTransitive is a transitive superproperty of skos:narrower.
range: Concept
range: Resource
range: http://lodlaundromat.org/.well-known/genid/samples/jena///predicate//d015487fc59044ca316d6c6344e7afa6/d8234c3b1439a879aea940e9009663be#1
domain: Concept
domain: Resource
domain: http://lodlaundromat.org/.well-known/genid/samples/jena///predicate//d015487fc59044ca316d6c6344e7afa6/d8234c3b1439a879aea940e9009663be#1

Bibliographic Resource
subclass of: Resource
Has Version: BibliographicResource-001
issued: 2008-01-14
type: Class
comment: A book, article, or other documentary resource.
Relation: BibliographicResource-001
relation: BibliographicResource-001
date: 2008-01-14

contains
sub property of: connects with
range: Thing
domain: Thing
inverse of: is part of
type: ObjectProperty
type: TransitiveProperty
comment: Relation Pi(x,y), read as 'x contains y'. Inverse of the P(x,y) relation.
domain: Feature
range: Feature
sub property of: overlaps
term status: testing
type: Property
range: Resource
domain: Resource

cites as data source
sub property of: refersTo
range: Thing
domain: Thing
inverse of: is cited as data source by
type: ObjectProperty
description: Example: Italy has more than ten thousand kilometers of shoreline: see [X].
comment: The citing entity cites the cited entity as source of data.
sub property of: cites
type: Property
range: Resource
domain: Resource

is cited as recommended reading
range: Thing
domain: Thing
sub property of: is cited by
comment: The cited entity is cited by the citing entity as an item of recommended reading. This property can be used, for example, to describe references in a lecture reading list, where the cited references are relevant to the general topic of the lecture, but might not be individually cited within the text of the lecture. Similarly, it could be used to describe items in a 'Suggested further reading' list at the end of a book chapter.
type: ObjectProperty
inverse of: cites as recommended reading
type: Property
range: Resource
domain: Resource

License Document
subclass of: Resource
Has Version: LicenseDocument-001
issued: 2008-01-14
type: Class
comment: A legal document giving official permission to do something with a Resource.
subclass of: Rights Statement
Relation: LicenseDocument-001
relation: LicenseDocument-001
date: 2008-01-14

disagrees with
sub property of: refersTo
range: Thing
domain: Thing
inverse of: is disagreed with by
comment: The citing entity disagrees with statements, ideas or conclusions presented in the cited entity.
type: ObjectProperty
description: Example: We do not share Galileo's opinion [X]: the Earth does not move.
sub property of: cites
type: Property
range: Resource
domain: Resource

discusses
sub property of: refersTo
range: Thing
domain: Thing
inverse of: is discussed by
description: Example: We now examine if Galileo is right when he writes [X] that the Earth moves.
type: ObjectProperty
sub property of: cites
comment: The citing entity discusses statements, ideas or conclusions presented in the cited entity.
type: Property
range: Resource
domain: Resource

is in mapping relation with
range: Thing
domain: Thing
definition: Relates two concepts coming, by convention, from different schemes, and that have comparable meanings
comment: These concept mapping relations mirror semantic relations, and the data model defined below is similar (with the exception of skos:exactMatch) to the data model defined for semantic relations. A distinct vocabulary is provided for concept mapping relations, to provide a convenient way to differentiate links within a concept scheme from links between concept schemes. However, this pattern of usage is not a formal requirement of the SKOS data model, and relies on informal definitions of best practice.
type: ObjectProperty
sub property of: is in semantic relation with
type: Property
note: Relates two concepts coming, by convention, from different schemes, and that have comparable meanings
range: Concept
range: Resource
range: http://lodlaundromat.org/.well-known/genid/samples/jena///predicate//d015487fc59044ca316d6c6344e7afa6/d8234c3b1439a879aea940e9009663be#1
domain: Concept
domain: Resource
domain: http://lodlaundromat.org/.well-known/genid/samples/jena///predicate//d015487fc59044ca316d6c6344e7afa6/d8234c3b1439a879aea940e9009663be#1

interest
range: Thing
domain: Thing
type: Property
type: ObjectProperty
comment: A page about a topic of interest to this person.
domain: Agent
range: Document
term status: testing
range: Resource
domain: Resource

work info homepage
range: Thing
domain: Thing
type: Property
type: ObjectProperty
comment: A work info homepage of some person; a page about their work for some organization.
domain: Person
range: Document
term status: testing
range: Resource
domain: Agent
domain: Resource
domain: SpatialThing

is reviewed by
range: Thing
domain: Thing
sub property of: is cited by
type: ObjectProperty
inverse of: reviews
comment: The cited entity presents statements, ideas or conclusions that are reviewed by the citing entity.
type: Property
range: Resource
domain: Resource

account service homepage
range: Thing
domain: Thing
type: Property
type: ObjectProperty
comment: Indicates a homepage of the service provide for this online account.
domain: Online Account
range: Document
term status: testing
range: Resource
domain: Resource

Agent
subclass of: Resource
subclass of: Agent
description: Examples of Agent include person, organization, and software agent.
Has Version: Agent-001
issued: 2008-01-14
type: Agent Class
type: Class
comment: A resource that acts or has the power to act.
Relation: Agent-001
relation: Agent-001
date: 2008-01-14
equivalent class: Agent

is cited as related by
range: Thing
domain: Thing
sub property of: is cited by
comment: The cited entity is cited as being related to the citing entity.
type: ObjectProperty
inverse of: cites as related
type: Property
range: Resource
domain: Resource

has broader
sub property of: is in semantic relation with
range: Thing
domain: Thing
definition: Relates a concept to a concept that is more general in meaning.
comment: Broader concepts are typically rendered as parents in a concept hierarchy (tree).
scope note: By convention, skos:broader is only used to assert an immediate (i.e. direct) hierarchical link between two conceptual resources.
type: ObjectProperty
sub property of: has broader transitive
inverse of: has narrower
type: Property
note: By convention, skos:broader is only used to assert an immediate (i.e. direct) hierarchical link between two conceptual resources.
note: Relates a concept to a concept that is more general in meaning.
range: Concept
range: Resource
range: http://lodlaundromat.org/.well-known/genid/samples/jena///predicate//d015487fc59044ca316d6c6344e7afa6/d8234c3b1439a879aea940e9009663be#1
domain: Concept
domain: Resource
domain: http://lodlaundromat.org/.well-known/genid/samples/jena///predicate//d015487fc59044ca316d6c6344e7afa6/d8234c3b1439a879aea940e9009663be#1

has member
range: Thing
domain: Thing
definition: Relates a collection to one of its members.
type: ObjectProperty
domain: Collection
range: http://lodlaundromat.org/.well-known/genid/samples/jena///predicate//d015487fc59044ca316d6c6344e7afa6/d8234c3b1439a879aea940e9009663be#1
type: Property
note: Relates a collection to one of its members.
range: Resource
domain: http://lodlaundromat.org/.well-known/genid/samples/jena///predicate//d015487fc59044ca316d6c6344e7afa6/d8234c3b1439a879aea940e9009663be#1
domain: Resource

member
range: Thing
domain: Thing
type: Property
type: ObjectProperty
comment: Indicates a member of a Group
domain: Group
range: Agent
term status: stable
range: Resource
domain: Agent
domain: Resource

personal mailbox
domain: Thing
type: Property
type: InverseFunctionalProperty
type: ObjectProperty
comment: A personal mailbox, ie. an Internet mailbox associated with exactly one owner, the first owner of this mailbox. This is a 'static inverse functional property', in that there is (across time and change) at most one individual that ever has any particular value for foaf:mbox.
domain: Agent
range: Thing
term status: stable
range: Resource
domain: Resource

Source
sub property of: relation
description: The described resource may be derived from the related resource in whole or in part. Recommended best practice is to identify the related resource by means of a string conforming to a formal identification system.
note: This term is intended to be used with non-literal values as defined in the DCMI Abstract Model (http://dublincore.org/documents/abstract-model/). As of December 2007, the DCMI Usage Board is seeking a way to express this intention with a formal range declaration.
comment: A related resource from which the described resource is derived.
type: Property
sub property of: source
sub property of: Relation
issued: 2008-01-14
Date Modified: 2008-01-14
Has Version: sourceT-001
Relation: sourceT-001
relation: sourceT-001
date: 2008-01-14

disconnected from
range: Thing
domain: Thing
type: ObjectProperty
type: SymmetricProperty
comment: Relation DC(x,y), read as 'x is disconnected from y'. In order to prevent an exponential growth of triples when handling large amounts of data, a closed world assumption may also be possible. More precisely, by considering not explicitely connected regions as discrete regions. Moreover, discrete regions, which are not explicitely labeled as externally connected, would be considered disconnected from eachother.
domain: Feature
range: Feature
sub property of: discrete from
term status: testing
type: Property
range: Resource
domain: Resource

Concept Scheme
subclass of: Thing
subclass of: Resource
type: Class
definition: A set of concepts, optionally including statements about semantic relationships between those concepts.
scope note: A concept scheme may be defined to include concepts from different sources.
example: Thesauri, classification schemes, subject heading lists, taxonomies, 'folksonomies', and other types of controlled vocabulary are all examples of concept schemes. Concept schemes are also embedded in glossaries and terminologies.
disjoint with: Concept
note: Thesauri, classification schemes, subject heading lists, taxonomies, 'folksonomies', and other types of controlled vocabulary are all examples of concept schemes. Concept schemes are also embedded in glossaries and terminologies.
note: A concept scheme may be defined to include concepts from different sources.
note: A set of concepts, optionally including statements about semantic relationships between those concepts.
disjoint with: Collection

Physical Resource
subclass of: Resource
Has Version: PhysicalResource-001
issued: 2008-01-14
type: Class
comment: A material thing.
Relation: PhysicalResource-001
relation: PhysicalResource-001
date: 2008-01-14

shares authors with
range: Thing
domain: Thing
sub property of: topObjectProperty
type: ObjectProperty
type: SymmetricProperty
comment: Each entity has at least one author in common with the other entity.
type: Property
range: Resource
domain: Resource

has top concept
range: Thing
domain: Thing
definition: Relates, by convention, a concept scheme to a concept which is topmost in the broader/narrower concept hierarchies for that scheme, providing an entry point to these hierarchies.
type: ObjectProperty
domain: Concept Scheme
range: Concept
inverse of: is top concept in scheme
type: Property
note: Relates, by convention, a concept scheme to a concept which is topmost in the broader/narrower concept hierarchies for that scheme, providing an entry point to these hierarchies.
range: Resource
range: http://lodlaundromat.org/.well-known/genid/samples/jena///predicate//d015487fc59044ca316d6c6344e7afa6/d8234c3b1439a879aea940e9009663be#1
domain: Resource

weblog
range: Thing
domain: Thing
sub property of: page
type: Property
range: Document
term status: testing
comment: A weblog of some thing (whether person, group, company etc.).
domain: Agent
type: InverseFunctionalProperty
type: ObjectProperty
range: Resource
domain: Resource

overlaps
range: Thing
domain: Thing
type: ObjectProperty
type: SymmetricProperty
comment: Relation O(x,y), read as 'x overlaps y'. A region x overlaps a region y, if they share at least one common point of their interiors.
domain: Feature
range: Feature
sub property of: connects with
term status: testing
type: Property
range: Resource
domain: Resource

Online Account
subclass of: Resource
type: Class
comment: An online account.
subclass of: Thing
term status: testing

Media Type
subclass of: Resource
Has Version: MediaType-001
issued: 2008-01-14
type: Class
comment: A file format or physical medium.
subclass of: Media Type or Extent
Relation: MediaType-001
relation: MediaType-001
date: 2008-01-14

Agent Class
subclass of: Resource
description: Examples of Agent Class include groups seen as classes, such as students, women, charities, lecturers.
Has Version: AgentClass-003
issued: 2008-01-14
Date Modified: 2012-06-14
type: Class
comment: A group of agents.
subclass of: Class
Relation: AgentClass-003
relation: AgentClass-003
date: 2012-06-14
date: 2008-01-14

derides
sub property of: refersTo
range: Thing
domain: Thing
inverse of: is derided by
sub property of: cites
type: ObjectProperty
description: Example: The ideas published in [X] are incredibly stupid.
comment: The citing entity express derision for the cited entity, or for ideas or conclusions contained within it.
type: Property
range: Resource
domain: Resource

has broader match
sub property of: is in semantic relation with
sub property of: has broader transitive
range: Thing
domain: Thing
definition: skos:broadMatch is used to state a hierarchical mapping link between two conceptual resources in different concept schemes.
type: ObjectProperty
sub property of: is in mapping relation with
sub property of: has broader
inverse of: has narrower match
type: Property
note: skos:broadMatch is used to state a hierarchical mapping link between two conceptual resources in different concept schemes.
range: Resource
range: Concept
range: http://lodlaundromat.org/.well-known/genid/samples/jena///predicate//d015487fc59044ca316d6c6344e7afa6/d8234c3b1439a879aea940e9009663be#1
domain: Resource
domain: Concept
domain: http://lodlaundromat.org/.well-known/genid/samples/jena///predicate//d015487fc59044ca316d6c6344e7afa6/d8234c3b1439a879aea940e9009663be#1

Online Chat Account
subclass of: Resource
subclass of: Thing
type: Class
comment: An online chat account.
subclass of: Online Account
term status: unstable

provides conclusions for
range: Thing
domain: Thing
inverse of: uses conclusions from
type: ObjectProperty
comment: The cited entity presents conclusions that are used in work described in the citing entity.
sub property of: is cited by
type: Property
range: Resource
domain: Resource

has related
range: Thing
domain: Thing
definition: Relates a concept to a concept with which there is an associative semantic relationship.
type: ObjectProperty
sub property of: is in semantic relation with
type: SymmetricProperty
comment: skos:related is disjoint with skos:broaderTransitive
type: Property
note: Relates a concept to a concept with which there is an associative semantic relationship.
range: Concept
range: Resource
range: http://lodlaundromat.org/.well-known/genid/samples/jena///predicate//d015487fc59044ca316d6c6344e7afa6/d8234c3b1439a879aea940e9009663be#1
domain: Concept
domain: Resource
domain: http://lodlaundromat.org/.well-known/genid/samples/jena///predicate//d015487fc59044ca316d6c6344e7afa6/d8234c3b1439a879aea940e9009663be#1

knows
range: Thing
domain: Thing
type: Property
type: ObjectProperty
comment: A person known by this person (indicating some level of reciprocated interaction between the parties).
domain: Person
range: Person
term status: stable
range: Agent
range: Resource
range: SpatialThing
domain: Agent
domain: Resource
domain: SpatialThing

Creator
sub property of: contributor
sub property of: maker
Date Modified: 2010-10-11
comment: An entity primarily responsible for making the resource.
Has Version: creatorT-002
equivalent property: maker
issued: 2008-01-14
sub property of: Contributor
sub property of: creator
type: Property
description: Examples of a Creator include a person, an organization, or a service.
range: Agent
Relation: creatorT-002
relation: creatorT-002
date: 2010-10-11
date: 2008-01-14
range: Thing
range: Resource
domain: Thing
domain: Resource

http://lodlaundromat.org/.well-known/genid/samples/jena///predicate//d015487fc59044ca316d6c6344e7afa6/c60ad03589cdf703d8c0bb969239bbfb#1
subclass of: Thing
type: Class
subclass of: Resource
cardinality: 1
on property: has citation characterization
type: Restriction
subclass of: http://lodlaundromat.org/.well-known/genid/samples/jena///predicate//d015487fc59044ca316d6c6344e7afa6/69c3b512152bcf0ad31f557dc516a970#4
subclass of: http://lodlaundromat.org/.well-known/genid/samples/jena///predicate//d015487fc59044ca316d6c6344e7afa6/010554247447337669685a3ec311d6ea#1
subclass of: http://lodlaundromat.org/.well-known/genid/samples/jena///predicate//d015487fc59044ca316d6c6344e7afa6/7b2fc0fec5f606b68f385615fedf7846#2
equivalent class: http://lodlaundromat.org/.well-known/genid/samples/jena///predicate//d015487fc59044ca316d6c6344e7afa6/7b2fc0fec5f606b68f385615fedf7846#2
equivalent class: http://lodlaundromat.org/.well-known/genid/samples/jena///predicate//d015487fc59044ca316d6c6344e7afa6/010554247447337669685a3ec311d6ea#1
equivalent class: http://lodlaundromat.org/.well-known/genid/samples/jena///predicate//d015487fc59044ca316d6c6344e7afa6/69c3b512152bcf0ad31f557dc516a970#4

contains assertion from
sub property of: refersTo
range: Thing
domain: Thing
inverse of: provides assertion for
type: ObjectProperty
comment: The citing entity contains a statement of fact or a logical assertion (or a collection of such facts and/or assertions) originally present in the cited entity. This object property is designed to be used to relate a separate abstract, summary or nanopublication to the cited entity upon which it is based.
sub property of: cites
description: Example: We think that to stand on the top of giants [X] is a valuable principle to follow for our own research.
type: Property
range: Resource
domain: Resource

http://lodlaundromat.org/.well-known/genid/samples/jena///predicate//d015487fc59044ca316d6c6344e7afa6/7b2fc0fec5f606b68f385615fedf7846#1
type: Class
subclass of: Resource
subclass of: Thing
type: Restriction
on property: has citing entity
cardinality: 1
subclass of: http://lodlaundromat.org/.well-known/genid/samples/jena///predicate//d015487fc59044ca316d6c6344e7afa6/c60ad03589cdf703d8c0bb969239bbfb#2
subclass of: http://lodlaundromat.org/.well-known/genid/samples/jena///predicate//d015487fc59044ca316d6c6344e7afa6/69c3b512152bcf0ad31f557dc516a970#2
subclass of: http://lodlaundromat.org/.well-known/genid/samples/jena///predicate//d015487fc59044ca316d6c6344e7afa6/010554247447337669685a3ec311d6ea#3
equivalent class: http://lodlaundromat.org/.well-known/genid/samples/jena///predicate//d015487fc59044ca316d6c6344e7afa6/010554247447337669685a3ec311d6ea#3
equivalent class: http://lodlaundromat.org/.well-known/genid/samples/jena///predicate//d015487fc59044ca316d6c6344e7afa6/69c3b512152bcf0ad31f557dc516a970#2
equivalent class: http://lodlaundromat.org/.well-known/genid/samples/jena///predicate//d015487fc59044ca316d6c6344e7afa6/c60ad03589cdf703d8c0bb969239bbfb#2

is parodied by
range: Thing
domain: Thing
type: ObjectProperty
comment: The characteristic style or content of the cited entity is imitated by the citing entity for comic effect, usually without explicit citation.
sub property of: is cited by
inverse of: parodies
type: Property
range: Resource
domain: Resource

page
range: Thing
type: Property
type: ObjectProperty
comment: A page or document about this thing.
domain: Thing
range: Document
inverse of: topic
term status: testing
range: Resource
domain: Resource

Location, Period, or Jurisdiction
subclass of: Resource
Has Version: LocationPeriodOrJurisdiction-001
issued: 2008-01-14
type: Class
comment: A location, period of time, or jurisdiction.
Relation: LocationPeriodOrJurisdiction-001
relation: LocationPeriodOrJurisdiction-001
date: 2008-01-14

Concept
subclass of: Thing
subclass of: http://lodlaundromat.org/.well-known/genid/samples/jena///predicate//d015487fc59044ca316d6c6344e7afa6/d8234c3b1439a879aea940e9009663be#1
subclass of: Resource
type: Class
definition: An idea or notion; a unit of thought.
note: An idea or notion; a unit of thought.
disjoint with: Concept Scheme
disjoint with: Collection

includes excerpt from
range: Thing
domain: Thing
sub property of: refersTo
type: ObjectProperty
comment: The citing entity includes one or more excerpts from the cited entity.
description: An excerpt is more general than a quotation. It is generally used to indicate a re-published extract from a book, instruction manual, film, radio programme, etc, that need not be what someone said. For example: Oxford 01865 Oxshott 01372 Oxted 01883 Oxton 01578 is an excerpt from the UK Dialling Codes section of the Oxford Telephone Directory.
inverse of: provides excerpt for
description: Example: In her work, the author states that even though most Human Information Behaviour researchers are familiar with the literature related to their studies, it is not uncommon for investigators to fail to see the benefits they may gain from previous mistakes [X].
sub property of: cites
type: Property
range: Resource
domain: Resource

is confirmed by
range: Thing
domain: Thing
comment: The cited entity presents facts, ideas or statements that are confirmed by the citing entity.
type: ObjectProperty
sub property of: is cited by
inverse of: confirms
type: Property
range: Resource
domain: Resource

retracts
sub property of: refersTo
range: Thing
domain: Thing
inverse of: is retracted by
comment: The citing entity constitutes a formal retraction of the cited entity.
description: Example: We wrote that the Earth moves in [X]; we now retire such statement.
type: ObjectProperty
sub property of: cites
type: Property
range: Resource
domain: Resource

shares funding agency with
range: Thing
domain: Thing
comment: The two entities result from activities that have been funded by the same funding agency.
type: ObjectProperty
type: SymmetricProperty
type: Property
range: Resource
domain: Resource

account
range: Thing
domain: Thing
type: Property
type: ObjectProperty
comment: Indicates an account held by this agent.
domain: Agent
range: Online Account
term status: testing
range: Resource
domain: Resource

Label Property
subclass of: Resource
subclass of: Thing
type: Class
comment: A foaf:LabelProperty is any RDF property with texual values that serve as labels.
term status: unstable

homepage
range: Thing
comment: A homepage for some thing.
range: Document
type: Property
term status: stable
sub property of: page
sub property of: is primary topic of
domain: Thing
type: ObjectProperty
type: InverseFunctionalProperty
range: Resource
domain: Resource

provides excerpt for
inverse of: includes excerpt from
range: Thing
domain: Thing
sub property of: is cited by
comment: The cited entity contains information, usually of a textual nature, that is excerpted by (used as an excerpt within) the citing entity.
type: ObjectProperty
type: Property
range: Resource
domain: Resource

Linguistic System
subclass of: Resource
description: Examples include written, spoken, sign, and computer languages.
Has Version: LinguisticSystem-001
issued: 2008-01-14
type: Class
comment: A system of signs, symbols, sounds, gestures, or rules used in communication.
Relation: LinguisticSystem-001
relation: LinguisticSystem-001
date: 2008-01-14

partially overlaps
sub property of: connects with
range: Thing
domain: Thing
type: ObjectProperty
type: SymmetricProperty
comment: Relation PO(x,y), read as 'x partially overlaps y'. A region x overlaps a region y, if they share at least one common point of their interiors, and one does not contain the other within its borders.
domain: Feature
range: Feature
sub property of: overlaps
term status: testing
type: Property
range: Resource
domain: Resource

PersonalProfileDocument
subclass of: Resource
subclass of: Thing
type: Class
comment: A personal profile RDF document.
subclass of: Document
term status: testing

speculates on
sub property of: refersTo
range: Thing
domain: Thing
inverse of: is speculated on by
comment: The citing entity speculates on something within or related to the cited entity, without firm evidence.
description: Example: We believe that if Galileo believed that Earth goes around the Sun [X], he also should believe that Moon goes around Earth.
sub property of: cites
type: ObjectProperty
type: Property
range: Resource
domain: Resource

has broader transitive
range: Thing
domain: Thing
definition: skos:broaderTransitive is a transitive superproperty of skos:broader.
scope note: By convention, skos:broaderTransitive is not used to make assertions. Rather, the properties can be used to draw inferences about the transitive closure of the hierarchical relation, which is useful e.g. when implementing a simple query expansion algorithm in a search application.
type: ObjectProperty
sub property of: is in semantic relation with
type: TransitiveProperty
inverse of: has narrower transitive
type: Property
note: By convention, skos:broaderTransitive is not used to make assertions. Rather, the properties can be used to draw inferences about the transitive closure of the hierarchical relation, which is useful e.g. when implementing a simple query expansion algorithm in a search application.
note: skos:broaderTransitive is a transitive superproperty of skos:broader.
range: Concept
range: Resource
range: http://lodlaundromat.org/.well-known/genid/samples/jena///predicate//d015487fc59044ca316d6c6344e7afa6/d8234c3b1439a879aea940e9009663be#1
domain: Concept
domain: Resource
domain: http://lodlaundromat.org/.well-known/genid/samples/jena///predicate//d015487fc59044ca316d6c6344e7afa6/d8234c3b1439a879aea940e9009663be#1

is refuted by
range: Thing
domain: Thing
inverse of: refutes
type: ObjectProperty
comment: The cited entity presents statements, ideas or conclusions that are refuted by the citing entity.
sub property of: is cited by
type: Property
range: Resource
domain: Resource

File Format
subclass of: Resource
description: Examples include the formats defined by the list of Internet Media Types.
Has Version: FileFormat-001
issued: 2008-01-14
type: Class
comment: A digital resource format.
subclass of: Media Type
Relation: FileFormat-001
relation: FileFormat-001
date: 2008-01-14

critiques
sub property of: refersTo
range: Thing
domain: Thing
inverse of: is critiqued by
sub property of: cites
comment: The citing entity critiques statements, ideas or conclusions presented in the cited entity.
description: Example: The ideas presented in [X] are badly substantantiated.
type: ObjectProperty
type: Property
range: Resource
domain: Resource

SpatialThing
subclass of: Resource
type: Class
comment: Anything with spatial extent, i.e. size, shape, or position. e.g. people, places, bowling balls, as well as abstract areas like cubes.

is part of
sub property of: connects with
range: Thing
domain: Thing
type: ObjectProperty
type: TransitiveProperty
comment: Relation P(x,y), read as 'x is a part of y', holds whenever the region x is contained within the borders of the region y.
domain: Feature
range: Feature
sub property of: overlaps
inverse of: contains
term status: testing
type: Property
range: Resource
domain: Resource

disputes
sub property of: refersTo
range: Thing
domain: Thing
inverse of: is disputed by
sub property of: cites
comment: The citing entity disputes statements, ideas or conclusions presented in the cited entity.
description: Example: We doubt that Galileo is right when he writes [X] that the Earth moves.
type: ObjectProperty
type: Property
range: Resource
domain: Resource

uses conclusions from
range: Thing
domain: Thing
sub property of: refersTo
inverse of: provides conclusions for
description: Example: Building upon Galileo's findings [X], we discovered that all the planets move.
comment: The citing entity describes work that uses conclusions presented in the cited entity.
type: ObjectProperty
sub property of: cites
type: Property
range: Resource
domain: Resource

has narrower match
sub property of: is in semantic relation with
range: Thing
domain: Thing
sub property of: has narrower transitive
definition: skos:narrowMatch is used to state a hierarchical mapping link between two conceptual resources in different concept schemes.
type: ObjectProperty
sub property of: is in mapping relation with
sub property of: has narrower
inverse of: has broader match
type: Property
note: skos:narrowMatch is used to state a hierarchical mapping link between two conceptual resources in different concept schemes.
range: Resource
range: Concept
range: http://lodlaundromat.org/.well-known/genid/samples/jena///predicate//d015487fc59044ca316d6c6344e7afa6/d8234c3b1439a879aea940e9009663be#1
domain: Resource
domain: Concept
domain: http://lodlaundromat.org/.well-known/genid/samples/jena///predicate//d015487fc59044ca316d6c6344e7afa6/d8234c3b1439a879aea940e9009663be#1

documents
sub property of: refersTo
range: Thing
domain: Thing
inverse of: is documented by
sub property of: cites
comment: The citing entity documents information about the cited entity.
type: ObjectProperty
description: Example: Herein we report in detail the complete set of ontological rules defined in the Overlapping Ontology [X].
type: Property
range: Resource
domain: Resource

topic
domain: Thing
type: Property
type: ObjectProperty
comment: A topic of some page or document.
domain: Document
range: Thing
inverse of: page
term status: testing
range: Resource
domain: Resource

equals
sub property of: connects with
sub property of: overlaps
range: Thing
domain: Thing
sub property of: contains
domain: Feature
range: Feature
term status: testing
type: SymmetricProperty
sub property of: is part of
comment: Relation x=y, read as 'x is identical with y'. This relation holds when two regions are spatially co-located.
type: ObjectProperty
type: TransitiveProperty
type: Property
range: Resource
domain: Resource

Frequency
subclass of: Resource
Has Version: Frequency-001
issued: 2008-01-14
type: Class
comment: A rate at which something recurs.
Relation: Frequency-001
relation: Frequency-001
date: 2008-01-14

credits
sub property of: refersTo
range: Thing
domain: Thing
inverse of: is credited by
type: ObjectProperty
sub property of: cites
comment: The citing entity acknowledges contributions made by the cited entity.
description: Example: Galileo was the first to observe Jupiter's satellites [X].
type: Property
range: Resource
domain: Resource

maker
sub property of: contributor
sub property of: Contributor
sub property of: creator
sub property of: Creator
range: Thing
equivalent property: Creator
comment: An agent that made this thing.
term status: stable
domain: Thing
inverse of: made
type: Property
range: Agent
type: ObjectProperty
range: Resource
domain: Resource

http://lodlaundromat.org/.well-known/genid/samples/jena///predicate//d015487fc59044ca316d6c6344e7afa6/010554247447337669685a3ec311d6ea#3
subclass of: Thing
type: Class
subclass of: Resource
on property: has citing entity
cardinality: 1
type: Restriction
subclass of: http://lodlaundromat.org/.well-known/genid/samples/jena///predicate//d015487fc59044ca316d6c6344e7afa6/69c3b512152bcf0ad31f557dc516a970#2
subclass of: http://lodlaundromat.org/.well-known/genid/samples/jena///predicate//d015487fc59044ca316d6c6344e7afa6/7b2fc0fec5f606b68f385615fedf7846#1
subclass of: http://lodlaundromat.org/.well-known/genid/samples/jena///predicate//d015487fc59044ca316d6c6344e7afa6/c60ad03589cdf703d8c0bb969239bbfb#2
equivalent class: http://lodlaundromat.org/.well-known/genid/samples/jena///predicate//d015487fc59044ca316d6c6344e7afa6/c60ad03589cdf703d8c0bb969239bbfb#2
equivalent class: http://lodlaundromat.org/.well-known/genid/samples/jena///predicate//d015487fc59044ca316d6c6344e7afa6/7b2fc0fec5f606b68f385615fedf7846#1
equivalent class: http://lodlaundromat.org/.well-known/genid/samples/jena///predicate//d015487fc59044ca316d6c6344e7afa6/69c3b512152bcf0ad31f557dc516a970#2

is disagreed with by
range: Thing
domain: Thing
comment: The cited entity presents statements, ideas or conclusions that are disagreed with by the citing entity.
type: ObjectProperty
sub property of: is cited by
inverse of: disagrees with
type: Property
range: Resource
domain: Resource

is top concept in scheme
range: Thing
domain: Thing
definition: Relates a concept to the concept scheme that it is a top level concept of.
type: ObjectProperty
sub property of: is in scheme
inverse of: has top concept
type: Property
domain: Concept
range: Concept Scheme
note: Relates a concept to the concept scheme that it is a top level concept of.
range: Resource
domain: Resource
domain: http://lodlaundromat.org/.well-known/genid/samples/jena///predicate//d015487fc59044ca316d6c6344e7afa6/d8234c3b1439a879aea940e9009663be#1

openid
range: Thing
domain: Thing
sub property of: page
range: Document
type: ObjectProperty
term status: testing
type: Property
domain: Agent
type: InverseFunctionalProperty
sub property of: is primary topic of
comment: An OpenID for an Agent.
range: Resource
domain: Resource

qualifies
sub property of: refersTo
range: Thing
domain: Thing
inverse of: is qualified by
type: ObjectProperty
sub property of: cites
comment: The citing entity qualifies or places conditions or restrictions upon statements, ideas or conclusions presented in the cited entity.
description: Example: Galileo's masterpiece 'Dialogo sopra i due massimi sistemi del mondo' [X] is formally a dialog and substantially a scientific pamphlet.
type: Property
range: Resource
domain: Resource

has related match
sub property of: is in semantic relation with
range: Thing
domain: Thing
definition: skos:relatedMatch is used to state an associative mapping link between two conceptual resources in different concept schemes.
type: ObjectProperty
sub property of: is in mapping relation with
sub property of: has related
type: SymmetricProperty
type: Property
note: skos:relatedMatch is used to state an associative mapping link between two conceptual resources in different concept schemes.
range: Concept
range: Resource
range: http://lodlaundromat.org/.well-known/genid/samples/jena///predicate//d015487fc59044ca316d6c6344e7afa6/d8234c3b1439a879aea940e9009663be#1
domain: Concept
domain: Resource
domain: http://lodlaundromat.org/.well-known/genid/samples/jena///predicate//d015487fc59044ca316d6c6344e7afa6/d8234c3b1439a879aea940e9009663be#1

http://lodlaundromat.org/.well-known/genid/samples/jena///predicate//d015487fc59044ca316d6c6344e7afa6/c60ad03589cdf703d8c0bb969239bbfb#2
type: Class
subclass of: Resource
subclass of: Thing
on property: has citing entity
type: Restriction
cardinality: 1
subclass of: http://lodlaundromat.org/.well-known/genid/samples/jena///predicate//d015487fc59044ca316d6c6344e7afa6/7b2fc0fec5f606b68f385615fedf7846#1
subclass of: http://lodlaundromat.org/.well-known/genid/samples/jena///predicate//d015487fc59044ca316d6c6344e7afa6/010554247447337669685a3ec311d6ea#3
subclass of: http://lodlaundromat.org/.well-known/genid/samples/jena///predicate//d015487fc59044ca316d6c6344e7afa6/69c3b512152bcf0ad31f557dc516a970#2
equivalent class: http://lodlaundromat.org/.well-known/genid/samples/jena///predicate//d015487fc59044ca316d6c6344e7afa6/69c3b512152bcf0ad31f557dc516a970#2
equivalent class: http://lodlaundromat.org/.well-known/genid/samples/jena///predicate//d015487fc59044ca316d6c6344e7afa6/010554247447337669685a3ec311d6ea#3
equivalent class: http://lodlaundromat.org/.well-known/genid/samples/jena///predicate//d015487fc59044ca316d6c6344e7afa6/7b2fc0fec5f606b68f385615fedf7846#1

http://lodlaundromat.org/.well-known/genid/samples/jena///predicate//d015487fc59044ca316d6c6344e7afa6/7b2fc0fec5f606b68f385615fedf7846#2
type: Class
subclass of: Resource
subclass of: Thing
on property: has citation characterization
type: Restriction
cardinality: 1
subclass of: http://lodlaundromat.org/.well-known/genid/samples/jena///predicate//d015487fc59044ca316d6c6344e7afa6/69c3b512152bcf0ad31f557dc516a970#4
subclass of: http://lodlaundromat.org/.well-known/genid/samples/jena///predicate//d015487fc59044ca316d6c6344e7afa6/c60ad03589cdf703d8c0bb969239bbfb#1
subclass of: http://lodlaundromat.org/.well-known/genid/samples/jena///predicate//d015487fc59044ca316d6c6344e7afa6/010554247447337669685a3ec311d6ea#1
equivalent class: http://lodlaundromat.org/.well-known/genid/samples/jena///predicate//d015487fc59044ca316d6c6344e7afa6/010554247447337669685a3ec311d6ea#1
equivalent class: http://lodlaundromat.org/.well-known/genid/samples/jena///predicate//d015487fc59044ca316d6c6344e7afa6/c60ad03589cdf703d8c0bb969239bbfb#1
equivalent class: http://lodlaundromat.org/.well-known/genid/samples/jena///predicate//d015487fc59044ca316d6c6344e7afa6/69c3b512152bcf0ad31f557dc516a970#4

likes
range: Thing
domain: Thing
type: ObjectProperty
comment: A property that permits you to express appreciation of or interest in something that is the object of the RDF triple, or to express that it is worth thinking about even if you do not agree with its content, enabling social media 'likes' statements to be encoded in RDF. Use of this property does NOT imply the existence of a formal citation of the entity that is 'liked'.
type: Property
range: Resource
domain: Resource

provides quotation for
range: Thing
domain: Thing
comment: The cited entity contains information, usually of a textual nature, that is quoted by (used as a quotation within) the citing entity.
type: ObjectProperty
sub property of: is cited by
inverse of: includes quotation from
type: Property
range: Resource
domain: Resource

parodies
inverse of: is parodied by
range: Thing
domain: Thing
sub property of: refersTo
type: ObjectProperty
description: Example: We act as giants on the shoulders of dwarfs [X]!
comment: The citing entity imitates the characteristic style or content of the cited entity for comic effect, usually without explicit citation.
sub property of: cites
type: Property
range: Resource
domain: Resource

Media Type or Extent
subclass of: Resource
Has Version: MediaTypeOrExtent-001
issued: 2008-01-14
type: Class
comment: A media type or extent.
Relation: MediaTypeOrExtent-001
relation: MediaTypeOrExtent-001
date: 2008-01-14

provides assertion for
range: Thing
domain: Thing
type: ObjectProperty
inverse of: contains assertion from
comment: The cited entity contains and is the original source of a statement of fact or a logical assertion (or a collection of such facts and/or assertions) that is to be found in the citing entity. This inverse object property is designed to be used to relate a cited entity to a separate abstract, summary or nanopublication based upon it.
sub property of: is cited by
type: Property
range: Resource
domain: Resource

Physical Medium
subclass of: Resource
description: Examples include paper, canvas, or DVD.
Has Version: PhysicalMedium-001
issued: 2008-01-14
type: Class
comment: A physical material or carrier.
subclass of: Media Type
Relation: PhysicalMedium-001
relation: PhysicalMedium-001
date: 2008-01-14

is proper part of
sub property of: connects with
sub property of: overlaps
range: Thing
domain: Thing
type: ObjectProperty
type: TransitiveProperty
comment: Relation PP(x,y), read as 'x is a proper part of y', means that the region x is contained within the borders of the region y, and region y is not contained within the borders of the region y, which means they are not equals.
domain: Feature
range: Feature
sub property of: is part of
inverse of: properly contains
term status: testing
type: Property
range: Resource
domain: Resource

cites for information
sub property of: refersTo
range: Thing
domain: Thing
inverse of: is cited for information by
type: ObjectProperty
description: Example: The grammar of Pascal was introduced in [X].
sub property of: cites
comment: The citing entity cites the cited entity as a source of information on the subject under discussion.
type: Property
range: Resource
domain: Resource

reviews
inverse of: is reviewed by
range: Thing
domain: Thing
sub property of: refersTo
description: Example: This paper discusses Toulmin's methodology in modelling argumentation [X], focussing on highlighting advantages and drawbacks of the application of such a methodology in the Social Web.
type: ObjectProperty
comment: The citing entity reviews statements, ideas or conclusions presented in the cited entity.
sub property of: cites
type: Property
range: Resource
domain: Resource

Online E-commerce Account
subclass of: Resource
subclass of: Thing
type: Class
comment: An online e-commerce account.
subclass of: Online Account
term status: unstable

Provenance Statement
subclass of: Resource
Has Version: ProvenanceStatement-001
issued: 2008-01-14
type: Class
comment: A statement of any changes in ownership and custody of a resource since its creation that are significant for its authenticity, integrity, and interpretation.
Relation: ProvenanceStatement-001
relation: ProvenanceStatement-001
date: 2008-01-14

is cited as metadata document by
range: Thing
domain: Thing
inverse of: cites as metadata document
type: ObjectProperty
comment: The cited entity is cited as being the container of metadata relating to the citing entity.
sub property of: is cited by
type: Property
range: Resource
domain: Resource

cites as source document
sub property of: refersTo
range: Thing
domain: Thing
inverse of: is cited as source document by
sub property of: cites
type: ObjectProperty
comment: The citing entity cites the cited entity as being the entity from which the citing entity is derived, or about which the citing entity contains metadata.
description: Example: Several sections of this work are based on our literature review of the topic published as journal article [X].
type: Property
range: Resource
domain: Resource

is qualified by
range: Thing
domain: Thing
inverse of: qualifies
type: ObjectProperty
sub property of: is cited by
comment: The cited entity presents statements, ideas or conclusions that are qualified or have conditions placed upon them by the citing entity.
type: Property
range: Resource
domain: Resource

is agreed with by
range: Thing
domain: Thing
type: ObjectProperty
inverse of: agrees with
comment: The cited entity contains statements, ideas or conclusions with which the citing entity agrees.
sub property of: is cited by
type: Property
range: Resource
domain: Resource

Jurisdiction
subclass of: Resource
Has Version: Jurisdiction-001
issued: 2008-01-14
type: Class
comment: The extent or range of judicial, law enforcement, or other authority.
subclass of: Location, Period, or Jurisdiction
Relation: Jurisdiction-001
relation: Jurisdiction-001
date: 2008-01-14

cites as authority
sub property of: refersTo
range: Thing
domain: Thing
inverse of: is cited as authority by
description: Example: Newton asserted that we are like dwarfs standing on the shoulders of giants [X].
type: ObjectProperty
comment: The citing entity cites the cited entity as one that provides an authoritative description or definition of the subject under discussion.
sub property of: cites
type: Property
range: Resource
domain: Resource

Group
subclass of: Resource
subclass of: Thing
subclass of: Agent
type: Class
comment: A class of Agents.
term status: stable

workplace homepage
range: Thing
domain: Thing
type: Property
type: ObjectProperty
comment: A workplace homepage of some person; the homepage of an organization they work for.
domain: Person
range: Document
term status: testing
range: Resource
domain: Agent
domain: Resource
domain: SpatialThing

shares author institution with
range: Thing
domain: Thing
comment: Each entity has at least one author that shares a common institutional affiliation with an author of the other entity.
type: ObjectProperty
type: SymmetricProperty
type: Property
range: Resource
domain: Resource

account
range: Thing
domain: Thing
type: Property
type: ObjectProperty
comment: Indicates an account held by this agent.
domain: Agent
range: Online Account
term status: archaic
range: Resource
domain: Resource

Image
subclass of: Resource
subclass of: Thing
type: Class
comment: An image.
subclass of: Document
term status: testing

compiles
sub property of: refersTo
range: Thing
domain: Thing
inverse of: is compiled by
sub property of: cites
comment: The citing entity is used to create or compile the cited entity.
type: ObjectProperty
description: Example: This book gathers interviews with academic researchers of several disciplines [X].
description: Note: This property has been imported from the CiTO4Data ontology, usage of which has been deprecated.
type: Property
range: Resource
domain: Resource

cites as metadata document
inverse of: is cited as metadata document by
range: Thing
domain: Thing
sub property of: refersTo
type: ObjectProperty
sub property of: cites
description: Example: Basic bibliographic, entity and project metadata relating to this article, recorded in a structured machine-readable form, is available as an additional file [X] accompanying this paper.
comment: The citing entity cites the cited entity as being the container of metadata describing the citing entity.
type: Property
range: Resource
domain: Resource

Person
subclass of: Resource
subclass of: Thing
subclass of: Agent
comment: A person.
term status: stable
subclass of: SpatialThing
disjoint with: Project
type: Class
subclass of: Person
disjoint with: Organization

http://lodlaundromat.org/.well-known/genid/samples/jena///predicate//d015487fc59044ca316d6c6344e7afa6/69c3b512152bcf0ad31f557dc516a970#2
type: Class
subclass of: Thing
subclass of: Resource
on property: has citing entity
cardinality: 1
type: Restriction
subclass of: http://lodlaundromat.org/.well-known/genid/samples/jena///predicate//d015487fc59044ca316d6c6344e7afa6/7b2fc0fec5f606b68f385615fedf7846#1
subclass of: http://lodlaundromat.org/.well-known/genid/samples/jena///predicate//d015487fc59044ca316d6c6344e7afa6/c60ad03589cdf703d8c0bb969239bbfb#2
subclass of: http://lodlaundromat.org/.well-known/genid/samples/jena///predicate//d015487fc59044ca316d6c6344e7afa6/010554247447337669685a3ec311d6ea#3
equivalent class: http://lodlaundromat.org/.well-known/genid/samples/jena///predicate//d015487fc59044ca316d6c6344e7afa6/010554247447337669685a3ec311d6ea#3
equivalent class: http://lodlaundromat.org/.well-known/genid/samples/jena///predicate//d015487fc59044ca316d6c6344e7afa6/c60ad03589cdf703d8c0bb969239bbfb#2
equivalent class: http://lodlaundromat.org/.well-known/genid/samples/jena///predicate//d015487fc59044ca316d6c6344e7afa6/7b2fc0fec5f606b68f385615fedf7846#1

uses method in
sub property of: refersTo
range: Thing
domain: Thing
inverse of: provides method for
description: Example: We follow [X] in using design patterns for testing.
sub property of: cites
type: ObjectProperty
comment: The citing entity describes work that uses a method detailed in the cited entity.
type: Property
range: Resource
domain: Resource

Feature
subclass of: Thing
subclass of: Resource
type: Class
comment: A geographical feature, capable of holding spatial relations.
term status: testing

http://lodlaundromat.org/.well-known/genid/samples/jena///predicate//d015487fc59044ca316d6c6344e7afa6/010554247447337669685a3ec311d6ea#4
type: Class
subclass of: Resource
subclass of: Thing
type: Restriction
on property: has cited entity
cardinality: 1
subclass of: http://lodlaundromat.org/.well-known/genid/samples/jena///predicate//d015487fc59044ca316d6c6344e7afa6/c60ad03589cdf703d8c0bb969239bbfb#5
subclass of: http://lodlaundromat.org/.well-known/genid/samples/jena///predicate//d015487fc59044ca316d6c6344e7afa6/7b2fc0fec5f606b68f385615fedf7846#3
subclass of: http://lodlaundromat.org/.well-known/genid/samples/jena///predicate//d015487fc59044ca316d6c6344e7afa6/69c3b512152bcf0ad31f557dc516a970#3
equivalent class: http://lodlaundromat.org/.well-known/genid/samples/jena///predicate//d015487fc59044ca316d6c6344e7afa6/69c3b512152bcf0ad31f557dc516a970#3
equivalent class: http://lodlaundromat.org/.well-known/genid/samples/jena///predicate//d015487fc59044ca316d6c6344e7afa6/7b2fc0fec5f606b68f385615fedf7846#3
equivalent class: http://lodlaundromat.org/.well-known/genid/samples/jena///predicate//d015487fc59044ca316d6c6344e7afa6/c60ad03589cdf703d8c0bb969239bbfb#5

phone
range: Thing
domain: Thing
type: Property
type: ObjectProperty
comment: A phone, specified using fully qualified tel: URI scheme (refs: http://www.w3.org/Addressing/schemes.html#tel).
term status: testing
range: Resource
domain: Resource

plagiarizes
sub property of: refersTo
range: Thing
domain: Thing
inverse of: is plagiarized by
sub property of: cites
comment: A property indicating that the author of the citing entity plagiarizes the cited entity, by including textual or other elements from the cited entity without formal acknowledgement of their source. The citing entity thus contains no explicit citation of the cited entity, according to the norms of scholarly practice, but cites it implicitly.
description: Example: The conclusion of our dissertation can be summarised by the following motto, we created specifically for this purpose: we are like dwarfs standing on the shoulders of giants.
type: ObjectProperty
type: Property
range: Resource
domain: Resource

depicts
domain: Thing
type: Property
type: ObjectProperty
comment: A thing depicted in this representation.
domain: Image
range: Thing
inverse of: depiction
term status: testing
range: Resource
domain: Resource
domain: Document

has cited entity
range: Thing
domain: Thing
comment: A property that relates a citation act to the entity that is the target of that citation.
type: ObjectProperty
sub property of: isSettingFor
type: Property
range: Resource
domain: Resource

is credited by
range: Thing
domain: Thing
type: ObjectProperty
comment: The cited entity makes contributions that are acknowledged by the citing entity.
sub property of: is cited by
inverse of: credits
type: Property
range: Resource
domain: Resource

ridicules
sub property of: refersTo
range: Thing
domain: Thing
inverse of: is ridiculed by
type: ObjectProperty
sub property of: cites
description: Example: Galileo said that the Earth "moves" [X]; really? And where is it going?
comment: The citing entity ridicules the cited entity or aspects of its contents.
type: Property
range: Resource
domain: Resource

is cited as source document by
range: Thing
domain: Thing
sub property of: is cited by
type: ObjectProperty
comment: The cited entity is cited as being the entity from which the citing entity is derived, or about which the citing entity contains metadata.
inverse of: cites as source document
type: Property
range: Resource
domain: Resource

corrects
sub property of: refersTo
range: Thing
domain: Thing
inverse of: is corrected by
sub property of: cites
description: Example: The result published in [X] is partially wrong, the correct result is 42.
comment: The citing entity corrects statements, ideas or conclusions presented in the cited entity.
type: ObjectProperty
type: Property
range: Resource
domain: Resource

is cited for information by
range: Thing
domain: Thing
sub property of: is cited by
type: ObjectProperty
comment: The cited entity is cited as a source of information on the subject under discussion in the citing entity.
inverse of: cites for information
type: Property
range: Resource
domain: Resource

http://lodlaundromat.org/.well-known/genid/samples/jena///predicate//d015487fc59044ca316d6c6344e7afa6/7b2fc0fec5f606b68f385615fedf7846#3
type: Class
subclass of: Resource
subclass of: Thing
cardinality: 1
type: Restriction
on property: has cited entity
subclass of: http://lodlaundromat.org/.well-known/genid/samples/jena///predicate//d015487fc59044ca316d6c6344e7afa6/69c3b512152bcf0ad31f557dc516a970#3
subclass of: http://lodlaundromat.org/.well-known/genid/samples/jena///predicate//d015487fc59044ca316d6c6344e7afa6/010554247447337669685a3ec311d6ea#4
subclass of: http://lodlaundromat.org/.well-known/genid/samples/jena///predicate//d015487fc59044ca316d6c6344e7afa6/c60ad03589cdf703d8c0bb969239bbfb#5
equivalent class: http://lodlaundromat.org/.well-known/genid/samples/jena///predicate//d015487fc59044ca316d6c6344e7afa6/c60ad03589cdf703d8c0bb969239bbfb#5
equivalent class: http://lodlaundromat.org/.well-known/genid/samples/jena///predicate//d015487fc59044ca316d6c6344e7afa6/010554247447337669685a3ec311d6ea#4
equivalent class: http://lodlaundromat.org/.well-known/genid/samples/jena///predicate//d015487fc59044ca316d6c6344e7afa6/69c3b512152bcf0ad31f557dc516a970#3

is cited as potential solution by
range: Thing
domain: Thing
type: ObjectProperty
comment: The cited entity is cited as providing or containing a possible solution to the issues being discussed in the citing entity.
sub property of: is cited by
inverse of: cites as potential solution
type: Property
range: Resource
domain: Resource

is cited by
range: Thing
domain: Thing
inverse of: cites
type: ObjectProperty
comment: The cited entity (the subject of the RDF triple) is cited by the citing entity (the object of the triple).
type: Property
range: Resource
domain: Resource

provides method for
range: Thing
domain: Thing
sub property of: is cited by
comment: The cited entity details a method that is used in work described by the citing entity.
type: ObjectProperty
inverse of: uses method in
type: Property
range: Resource
domain: Resource

is in scheme
range: Thing
domain: Thing
definition: Relates a resource (for example a concept) to a concept scheme in which it is included.
scope note: A concept may be a member of more than one concept scheme.
type: ObjectProperty
range: Concept Scheme
type: Property
note: A concept may be a member of more than one concept scheme.
note: Relates a resource (for example a concept) to a concept scheme in which it is included.
range: Resource
domain: Resource

citation act
subclass of: http://lodlaundromat.org/.well-known/genid/samples/jena///predicate//d015487fc59044ca316d6c6344e7afa6/c60ad03589cdf703d8c0bb969239bbfb#3
subclass of: http://lodlaundromat.org/.well-known/genid/samples/jena///predicate//d015487fc59044ca316d6c6344e7afa6/010554247447337669685a3ec311d6ea#7
type: Class
subclass of: http://lodlaundromat.org/.well-known/genid/samples/jena///predicate//d015487fc59044ca316d6c6344e7afa6/69c3b512152bcf0ad31f557dc516a970#5
subclass of: Thing
subclass of: Resource
subclass of: http://lodlaundromat.org/.well-known/genid/samples/jena///predicate//d015487fc59044ca316d6c6344e7afa6/7b2fc0fec5f606b68f385615fedf7846#4
equivalent class: http://lodlaundromat.org/.well-known/genid/samples/jena///predicate//d015487fc59044ca316d6c6344e7afa6/69c3b512152bcf0ad31f557dc516a970#5
equivalent class: http://lodlaundromat.org/.well-known/genid/samples/jena///predicate//d015487fc59044ca316d6c6344e7afa6/010554247447337669685a3ec311d6ea#7
equivalent class: http://lodlaundromat.org/.well-known/genid/samples/jena///predicate//d015487fc59044ca316d6c6344e7afa6/c60ad03589cdf703d8c0bb969239bbfb#3
comment: A citation act is a performative act of making a citation from a citing entity to a cited entity, typically instantiated by the inclusion of a bibliographic reference or a data reference in the reference list of the citing entity. This CiTO class and its accompanying object properties cito:hasCitingEntity, cito:hasCitationCharacterization and cito:hasCitedEntity can be employed to reify direct citation act statements made using the CiTO citation object property cito:cites or one of its sub-properties. For example, the following RDF statement: :paperA cito:extends :paperB can be alternatively described as follows: :thisCitation a cito:CitationAct ; cito:hasCitingEntity :paperA ; cito:hasCitationCharacterization cito:extends ; cito:hasCitedEntity :paperB This usage involved OWL2 punning, whenby a CiTO object property, such as the aforementioned cito:extends, is used as the object of the OWL assertion :thisCitation cito:hasCitationCharacterization cito:extends Using such OWL2 punning (described at http://www.w3.org/TR/2009/WD-owl2-new-features-20090611/#F12:_Punning), the CiTO object property is considered as a proper named individual of the class owl:Thing. Such reification of citation acts can be very useful, since it permits one to combine these CiTO properties with other vocabularies, or to handle situations in which none of the citation characterizations available in CiTO are applicable. Such situations can be resolved by the creation of a user-defined citation characterization, for example by using the Open Annotation Data Model, as explained at http://semanticpublishing.wordpress.com/2013/07/03/extending-cito-for-open-annotations/.
equivalent class: http://lodlaundromat.org/.well-known/genid/samples/jena///predicate//d015487fc59044ca316d6c6344e7afa6/7b2fc0fec5f606b68f385615fedf7846#4
subclass of: http://lodlaundromat.org/.well-known/genid/samples/jena///predicate//d015487fc59044ca316d6c6344e7afa6/010554247447337669685a3ec311d6ea#3
subclass of: http://lodlaundromat.org/.well-known/genid/samples/jena///predicate//d015487fc59044ca316d6c6344e7afa6/7b2fc0fec5f606b68f385615fedf7846#2
subclass of: http://lodlaundromat.org/.well-known/genid/samples/jena///predicate//d015487fc59044ca316d6c6344e7afa6/69c3b512152bcf0ad31f557dc516a970#4
subclass of: http://lodlaundromat.org/.well-known/genid/samples/jena///predicate//d015487fc59044ca316d6c6344e7afa6/010554247447337669685a3ec311d6ea#1
subclass of: http://lodlaundromat.org/.well-known/genid/samples/jena///predicate//d015487fc59044ca316d6c6344e7afa6/c60ad03589cdf703d8c0bb969239bbfb#1
subclass of: Situation
subclass of: http://lodlaundromat.org/.well-known/genid/samples/jena///predicate//d015487fc59044ca316d6c6344e7afa6/c60ad03589cdf703d8c0bb969239bbfb#5
subclass of: http://lodlaundromat.org/.well-known/genid/samples/jena///predicate//d015487fc59044ca316d6c6344e7afa6/69c3b512152bcf0ad31f557dc516a970#3
subclass of: http://lodlaundromat.org/.well-known/genid/samples/jena///predicate//d015487fc59044ca316d6c6344e7afa6/010554247447337669685a3ec311d6ea#4
subclass of: http://lodlaundromat.org/.well-known/genid/samples/jena///predicate//d015487fc59044ca316d6c6344e7afa6/7b2fc0fec5f606b68f385615fedf7846#3
subclass of: http://lodlaundromat.org/.well-known/genid/samples/jena///predicate//d015487fc59044ca316d6c6344e7afa6/c60ad03589cdf703d8c0bb969239bbfb#2
subclass of: http://lodlaundromat.org/.well-known/genid/samples/jena///predicate//d015487fc59044ca316d6c6344e7afa6/7b2fc0fec5f606b68f385615fedf7846#1
subclass of: http://lodlaundromat.org/.well-known/genid/samples/jena///predicate//d015487fc59044ca316d6c6344e7afa6/69c3b512152bcf0ad31f557dc516a970#2

cites
range: Thing
domain: Thing
inverse of: is cited by
type: ObjectProperty
comment: The citing entity cites the cited entity, either directly and explicitly (as in the reference list of a journal article), indirectly (e.g. by citing a more recent paper by the same group on the same topic), or implicitly (e.g. as in artistic quotations or parodies, or in cases of plagiarism).
sub property of: refersTo
type: Property
range: Resource
domain: Resource

has citing entity
range: Thing
domain: Thing
type: ObjectProperty
sub property of: isSettingFor
comment: The citation act relates to the entity containing that citation.
type: Property
range: Resource
domain: Resource

is supported by
range: Thing
domain: Thing
type: ObjectProperty
inverse of: supports
sub property of: is cited by
comment: The cited entity receives intellectual or factual support from the citing entity.
type: Property
range: Resource
domain: Resource

provides data for
range: Thing
domain: Thing
sub property of: is cited by
comment: The cited entity presents data that are used in work described in the citing entity.
inverse of: uses data from
type: ObjectProperty
type: Property
range: Resource
domain: Resource

agrees with
inverse of: is agreed with by
sub property of: refersTo
range: Thing
domain: Thing
description: Example: We share Galileo's opinion: the Earth moves [X].
type: ObjectProperty
sub property of: cites
comment: The citing entity agrees with statements, ideas or conclusions presented in the cited entity.
type: Property
range: Resource
domain: Resource

is in semantic relation with
range: Thing
domain: Thing
definition: Links a concept to a concept related by meaning.
scope note: This property should not be used directly, but as a super-property for all properties denoting a relationship of meaning between concepts.
type: ObjectProperty
domain: Concept
range: Concept
type: Property
note: This property should not be used directly, but as a super-property for all properties denoting a relationship of meaning between concepts.
note: Links a concept to a concept related by meaning.
range: Resource
range: http://lodlaundromat.org/.well-known/genid/samples/jena///predicate//d015487fc59044ca316d6c6344e7afa6/d8234c3b1439a879aea940e9009663be#1
domain: Resource
domain: http://lodlaundromat.org/.well-known/genid/samples/jena///predicate//d015487fc59044ca316d6c6344e7afa6/d8234c3b1439a879aea940e9009663be#1

has member list
range: Thing
domain: Thing
definition: Relates an ordered collection to the RDF list containing its members.
type: ObjectProperty
domain: Ordered Collection
type: FunctionalProperty
range: List
comment: For any resource, every item in the list given as the value of the skos:memberList property is also a value of the skos:member property.
type: Property
note: Relates an ordered collection to the RDF list containing its members.
range: Resource
domain: Collection
domain: http://lodlaundromat.org/.well-known/genid/samples/jena///predicate//d015487fc59044ca316d6c6344e7afa6/d8234c3b1439a879aea940e9009663be#1
domain: Resource

current project
domain: Thing
type: Property
type: ObjectProperty
comment: A current project this person works on.
domain: Person
range: Thing
term status: testing
range: Resource
domain: Agent
domain: Resource
domain: SpatialThing

Method of Accrual
subclass of: Resource
Has Version: MethodOfAccrual-001
issued: 2008-01-14
type: Class
comment: A method by which resources are added to a collection.
Relation: MethodOfAccrual-001
relation: MethodOfAccrual-001
date: 2008-01-14

has exact match
sub property of: is in semantic relation with
range: Thing
domain: Thing
sub property of: is in mapping relation with
definition: skos:exactMatch is used to link two concepts, indicating a high degree of confidence that the concepts can be used interchangeably across a wide range of information retrieval applications. skos:exactMatch is a transitive property, and is a sub-property of skos:closeMatch.
type: ObjectProperty
sub property of: has close match
type: SymmetricProperty
type: TransitiveProperty
comment: skos:exactMatch is disjoint with each of the properties skos:broadMatch and skos:relatedMatch.
type: Property
note: skos:exactMatch is used to link two concepts, indicating a high degree of confidence that the concepts can be used interchangeably across a wide range of information retrieval applications. skos:exactMatch is a transitive property, and is a sub-property of skos:closeMatch.
range: Concept
range: Resource
range: http://lodlaundromat.org/.well-known/genid/samples/jena///predicate//d015487fc59044ca316d6c6344e7afa6/d8234c3b1439a879aea940e9009663be#1
domain: Concept
domain: Resource
domain: http://lodlaundromat.org/.well-known/genid/samples/jena///predicate//d015487fc59044ca316d6c6344e7afa6/d8234c3b1439a879aea940e9009663be#1

replies to
sub property of: refersTo
range: Thing
domain: Thing
comment: The citing entity replies to statements, ideas or criticisms presented in the cited entity.
description: Example: We will not investigate the issues of the approach proposed in [X] here, but rather we introduce yet another alternative.
sub property of: cites
inverse of: has reply
type: ObjectProperty
type: Property
range: Resource
domain: Resource

is derided by
range: Thing
domain: Thing
comment: The cited entity contains ideas or conclusions for which the citing entity express derision.
type: ObjectProperty
inverse of: derides
sub property of: is cited by
type: Property
range: Resource
domain: Resource

supports
sub property of: refersTo
inverse of: is supported by
range: Thing
domain: Thing
type: ObjectProperty
description: Example: We support Galileo's statement [X], that Earth moves.
sub property of: cites
comment: The citing entity provides intellectual or factual support for statements, ideas or conclusions presented in the cited entity.
type: Property
range: Resource
domain: Resource

is discussed by
range: Thing
domain: Thing
type: ObjectProperty
inverse of: discusses
comment: The cited entity presents statements, ideas or conclusions that are discussed by the citing entity.
sub property of: is cited by
type: Property
range: Resource
domain: Resource

is documented by
range: Thing
domain: Thing
type: ObjectProperty
inverse of: documents
comment: Information about the cited entity is documented by the citing entity.
sub property of: is cited by
type: Property
range: Resource
domain: Resource

obtains support from
sub property of: refersTo
range: Thing
domain: Thing
inverse of: gives support to
type: ObjectProperty
sub property of: cites
comment: The citing entity obtains intellectual or factual support from the cited entity.
description: Example: Our ideas were also shared by Doe et al. [X].
type: Property
range: Resource
domain: Resource

is described by
range: Thing
domain: Thing
inverse of: describes
sub property of: is cited by
type: ObjectProperty
comment: The cited entity is described by the citing entity.
type: Property
range: Resource
domain: Resource

has narrower
sub property of: is in semantic relation with
range: Thing
domain: Thing
definition: Relates a concept to a concept that is more specific in meaning.
scope note: By convention, skos:broader is only used to assert an immediate (i.e. direct) hierarchical link between two conceptual resources.
comment: Narrower concepts are typically rendered as children in a concept hierarchy (tree).
type: ObjectProperty
sub property of: has narrower transitive
inverse of: has broader
type: Property
note: By convention, skos:broader is only used to assert an immediate (i.e. direct) hierarchical link between two conceptual resources.
note: Relates a concept to a concept that is more specific in meaning.
range: Concept
range: Resource
range: http://lodlaundromat.org/.well-known/genid/samples/jena///predicate//d015487fc59044ca316d6c6344e7afa6/d8234c3b1439a879aea940e9009663be#1
domain: Concept
domain: Resource
domain: http://lodlaundromat.org/.well-known/genid/samples/jena///predicate//d015487fc59044ca316d6c6344e7afa6/d8234c3b1439a879aea940e9009663be#1

http://lodlaundromat.org/.well-known/genid/samples/jena///predicate//d015487fc59044ca316d6c6344e7afa6/69c3b512152bcf0ad31f557dc516a970#3
subclass of: Resource
type: Class
subclass of: Thing
on property: has cited entity
type: Restriction
cardinality: 1
subclass of: http://lodlaundromat.org/.well-known/genid/samples/jena///predicate//d015487fc59044ca316d6c6344e7afa6/7b2fc0fec5f606b68f385615fedf7846#3
subclass of: http://lodlaundromat.org/.well-known/genid/samples/jena///predicate//d015487fc59044ca316d6c6344e7afa6/010554247447337669685a3ec311d6ea#4
subclass of: http://lodlaundromat.org/.well-known/genid/samples/jena///predicate//d015487fc59044ca316d6c6344e7afa6/c60ad03589cdf703d8c0bb969239bbfb#5
equivalent class: http://lodlaundromat.org/.well-known/genid/samples/jena///predicate//d015487fc59044ca316d6c6344e7afa6/c60ad03589cdf703d8c0bb969239bbfb#5
equivalent class: http://lodlaundromat.org/.well-known/genid/samples/jena///predicate//d015487fc59044ca316d6c6344e7afa6/010554247447337669685a3ec311d6ea#4
equivalent class: http://lodlaundromat.org/.well-known/genid/samples/jena///predicate//d015487fc59044ca316d6c6344e7afa6/7b2fc0fec5f606b68f385615fedf7846#3

is non-tangential proper part of
sub property of: connects with
sub property of: overlaps
sub property of: is part of
range: Thing
domain: Thing
inverse of: non tangentially properly contains
type: ObjectProperty
type: TransitiveProperty
comment: Relation NTPP(x,y), read as 'x is a non-tangential proper part of y'. This relation holds, whenever a region x is labeled as a proper part of a region y, and they do not share common point in their borders.
domain: Feature
range: Feature
sub property of: is proper part of
term status: testing
type: Property
range: Resource
domain: Resource

schoolHomepage
range: Thing
domain: Thing
type: Property
type: ObjectProperty
comment: A homepage of a school attended by the person.
domain: Person
range: Document
term status: testing
range: Resource
domain: Agent
domain: Resource
domain: SpatialThing

cites as related
inverse of: is cited as related by
sub property of: refersTo
range: Thing
domain: Thing
comment: The citing entity cites the cited entity as one that is related.
type: ObjectProperty
description: Example: An analysis similar to what we proposed here is presented in [X].
sub property of: cites
type: Property
range: Resource
domain: Resource

describes
sub property of: refersTo
range: Thing
domain: Thing
type: ObjectProperty
comment: The citing entity describes the cited entity.
sub property of: cites
inverse of: is described by
description: Example: Galileo's book [X] is a dialog among three scientists about Copernicus' eliocentric theory.
type: Property
range: Resource
domain: Resource

is tangential proper part of
sub property of: connects with
sub property of: overlaps
sub property of: is part of
range: Thing
domain: Thing
inverse of: tangentially properly contains
type: ObjectProperty
type: TransitiveProperty
comment: Relation TPP(x,y), read as 'x is a tangential proper part of y'. This relation holds, whenever a region x is labeled as a proper part of a region y, and they share at least one common point in their borders, which means that they are externally connected.
domain: Feature
range: Feature
sub property of: is proper part of
term status: testing
type: Property
range: Resource
domain: Resource

is speculated on by
range: Thing
domain: Thing
inverse of: speculates on
sub property of: is cited by
comment: The cited entity is cited because the citing article contains speculations on its content or ideas.
type: ObjectProperty
type: Property
range: Resource
domain: Resource

point
subclass of: Resource
type: Class
subclass of: SpatialThing
comment: A point, typically described using a coordinate system relative to Earth, such as WGS84.
comment: Uniquely identified by lat/long/alt. i.e. spaciallyIntersects(P1, P2) :- lat(P1, LAT), long(P1, LONG), alt(P1, ALT), lat(P2, LAT), long(P2, LONG), alt(P2, ALT). sameThing(P1, P2) :- type(P1, Point), type(P2, Point), spaciallyIntersects(P1, P2).

Organization
subclass of: Resource
subclass of: Thing
subclass of: Agent
type: Class
comment: An organization.
disjoint with: Person
disjoint with: Document
term status: stable

Policy
subclass of: Resource
Has Version: Policy-001
issued: 2008-01-14
type: Class
comment: A plan or course of action by an authority, intended to influence and determine decisions, actions, and other matters.
Relation: Policy-001
relation: Policy-001
date: 2008-01-14

non tangentially properly contains
sub property of: overlaps
sub property of: connects with
sub property of: contains
range: Thing
domain: Thing
type: ObjectProperty
type: TransitiveProperty
comment: Relation NTPPi(x,y), read as 'x non-tangentially properly contains y'. Inverse of the NTPP(x,y) relation.
domain: Feature
range: Feature
sub property of: properly contains
inverse of: is non-tangential proper part of
term status: testing
type: Property
range: Resource
domain: Resource

inconsistent with
range: Thing
domain: Thing
type: ObjectProperty
type: SymmetricProperty
comment: Although this relation is not a part of the RCC theory, it has been introduced in order to detect relations between regions which are inconsistent with the RCC axioms.
term status: unstable
type: Property
range: Resource
domain: Resource

is retracted by
range: Thing
domain: Thing
comment: The cited entity is formally retracted by the citing entity.
sub property of: is cited by
inverse of: retracts
type: ObjectProperty
type: Property
range: Resource
domain: Resource

refutes
inverse of: is refuted by
sub property of: refersTo
range: Thing
domain: Thing
description: Example: We do not think that all their arguments in favour of their own and against the other strategies are equally convincing [X].
comment: The citing entity refutes statements, ideas or conclusions presented in the cited entity.
sub property of: cites
type: ObjectProperty
type: Property
range: Resource
domain: Resource

Method of Instruction
subclass of: Resource
Has Version: MethodOfInstruction-001
issued: 2008-01-14
type: Class
comment: A process that is used to engender knowledge, attitudes, and skills.
Relation: MethodOfInstruction-001
relation: MethodOfInstruction-001
date: 2008-01-14

focus
domain: Thing
type: Property
type: ObjectProperty
comment: The underlying or 'focal' entity associated with some SKOS-described concept.
domain: Concept
range: Thing
term status: testing
range: Resource
domain: Resource
domain: http://lodlaundromat.org/.well-known/genid/samples/jena///predicate//d015487fc59044ca316d6c6344e7afa6/d8234c3b1439a879aea940e9009663be#1

Size or Duration
subclass of: Resource
description: Examples include a number of pages, a specification of length, width, and breadth, or a period in hours, minutes, and seconds.
Has Version: SizeOrDuration-001
issued: 2008-01-14
type: Class
comment: A dimension or extent, or a time taken to play or execute.
subclass of: Media Type or Extent
Relation: SizeOrDuration-001
relation: SizeOrDuration-001
date: 2008-01-14

topic_interest
domain: Thing
type: Property
type: ObjectProperty
comment: A thing of interest to this person.
domain: Agent
range: Thing
term status: testing
range: Resource
domain: Resource

gives background to
range: Thing
domain: Thing
type: ObjectProperty
sub property of: is cited by
comment: The cited entity provides background information for the citing entity.
inverse of: obtains background from
type: Property
range: Resource
domain: Resource

made
domain: Thing
type: Property
type: ObjectProperty
comment: Something that was made by this agent.
domain: Agent
range: Thing
inverse of: maker
term status: stable
range: Resource
domain: Resource

confirms
inverse of: is confirmed by
sub property of: refersTo
range: Thing
domain: Thing
comment: The citing entity confirms facts, ideas or statements presented in the cited entity.
type: ObjectProperty
description: Example: Our findings are similar to those published in [X].
sub property of: cites
type: Property
range: Resource
domain: Resource

is cited as data source by
range: Thing
domain: Thing
comment: The cited entity is cited as a data source by the citing entity.
sub property of: is cited by
inverse of: cites as data source
type: ObjectProperty
type: Property
range: Resource
domain: Resource

past project
domain: Thing
type: Property
type: ObjectProperty
comment: A project this person has previously worked on.
domain: Person
range: Thing
term status: testing
range: Resource
domain: Agent
domain: Resource
domain: SpatialThing

citation
sub property of: refersTo
range: Thing
domain: Thing
type: ObjectProperty
sub property of: cites
comment: This property is defined in schema.org and has been added for aligning it with CiTO. In particular, schema:citation expresses similar semantics of cito:cites except for the explicit definition of domain and range classes, that are schema:CreativeWork according to schema.org - that's why here has been defined as subclass of cito:cites.
type: Property
range: Resource
domain: Resource

externally connected with
range: Thing
domain: Thing
type: ObjectProperty
type: SymmetricProperty
comment: Relation EC(x,y), read as 'x is externally connected with y'. This relation holds, when the two regions share at least one common point of their borders, but share no points of their interiors, i.e. they do not overlap.
domain: Feature
range: Feature
sub property of: connects with
sub property of: discrete from
term status: testing
type: Property
range: Resource
domain: Resource

is corrected by
range: Thing
domain: Thing
inverse of: corrects
sub property of: is cited by
type: ObjectProperty
comment: The cited entity presents statements, ideas or conclusions that are corrected by the citing entity.
type: Property
range: Resource
domain: Resource

has close match
sub property of: is in semantic relation with
range: Thing
domain: Thing
definition: skos:closeMatch is used to link two concepts that are sufficiently similar that they can be used interchangeably in some information retrieval applications. In order to avoid the possibility of "compound errors" when combining mappings across more than two concept schemes, skos:closeMatch is not declared to be a transitive property.
type: ObjectProperty
sub property of: is in mapping relation with
type: SymmetricProperty
type: Property
note: skos:closeMatch is used to link two concepts that are sufficiently similar that they can be used interchangeably in some information retrieval applications. In order to avoid the possibility of "compound errors" when combining mappings across more than two concept schemes, skos:closeMatch is not declared to be a transitive property.
range: Concept
range: Resource
range: http://lodlaundromat.org/.well-known/genid/samples/jena///predicate//d015487fc59044ca316d6c6344e7afa6/d8234c3b1439a879aea940e9009663be#1
domain: Concept
domain: Resource
domain: http://lodlaundromat.org/.well-known/genid/samples/jena///predicate//d015487fc59044ca316d6c6344e7afa6/d8234c3b1439a879aea940e9009663be#1

based near
range: Thing
domain: Thing
type: Property
type: ObjectProperty
comment: A location that something is based near, for some broadly human notion of near.
domain: SpatialThing
range: SpatialThing
term status: testing
range: Resource
domain: Resource

primary topic
domain: Thing
domain: Document
type: FunctionalProperty
range: Thing
type: Property
term status: stable
type: ObjectProperty
comment: The primary topic of some page or document.
inverse of: is primary topic of
range: Resource
domain: Resource

Period of Time
subclass of: Resource
Has Version: PeriodOfTime-001
issued: 2008-01-14
type: Class
comment: An interval of time that is named or defined by its start and end dates.
subclass of: Location, Period, or Jurisdiction
Relation: PeriodOfTime-001
relation: PeriodOfTime-001
date: 2008-01-14

is primary topic of
range: Thing
comment: A document that this thing is the primary topic of.
domain: Thing
sub property of: page
type: InverseFunctionalProperty
range: Document
type: Property
term status: stable
inverse of: primary topic
type: ObjectProperty
range: Resource
domain: Resource

cites as potential solution
inverse of: is cited as potential solution by
sub property of: refersTo
range: Thing
domain: Thing
comment: The citing entity cites the cited entity as providing or containing a possible solution to the issues being discussed.
description: Example: This risk could be avoided using the approach shown in [X].
type: ObjectProperty
sub property of: cites
type: Property
range: Resource
domain: Resource

uses data from
sub property of: refersTo
inverse of: provides data for
range: Thing
domain: Thing
type: ObjectProperty
description: Example: Using the information collected from our recent study [X], we can estimate that there are tens of millions of HTML forms with potentially useful deep-web content.
sub property of: cites
comment: The citing entity describes work that uses data presented in the cited entity.
type: Property
range: Resource
domain: Resource

is ridiculed by
range: Thing
domain: Thing
sub property of: is cited by
comment: The cited entity or aspects of its contents are ridiculed by the citing entity.
type: ObjectProperty
inverse of: ridicules
type: Property
range: Resource
domain: Resource

Rights Statement
subclass of: Resource
Has Version: RightsStatement-001
issued: 2008-01-14
type: Class
comment: A statement about the intellectual property rights (IPR) held in or over a Resource, a legal document giving official permission to do something with a resource, or a statement about access rights.
Relation: RightsStatement-001
relation: RightsStatement-001
date: 2008-01-14

is compiled by
range: Thing
domain: Thing
sub property of: is cited by
comment: The cited entity is the result of a compile or creation event using the citing entity.
type: ObjectProperty
description: Note: This property has been imported from the CiTO4Data ontology, usage of which has been deprecated.
inverse of: compiles
type: Property
range: Resource
domain: Resource

is updated by
range: Thing
domain: Thing
type: ObjectProperty
sub property of: is cited by
comment: The cited entity presents statements, ideas, hypotheses or understanding that are updated by the cited entity.
inverse of: updates
type: Property
range: Resource
domain: Resource

image
range: Thing
domain: Thing
type: Property
type: ObjectProperty
comment: An image that can be used to represent some thing (ie. those depictions which are particularly representative of something, eg. one's photo on a homepage).
domain: Person
range: Image
sub property of: depiction
term status: testing
range: Resource
range: Document
domain: Resource
domain: Agent
domain: SpatialThing

Project
subclass of: Resource
subclass of: Thing
type: Class
comment: A project (a collective endeavour of some kind).
disjoint with: Person
disjoint with: Document
term status: testing

gives support to
range: Thing
domain: Thing
type: ObjectProperty
inverse of: obtains support from
sub property of: is cited by
comment: The cited entity provides intellectual or factual support for the citing entity.
type: Property
range: Resource
domain: Resource

updates
sub property of: refersTo
inverse of: is updated by
range: Thing
domain: Thing
comment: The citing entity updates statements, ideas, hypotheses or understanding presented in the cited entity.
description: Example: Earth moves, said Galileo [X]; in addition, we can say now it moves very fast.
type: ObjectProperty
sub property of: cites
type: Property
range: Resource
domain: Resource

Location
subclass of: Resource
Has Version: Location-001
issued: 2008-01-14
type: Class
comment: A spatial region or named place.
subclass of: Location, Period, or Jurisdiction
Relation: Location-001
relation: Location-001
date: 2008-01-14

discrete from
range: Thing
domain: Thing
type: ObjectProperty
type: SymmetricProperty
comment: Relation DR(x,y), read as 'x is discrete from y'. In order to prevent an exponential growth of triples when handling large amounts of data, a closed world assumption may also be possible. More precisely, by considering not explicitely connected regions as discrete regions. Moreover, discrete regions, which are not explicitely labeled as externally connected, would be considered disconnected from eachother.
domain: Feature
range: Feature
term status: testing
type: Property
range: Resource
domain: Resource

Online Gaming Account
subclass of: Resource
subclass of: Thing
type: Class
comment: An online gaming account.
subclass of: Online Account
term status: unstable

Document
subclass of: Resource
subclass of: Thing
type: Class
comment: A document.
disjoint with: Organization
disjoint with: Project
term status: testing

tangentially properly contains
sub property of: overlaps
sub property of: connects with
sub property of: contains
range: Thing
domain: Thing
type: ObjectProperty
type: TransitiveProperty
comment: Relation TPPi(x,y), read as 'x tangentially properly contains y'. Inverse of the TPP(x,y) relation.
domain: Feature
range: Feature
sub property of: properly contains
inverse of: is tangential proper part of
term status: testing
type: Property
range: Resource
domain: Resource

extends
inverse of: is extended by
sub property of: refersTo
range: Thing
domain: Thing
type: ObjectProperty
description: Example: We add to Galileo's findings concerning the Earth [X] that also the Moon moves.
comment: The citing entity extends facts, ideas or understandings presented in the cited entity.
sub property of: cites
type: Property
range: Resource
domain: Resource

http://lodlaundromat.org/.well-known/genid/samples/jena///predicate//d015487fc59044ca316d6c6344e7afa6/69c3b512152bcf0ad31f557dc516a970#4
subclass of: Resource
type: Class
subclass of: Thing
type: Restriction
cardinality: 1
on property: has citation characterization
subclass of: http://lodlaundromat.org/.well-known/genid/samples/jena///predicate//d015487fc59044ca316d6c6344e7afa6/010554247447337669685a3ec311d6ea#1
subclass of: http://lodlaundromat.org/.well-known/genid/samples/jena///predicate//d015487fc59044ca316d6c6344e7afa6/7b2fc0fec5f606b68f385615fedf7846#2
subclass of: http://lodlaundromat.org/.well-known/genid/samples/jena///predicate//d015487fc59044ca316d6c6344e7afa6/c60ad03589cdf703d8c0bb969239bbfb#1
equivalent class: http://lodlaundromat.org/.well-known/genid/samples/jena///predicate//d015487fc59044ca316d6c6344e7afa6/c60ad03589cdf703d8c0bb969239bbfb#1
equivalent class: http://lodlaundromat.org/.well-known/genid/samples/jena///predicate//d015487fc59044ca316d6c6344e7afa6/7b2fc0fec5f606b68f385615fedf7846#2
equivalent class: http://lodlaundromat.org/.well-known/genid/samples/jena///predicate//d015487fc59044ca316d6c6344e7afa6/010554247447337669685a3ec311d6ea#1

cites as evidence
sub property of: refersTo
range: Thing
domain: Thing
inverse of: is cited as evidence by
type: ObjectProperty
comment: The citing entity cites the cited entity as source of factual evidence for statements it contains.
sub property of: cites
description: Example: We found an unquestionable demonstration of our hypothesis in [X].
type: Property
range: Resource
domain: Resource

tipjar
range: Thing
domain: Thing
type: Property
type: ObjectProperty
comment: A tipjar document for this agent, describing means for payment and reward.
domain: Agent
range: Document
sub property of: page
term status: testing
range: Resource
domain: Resource

is cited as evidence by
range: Thing
domain: Thing
comment: The cited entity is cited for providing factual evidence to the citing entity.
sub property of: is cited by
inverse of: cites as evidence
type: ObjectProperty
type: Property
range: Resource
domain: Resource

publications
range: Thing
domain: Thing
type: Property
type: ObjectProperty
comment: A link to the publications of this person.
domain: Person
range: Document
term status: testing
range: Resource
domain: Agent
domain: Resource
domain: SpatialThing

is disputed by
range: Thing
domain: Thing
type: ObjectProperty
comment: The cited entity presents statements, ideas or conclusions that are disputed by the citing entity.
sub property of: is cited by
inverse of: disputes
type: Property
range: Resource
domain: Resource

cites as recommended reading
inverse of: is cited as recommended reading
sub property of: refersTo
range: Thing
domain: Thing
comment: The citing entity cites the cited entity as an item of recommended reading. This property can be used, for example, to describe references in a lecture reading list, where the cited references are relevant to the general topic of the lecture, but might not be individually cited within the text of the lecture. Similarly, it could be used to describe items in a 'Suggested further reading' list at the end of a book chapter.
type: ObjectProperty
sub property of: cites
description: Example: To our knowledge, [X] is the best source of exercises about UML, making it a valuable proposal for beginners.
type: Property
range: Resource
domain: Resource

Ordered Collection
subclass of: Resource
type: Class
subclass of: Thing
definition: An ordered collection of concepts, where both the grouping and the ordering are meaningful.
scope note: Ordered collections can be used where you would like a set of concepts to be displayed in a specific order, and optionally under a 'node label'.
subclass of: Collection
note: Ordered collections can be used where you would like a set of concepts to be displayed in a specific order, and optionally under a 'node label'.
note: An ordered collection of concepts, where both the grouping and the ordering are meaningful.
subclass of: http://lodlaundromat.org/.well-known/genid/samples/jena///predicate//d015487fc59044ca316d6c6344e7afa6/d8234c3b1439a879aea940e9009663be#1

depiction
range: Thing
type: Property
type: ObjectProperty
comment: A depiction of some thing.
domain: Thing
range: Image
inverse of: depicts
term status: testing
range: Resource
range: Document
domain: Resource

http://lodlaundromat.org/.well-known/genid/samples/jena///predicate//d015487fc59044ca316d6c6344e7afa6/c60ad03589cdf703d8c0bb969239bbfb#5
type: Class
subclass of: Resource
subclass of: Thing
type: Restriction
on property: has cited entity
cardinality: 1
subclass of: http://lodlaundromat.org/.well-known/genid/samples/jena///predicate//d015487fc59044ca316d6c6344e7afa6/010554247447337669685a3ec311d6ea#4
subclass of: http://lodlaundromat.org/.well-known/genid/samples/jena///predicate//d015487fc59044ca316d6c6344e7afa6/7b2fc0fec5f606b68f385615fedf7846#3
subclass of: http://lodlaundromat.org/.well-known/genid/samples/jena///predicate//d015487fc59044ca316d6c6344e7afa6/69c3b512152bcf0ad31f557dc516a970#3
equivalent class: http://lodlaundromat.org/.well-known/genid/samples/jena///predicate//d015487fc59044ca316d6c6344e7afa6/69c3b512152bcf0ad31f557dc516a970#3
equivalent class: http://lodlaundromat.org/.well-known/genid/samples/jena///predicate//d015487fc59044ca316d6c6344e7afa6/7b2fc0fec5f606b68f385615fedf7846#3
equivalent class: http://lodlaundromat.org/.well-known/genid/samples/jena///predicate//d015487fc59044ca316d6c6344e7afa6/010554247447337669685a3ec311d6ea#4

includes quotation from
inverse of: provides quotation for
sub property of: refersTo
range: Thing
domain: Thing
sub property of: cites
description: A quotation is a repetition of what someone has said, and is presented "within quotation marks", for example: On June 4th 1940, Winston Churchill made a speech on the radio that has since become famous, that included the words: " we shall fight on the beaches, we shall fight on the landing grounds, we shall fight in the fields and in the streets, we shall fight in the hills; we shall never surrender"
comment: The citing entity includes one or more quotations from the cited entity.
description: Example: As Newton wrote in [X]: "We are like dwarfs standing on the shoulders of giants".
type: ObjectProperty
type: Property
range: Resource
domain: Resource

Agent
subclass of: Thing
subclass of: Resource
subclass of: Agent
type: Class
comment: An agent (eg. person, group, software or physical artifact).
equivalent class: Agent
term status: stable

is critiqued by
range: Thing
domain: Thing
comment: The cited entity presents statements, ideas or conclusions that are critiqued by the citing entity.
type: ObjectProperty
inverse of: critiques
sub property of: is cited by
type: Property
range: Resource
domain: Resource

obtains background from
sub property of: refersTo
inverse of: gives background to
range: Thing
domain: Thing
description: Example: There is a need for more observational studies and studies using narrative causation to describe the potential contribution of information in problem-solving and decision-making [X]; our work addresses these needs.
sub property of: cites
comment: The citing entity obtains background information from the cited entity.
type: ObjectProperty
type: Property
range: Resource
domain: Resource

Collection
subclass of: http://lodlaundromat.org/.well-known/genid/samples/jena///predicate//d015487fc59044ca316d6c6344e7afa6/d8234c3b1439a879aea940e9009663be#1
subclass of: Resource
type: Class
subclass of: Thing
definition: A meaningful collection of concepts.
scope note: Labelled collections can be used where you would like a set of concepts to be displayed under a 'node label' in the hierarchy.
disjoint with: Concept
disjoint with: Concept Scheme
note: Labelled collections can be used where you would like a set of concepts to be displayed under a 'node label' in the hierarchy.
note: A meaningful collection of concepts.

is cited as authority by
range: Thing
domain: Thing
comment: The cited entity is cited as providing an authoritative description or definition of the subject under discussion in the citing entity.
sub property of: is cited by
inverse of: cites as authority
type: ObjectProperty
type: Property
range: Resource
domain: Resource

connects with
range: Thing
domain: Thing
type: ObjectProperty
type: SymmetricProperty
comment: Relation C(x,y), read as 'x is connected with y'. This relation holds when two regions share a common point. It is the primitive relation in the RCC theory.
domain: Feature
range: Feature
term status: testing
type: Property
range: Resource
domain: Resource

Standard
subclass of: Resource
Has Version: Standard-001
issued: 2008-01-14
type: Class
comment: A basis for comparison; a reference point against which other things can be evaluated.
Relation: Standard-001
relation: Standard-001
date: 2008-01-14

is plagiarized by
range: Thing
domain: Thing
type: ObjectProperty
comment: The cited entity is plagiarized by the author of the citing entity, who includes within the citing entity textual or other elements from the cited entity without formal acknowledgement of their source. The cited entity is thus not explicitly cited from within the citing entity, according to the norms of scholarly practice, but is cited implicitly.
sub property of: is cited by
inverse of: plagiarizes
type: Property
range: Resource
domain: Resource

has reply
inverse of: replies to
range: Thing
domain: Thing
type: ObjectProperty
comment: The cited entity evokes a reply from the citing entity.
sub property of: is cited by
type: Property
range: Resource
domain: Resource

thumbnail
range: Thing
domain: Thing
type: Property
type: ObjectProperty
comment: A derived thumbnail image.
domain: Image
range: Image
term status: testing
range: Resource
range: Document
domain: Resource
domain: Document

definition
definition: A statement or formal explanation of the meaning of a concept.
type: AnnotationProperty
sub property of: note
type: Property
note: A statement or formal explanation of the meaning of a concept.

Date Created
sub property of: date
range: Literal
Date Modified: 2008-01-14
comment: Date of creation of the resource.
type: Property
Has Version: created-003
issued: 2000-07-11
sub property of: Date
Relation: created-003
relation: created-003
date: 2008-01-14
date: 2000-07-11
range: Resource

familyName
type: Property
type: DatatypeProperty
comment: The family name of some person.
domain: Person
range: Literal
term status: testing
range: Resource
domain: Agent
domain: Resource
domain: Thing
domain: SpatialThing

Skype ID
type: Property
type: DatatypeProperty
comment: A Skype ID
domain: Agent
range: Literal
sub property of: nickname
term status: testing
range: Resource
domain: Resource
domain: Thing

Accrual Method
Has Version: accrualMethod-003
issued: 2005-06-13
Date Modified: 2010-10-11
type: Property
comment: The method by which items are added to a collection.
domain: Collection
range: Method of Accrual
Relation: accrualMethod-003
relation: accrualMethod-003
date: 2010-10-11
date: 2005-06-13
range: Resource
domain: Resource

Accrual Periodicity
Has Version: accrualPeriodicity-003
issued: 2005-06-13
Date Modified: 2010-10-11
type: Property
comment: The frequency with which items are added to a collection.
domain: Collection
range: Frequency
Relation: accrualPeriodicity-003
relation: accrualPeriodicity-003
date: 2010-10-11
date: 2005-06-13
range: Resource
domain: Resource

Description
description: Description may include but is not limited to: an abstract, a table of contents, a graphical representation, or a free-text account of the resource.
Has Version: descriptionT-001
issued: 2008-01-14
Date Modified: 2008-01-14
type: Property
comment: An account of the resource.
sub property of: description
Relation: descriptionT-001
relation: descriptionT-001
date: 2008-01-14

UDC
Has Version: UDC-003
issued: 2000-07-11
Date Modified: 2008-01-14
type: VocabularyEncodingScheme
comment: The set of conceptual resources specified by the Universal Decimal Classification.
Relation: UDC-003
relation: UDC-003
date: 2008-01-14
date: 2000-07-11

Is Replaced By
type: Property
sub property of: relation
note: This term is intended to be used with non-literal values as defined in the DCMI Abstract Model (http://dublincore.org/documents/abstract-model/). As of December 2007, the DCMI Usage Board is seeking a way to express this intention with a formal range declaration.
Date Modified: 2008-01-14
issued: 2000-07-11
sub property of: Relation
Has Version: isReplacedBy-003
comment: A related resource that supplants, displaces, or supersedes the described resource.
Relation: isReplacedBy-003
relation: isReplacedBy-003
date: 2008-01-14
date: 2000-07-11

title
type: Property
type: DatatypeProperty
comment: Title (Mr, Mrs, Ms, Dr. etc)
term status: testing

Has Part
type: Property
Date Modified: 2008-01-14
issued: 2000-07-11
comment: A related resource that is included either physically or logically in the described resource.
note: This term is intended to be used with non-literal values as defined in the DCMI Abstract Model (http://dublincore.org/documents/abstract-model/). As of December 2007, the DCMI Usage Board is seeking a way to express this intention with a formal range declaration.
sub property of: relation
Has Version: hasPart-003
sub property of: Relation
Relation: hasPart-003
relation: hasPart-003
date: 2008-01-14
date: 2000-07-11

funded by
type: Property
type: ObjectProperty
comment: An organization funding a project or person.
domain: Thing
range: Thing
term status: archaic
range: Resource
domain: Resource

lastName
type: Property
type: DatatypeProperty
comment: The last name of a person.
domain: Person
range: Literal
term status: testing
range: Resource
domain: Agent
domain: Resource
domain: Thing
domain: SpatialThing

Relation
note: This term is intended to be used with non-literal values as defined in the DCMI Abstract Model (http://dublincore.org/documents/abstract-model/). As of December 2007, the DCMI Usage Board is seeking a way to express this intention with a formal range declaration.
comment: A related resource.
description: Recommended best practice is to identify the related resource by means of a string conforming to a formal identification system.
Has Version: relationT-001
type: Property
sub property of: relation
issued: 2008-01-14
Date Modified: 2008-01-14
Relation: relationT-001
relation: relationT-001
date: 2008-01-14

Is Part Of
issued: 2000-07-11
type: Property
sub property of: relation
sub property of: Relation
Date Modified: 2008-01-14
note: This term is intended to be used with non-literal values as defined in the DCMI Abstract Model (http://dublincore.org/documents/abstract-model/). As of December 2007, the DCMI Usage Board is seeking a way to express this intention with a formal range declaration.
Has Version: isPartOf-003
comment: A related resource in which the described resource is physically or logically included.
Relation: isPartOf-003
relation: isPartOf-003
date: 2008-01-14
date: 2000-07-11

Surname
type: Property
type: DatatypeProperty
comment: The surname of some person.
domain: Person
range: Literal
term status: archaic
range: Resource
domain: Agent
domain: Resource
domain: Thing
domain: SpatialThing

Table Of Contents
Has Version: tableOfContents-003
issued: 2000-07-11
Date Modified: 2008-01-14
type: Property
comment: A list of subunits of the resource.
sub property of: description
sub property of: Description
Relation: tableOfContents-003
relation: tableOfContents-003
date: 2008-01-14
date: 2000-07-11

RFC 5646
description: RFC 5646 obsoletes RFC 4646.
Has Version: RFC5646-001
issued: 2010-10-11
type: Datatype
comment: The set of tags constructed according to RFC 5646 for the identification of languages.
Relation: RFC5646-001
relation: RFC5646-001
date: 2010-10-11
type: Class

Date Copyrighted
range: Literal
type: Property
sub property of: Date
comment: Date of copyright.
sub property of: date
issued: 2002-07-13
Date Modified: 2008-01-14
Has Version: dateCopyrighted-002
Relation: dateCopyrighted-002
relation: dateCopyrighted-002
date: 2008-01-14
date: 2002-07-13
range: Resource

Coverage
issued: 2008-01-14
comment: The spatial or temporal topic of the resource, the spatial applicability of the resource, or the jurisdiction under which the resource is relevant.
Has Version: coverageT-001
Date Modified: 2008-01-14
sub property of: coverage
type: Property
range: Location, Period, or Jurisdiction
description: Spatial topic and spatial applicability may be a named place or a location specified by its geographic coordinates. Temporal topic may be a named period, date, or date range. A jurisdiction may be a named administrative entity or a geographic place to which the resource applies. Recommended best practice is to use a controlled vocabulary such as the Thesaurus of Geographic Names [TGN]. Where appropriate, named places or time periods can be used in preference to numeric identifiers such as sets of coordinates or date ranges.
Relation: coverageT-001
relation: coverageT-001
date: 2008-01-14
range: Resource

NLM
Has Version: NLM-002
issued: 2005-06-13
Date Modified: 2008-01-14
type: VocabularyEncodingScheme
comment: The set of conceptual resources specified by the National Library of Medicine Classification.
Relation: NLM-002
relation: NLM-002
date: 2008-01-14
date: 2005-06-13

Accrual Policy
Has Version: accrualPolicy-003
issued: 2005-06-13
Date Modified: 2010-10-11
type: Property
comment: The policy governing the addition of items to a collection.
domain: Collection
range: Policy
Relation: accrualPolicy-003
relation: accrualPolicy-003
date: 2010-10-11
date: 2005-06-13
range: Resource
domain: Resource

DNA checksum
type: Property
type: DatatypeProperty
comment: A checksum for the DNA of some thing. Joke.
range: Literal
term status: archaic
range: Resource

membershipClass
type: Property
type: AnnotationProperty
comment: Indicates the class of individuals that are a member of a Group
term status: unstable

Provenance
description: The statement may include a description of any changes successive custodians made to the resource.
Has Version: provenance-002
issued: 2004-09-20
Date Modified: 2008-01-14
type: Property
comment: A statement of any changes in ownership and custody of the resource since its creation that are significant for its authenticity, integrity, and interpretation.
range: Provenance Statement
Relation: provenance-002
relation: provenance-002
date: 2008-01-14
date: 2004-09-20
range: Resource

plan
type: Property
type: DatatypeProperty
comment: Aplan comment, in the tradition of finger and '.plan' files.
domain: Person
range: Literal
term status: testing
range: Resource
domain: Agent
domain: Resource
domain: Thing
domain: SpatialThing

sha1sum (hex)
type: Property
type: DatatypeProperty
comment: A sha1sum hash, in hex.
domain: Document
term status: unstable
domain: Resource
domain: Thing

Given name
type: Property
type: DatatypeProperty
comment: The given name of some person.
term status: archaic

LCC
Has Version: LCC-003
issued: 2000-07-11
Date Modified: 2008-01-14
type: VocabularyEncodingScheme
comment: The set of conceptual resources specified by the Library of Congress Classification.
Relation: LCC-003
relation: LCC-003
date: 2008-01-14
date: 2000-07-11

Title
Has Version: titleT-002
issued: 2008-01-14
Date Modified: 2010-10-11
type: Property
comment: A name given to the resource.
range: Literal
sub property of: title
Relation: titleT-002
relation: titleT-002
date: 2010-10-11
date: 2008-01-14
range: Resource

IMT
Has Version: IMT-004
issued: 2000-07-11
Date Modified: 2008-01-14
type: VocabularyEncodingScheme
comment: The set of media types specified by the Internet Assigned Numbers Authority.
Relation: IMT-004
relation: IMT-004
date: 2008-01-14
date: 2000-07-11

Medium
range: Physical Medium
comment: The material or physical carrier of the resource.
domain: Physical Resource
issued: 2000-07-11
type: Property
Has Version: medium-003
sub property of: Format
Date Modified: 2008-01-14
sub property of: format
Relation: medium-003
relation: medium-003
date: 2008-01-14
date: 2000-07-11
range: Media Type or Extent
range: Resource
range: Media Type
domain: Resource

Date Available
comment: Date (often a range) that the resource became or will become available.
issued: 2000-07-11
Has Version: available-003
sub property of: date
Date Modified: 2008-01-14
type: Property
sub property of: Date
range: Literal
Relation: available-003
relation: available-003
date: 2008-01-14
date: 2000-07-11
range: Resource

ICQ chat ID
sub property of: nickname
term status: testing
domain: Agent
range: Literal
comment: An ICQ chat ID
type: InverseFunctionalProperty
type: Property
type: DatatypeProperty
type: ObjectProperty
range: Resource
domain: Resource
domain: Thing

change note
definition: A note about a modification to a concept.
type: AnnotationProperty
sub property of: note
type: Property
note: A note about a modification to a concept.

preferred label
definition: The preferred lexical label for a resource, in a given language.
type: AnnotationProperty
sub property of: label
comment: A resource has no more than one value of skos:prefLabel per language tag, and no more than one value of skos:prefLabel without language tag.
comment: The range of skos:prefLabel is the class of RDF plain literals.
comment: skos:prefLabel, skos:altLabel and skos:hiddenLabel are pairwise disjoint properties.
type: Property
note: The preferred lexical label for a resource, in a given language.

Has Format
issued: 2000-07-11
Date Modified: 2008-01-14
type: Property
comment: A related resource that is substantially the same as the pre-existing described resource, but in another format.
Has Version: hasFormat-003
sub property of: Relation
note: This term is intended to be used with non-literal values as defined in the DCMI Abstract Model (http://dublincore.org/documents/abstract-model/). As of December 2007, the DCMI Usage Board is seeking a way to express this intention with a formal range declaration.
sub property of: relation
Relation: hasFormat-003
relation: hasFormat-003
date: 2008-01-14
date: 2000-07-11

DDC
Has Version: DDC-003
issued: 2000-07-11
Date Modified: 2008-01-14
type: VocabularyEncodingScheme
comment: The set of conceptual resources specified by the Dewey Decimal Classification.
Relation: DDC-003
relation: DDC-003
date: 2008-01-14
date: 2000-07-11

theme
type: Property
type: ObjectProperty
comment: A theme.
domain: Thing
range: Thing
term status: archaic
range: Resource
domain: Resource

CiTO, the Citation Typing Ontology
creator: Silvio Peroni
version info: 2.6.4
comment: CiTO, the Citation Typing Ontology, is an ontology for the characterization of citations, both factually and rhetorically. It forms part of SPAR, a suite of Semantic Publishing and Referencing Ontologies. Other SPAR ontologies are described at http://purl.org/spar/.
description: CiTO, the Citation Typing Ontology, is an ontology written in OWL 2 DL to enable characterization of the nature or type of citations, both factually and rhetorically, and to permit these descriptions to be published on the Web. The citations characterized may be either direct and explicit (as in the reference list of a journal article), indirect (e.g. a citation to a more recent paper by the same research group on the same topic), or implicit (e.g. as in artistic quotations or parodies, or in cases of plagiarism). CiTO contains the object property cito:cites and its sub-properties, and its inverse property cito:isCitedBy, from the original Citation Typing Ontology, CiTO v1.6. Upon the creation of version 2.0 of CiTO, a number of new sub-properties of cito:cites were added, and the inverse properties of all the sub-properties of cito:cites were created, all of which are sub-properties of cito:isCitedBy. The ontology has also been integrated with the SWAN Discourse Relationships Ontology by making cito:cites a sub-property of http://purl.org/swan/2.0/discourse-relationships/refersTo. Restrictions of domain and range present in the previous version of CiTO were removed from the object properties when creating CiTO v 2.0, permitting its independent use in other contexts, in addition to conventional bibliographic citations. So that they can be used independently, other entities that were previously included in CiTO v1.6 have now been made components of other SPAR ontologies: FaBiO, the FRBR-aligned Bibliographic Ontology; C4O, the Citation Counting and Context Characterization Ontology; and PSO, the Publication Status Ontology. The addition of two new properties:cito:usesConclusionsFrom and its inverse cito:providesConclusionsFor on 09Dec2011 led to a version number increment from v2.0 to v2.1. The addition of two additional properties, cito:compiles and cito:isCompiledBy, previously in the deprecated CiTO4Data ontology, on 03 July 2012 led to a version increment from v2…
prior version: 2014-05-22-cito-2 6 3.owl
contributor: Paolo Ciccarese
creator: David Shotton
rights: This work is distributed under a Creative Commons Attribution License (http://creativecommons.org/licenses/by/3.0/).
contributor: Tim Clark
prior version: http://imageweb.zoo.ox.ac.uk/pub/2009/citobase/cito-20100528-1.6/cito-content/cito.owl
date: 2015-07-03
imports: situation.owl
type: Ontology
comment: This ontology is available at http://purl.org/spar/cito/, and uses the namespace prefix cito.

notation
definition: A notation, also known as classification code, is a string of characters such as "T58.5" or "303.4833" used to uniquely identify a concept within the scope of a given concept scheme.
scope note: By convention, skos:notation is used with a typed literal in the object position of the triple.
type: DatatypeProperty
type: Property
note: By convention, skos:notation is used with a typed literal in the object position of the triple.
note: A notation, also known as classification code, is a string of characters such as "T58.5" or "303.4833" used to uniquely identify a concept within the scope of a given concept scheme.

hidden label
definition: A lexical label for a resource that should be hidden when generating visual displays of the resource, but should still be accessible to free text search operations.
type: AnnotationProperty
sub property of: label
comment: The range of skos:hiddenLabel is the class of RDF plain literals.
comment: skos:prefLabel, skos:altLabel and skos:hiddenLabel are pairwise disjoint properties.
type: Property
note: A lexical label for a resource that should be hidden when generating visual displays of the resource, but should still be accessible to free text search operations.

RFC 4646
description: RFC 4646 obsoletes RFC 3066.
Has Version: RFC4646-001
issued: 2008-01-14
type: Datatype
comment: The set of tags constructed according to RFC 4646 for the identification of languages.
Relation: RFC4646-001
relation: RFC4646-001
date: 2008-01-14
type: Class

Bibliographic Citation
Has Version: bibliographicCitation-002
description: Recommended practice is to include sufficient bibliographic detail to identify the resource as unambiguously as possible.
range: Literal
domain: Bibliographic Resource
comment: A bibliographic reference for the resource.
type: Property
sub property of: identifier
issued: 2003-02-15
Date Modified: 2008-01-14
sub property of: Identifier
Relation: bibliographicCitation-002
relation: bibliographicCitation-002
date: 2008-01-14
date: 2003-02-15
range: Resource
domain: Resource

Replaces
Has Version: replaces-003
note: This term is intended to be used with non-literal values as defined in the DCMI Abstract Model (http://dublincore.org/documents/abstract-model/). As of December 2007, the DCMI Usage Board is seeking a way to express this intention with a formal range declaration.
Date Modified: 2008-01-14
comment: A related resource that is supplanted, displaced, or superseded by the described resource.
sub property of: relation
sub property of: Relation
type: Property
issued: 2000-07-11
Relation: replaces-003
relation: replaces-003
date: 2008-01-14
date: 2000-07-11

DCMI Box
Has Version: Box-003
issued: 2000-07-11
Date Modified: 2008-01-14
type: Datatype
comment: The set of regions in space defined by their geographic coordinates according to the DCMI Box Encoding Scheme.
Relation: Box-003
relation: Box-003
date: 2008-01-14
date: 2000-07-11
type: Class

DCMI Metadata Terms - other
Date Modified: 2012-06-14
publisher: DCMI
date: 2012-06-14

SKOS Vocabulary
type: Ontology
Contributor: Dave Beckett
Contributor: Nikki Rogers
Contributor: Participants in W3C's Semantic Web Deployment Working Group.
description: An RDF vocabulary for describing the basic structure and content of concept schemes such as thesauri, classification schemes, subject heading lists, taxonomies, 'folksonomies', other types of controlled vocabulary, and also concept schemes embedded in glossaries and terminologies.
creator: Alistair Miles
creator: Sean Bechhofer
contributor: Alistair Miles
contributor: Sean Bechhofer
maker: Alistair Miles
maker: Sean Bechhofer
type: Thing

Temporal Coverage
sub property of: Coverage
Has Version: temporal-003
type: Property
issued: 2000-07-11
Date Modified: 2008-01-14
range: Period of Time
comment: Temporal characteristics of the resource.
sub property of: coverage
Relation: temporal-003
relation: temporal-003
date: 2008-01-14
date: 2000-07-11
range: Location, Period, or Jurisdiction
range: Resource

ISO 639-2
Has Version: ISO639-2-003
issued: 2000-07-11
Date Modified: 2008-01-14
type: Datatype
comment: The three-letter alphabetic codes listed in ISO639-2 for the representation of names of languages.
Relation: ISO639-2-003
relation: ISO639-2-003
date: 2008-01-14
date: 2000-07-11
type: Class

Date Valid
type: Property
range: Literal
issued: 2000-07-11
sub property of: date
comment: Date (often a range) of validity of a resource.
Date Modified: 2008-01-14
sub property of: Date
Has Version: valid-003
Relation: valid-003
relation: valid-003
date: 2008-01-14
date: 2000-07-11
range: Resource

lat/long
type: Property
comment: A comma-separated representation of a latitude, longitude coordinate.

RFC 3066
description: RFC 3066 has been obsoleted by RFC 4646.
Has Version: RFC3066-002
issued: 2002-07-13
Date Modified: 2008-01-14
type: Datatype
comment: The set of tags constructed according to RFC 3066 for the identification of languages.
Relation: RFC3066-002
relation: RFC3066-002
date: 2008-01-14
date: 2002-07-13
type: Class

birthday
type: Property
type: FunctionalProperty
type: DatatypeProperty
comment: The birthday of this Agent, represented in mm-dd string form, eg. '12-31'.
domain: Agent
range: Literal
term status: unstable
range: Resource
domain: Resource
domain: Thing

location
type: Property
range: SpatialThing
sub property of: based near
comment: The relation between something and the point, or other geometrical thing in space, where it is. For example, the realtionship between a radio tower and a Point with a given lat and long. Or a relationship between a park and its outline as a closed arc of points, or a road and its location as a arc (a sequence of points). Clearly in practice there will be limit to the accuracy of any such statement, but one would expect an accuracy appropriate for the size of the object and uses such as mapping
range: Thing
range: Resource
domain: Thing
domain: SpatialThing
domain: Resource

Extent
type: Property
comment: The size or duration of the resource.
issued: 2000-07-11
range: Size or Duration
Has Version: extent-003
Date Modified: 2008-01-14
sub property of: format
sub property of: Format
Relation: extent-003
relation: extent-003
date: 2008-01-14
date: 2000-07-11
range: Media Type or Extent
range: Resource

URI
Has Version: URI-003
issued: 2000-07-11
Date Modified: 2008-01-14
type: Datatype
comment: The set of identifiers constructed according to the generic syntax for Uniform Resource Identifiers as specified by the Internet Engineering Task Force.
Relation: URI-003
relation: URI-003
date: 2008-01-14
date: 2000-07-11
type: Class

Date
issued: 2008-01-14
comment: A point or period of time associated with an event in the lifecycle of the resource.
description: Date may be used to express temporal information at any level of granularity. Recommended best practice is to use an encoding scheme, such as the W3CDTF profile of ISO 8601 [W3CDTF].
Has Version: dateT-001
Date Modified: 2008-01-14
type: Property
range: Literal
sub property of: date
Relation: dateT-001
relation: dateT-001
date: 2008-01-14
range: Resource

W3C-DTF
Has Version: W3CDTF-003
issued: 2000-07-11
Date Modified: 2008-01-14
type: Datatype
comment: The set of dates and times constructed according to the W3C Date and Time Formats Specification.
Relation: W3CDTF-003
relation: W3CDTF-003
date: 2008-01-14
date: 2000-07-11
type: Class

Access Rights
range: Rights Statement
type: Property
issued: 2003-02-15
comment: Information about who can access the resource or an indication of its security status.
description: Access Rights may include information regarding access or restrictions based on privacy, security, or other policies.
sub property of: rights
sub property of: Rights
Date Modified: 2008-01-14
Has Version: accessRights-002
Relation: accessRights-002
relation: accessRights-002
date: 2008-01-14
date: 2003-02-15
range: Resource

Friend of a Friend (FOAF) vocabulary
type: Ontology
description: The Friend of a Friend (FOAF) RDF vocabulary, described using W3C RDF Schema and the Web Ontology Language.

TGN
Has Version: TGN-003
issued: 2000-07-11
Date Modified: 2008-01-14
type: VocabularyEncodingScheme
comment: The set of places specified by the Getty Thesaurus of Geographic Names.
Relation: TGN-003
relation: TGN-003
date: 2008-01-14
date: 2000-07-11

DCMI Type Vocabulary
Has Version: DCMIType-005
issued: 2000-07-11
Date Modified: 2012-06-14
type: VocabularyEncodingScheme
comment: The set of classes specified by the DCMI Type Vocabulary, used to categorize the nature or genre of the resource.
Relation: DCMIType-005
relation: DCMIType-005
date: 2012-06-14
date: 2000-07-11

Language
Date Modified: 2008-01-14
type: Property
Has Version: languageT-001
sub property of: language
description: Recommended best practice is to use a controlled vocabulary such as RFC 4646 [RFC4646].
issued: 2008-01-14
comment: A language of the resource.
range: Linguistic System
Relation: languageT-001
relation: languageT-001
date: 2008-01-14
range: Resource

Given name
type: Property
type: DatatypeProperty
comment: The given name of some person.
term status: testing

Is Required By
comment: A related resource that requires the described resource to support its function, delivery, or coherence.
type: Property
Date Modified: 2008-01-14
sub property of: relation
note: This term is intended to be used with non-literal values as defined in the DCMI Abstract Model (http://dublincore.org/documents/abstract-model/). As of December 2007, the DCMI Usage Board is seeking a way to express this intention with a formal range declaration.
Has Version: isRequiredBy-003
issued: 2000-07-11
sub property of: Relation
Relation: isRequiredBy-003
relation: isRequiredBy-003
date: 2008-01-14
date: 2000-07-11

WGS84 Geo Positioning: an RDF vocabulary
description: A vocabulary for representing latitude, longitude and altitude information in the WGS84 geodetic reference datum. Version $Id: wgs84_pos.rdf,v 1.22 2009/04/20 15:00:30 timbl Exp $. See http://www.w3.org/2003/01/geo/ for more details.
date: $Date: 2009/04/20 15:00:30 $
label: geo
comment: Recent changes to this namespace: $Log: wgs84_pos.rdf,v $ Revision 1.22 2009/04/20 15:00:30 timbl Remove the time bits which have been deal with elsewhere eg in iCal. Revision 1.21 2009/04/20 12:52:47 timbl try again Revision 1.20 2009/04/20 12:42:11 timbl Add Event (edited ages ago and never checked in), and location (following discussion http://chatlogs.planetrdf.com/swig/2009-04-20#T12-36-09) Revision 1.19 2009/04/20 12:36:31 timbl Add Event (edited ages ago and never checked in), and location (following discussion http://chatlogs.planetrdf.com/swig/2009-04-20#T12-36-09) Revision 1.18 2006/02/01 22:01:04 danbri Clarified that lat and long are decimal degrees, and that alt is decimal metres about local reference ellipsoid Revision 1.17 2004/02/06 17:38:12 danbri Fixed a bad commit screwup Revision 1.15 2003/04/19 11:24:08 danbri Fixed the typo even more. Revision 1.14 2003/04/19 11:16:56 danbri fixed a typo Revision 1.13 2003/02/19 22:27:27 connolly relaxed domain constraints on lat/long/alt from Point to SpatialThing Revision 1.12 2003/01/12 01:41:41 danbri Trying local copy of XSLT doc. Revision 1.11 2003/01/12 01:20:18 danbri added a link to morten's xslt rdfs viewer. Revision 1.10 2003/01/11 18:56:49 danbri Removed datatype range from lat and long properties, since they would have required each occurance of the property to mention the datatype. Revision 1.9 2003/01/11 11:41:31 danbri Another typo; repaired rdfs:Property to rdf:Property x4 Revision 1.8 2003/01/11 11:05:02 danbri Added an rdfs:range for each lat/long/alt property, http://www.w3.org/2001/XMLSchema#float Revision 1.7 2003/01/10 20:25:16 danbri Longer rdfs:comment for Point, trying to be Earth-centric and neutral about coordinate system(s) at the same time. Feedback welcomed. Revision 1.6 2003/01/10 20:18:30 danbri Added CVS log comments into the RDF/XML as an rdfs:comment property of the vocabulary. Note that this is not common practice (but seems both harmless and potentially useful). revision 1.…

ISO 639-3
Has Version: ISO639-3-001
issued: 2008-01-14
type: Datatype
comment: The set of three-letter codes listed in ISO 639-3 for the representation of names of languages.
Relation: ISO639-3-001
relation: ISO639-3-001
date: 2008-01-14
type: Class

name
type: Property
type: DatatypeProperty
comment: A name for some thing.
domain: Thing
range: Literal
sub property of: label
term status: testing
range: Resource
domain: Resource

history note
definition: A note about the past state/use/meaning of a concept.
type: AnnotationProperty
sub property of: note
type: Property
note: A note about the past state/use/meaning of a concept.

editorial note
definition: A note for an editor, translator or maintainer of the vocabulary.
type: AnnotationProperty
sub property of: note
type: Property
note: A note for an editor, translator or maintainer of the vocabulary.

nickname
type: Property
type: DatatypeProperty
comment: A short informal nickname characterising an agent (includes login identifiers, IRC and other chat nicknames).
term status: testing

Is Version Of
note: This term is intended to be used with non-literal values as defined in the DCMI Abstract Model (http://dublincore.org/documents/abstract-model/). As of December 2007, the DCMI Usage Board is seeking a way to express this intention with a formal range declaration.
Has Version: isVersionOf-003
sub property of: Relation
type: Property
sub property of: relation
comment: A related resource of which the described resource is a version, edition, or adaptation.
issued: 2000-07-11
description: Changes in version imply substantive changes in content rather than differences in format.
Date Modified: 2008-01-14
Relation: isVersionOf-003
relation: isVersionOf-003
date: 2008-01-14
date: 2000-07-11

Conforms To
issued: 2001-05-21
Date Modified: 2008-01-14
range: Standard
sub property of: relation
comment: An established standard to which the described resource conforms.
Has Version: conformsTo-003
sub property of: Relation
type: Property
Relation: conformsTo-003
relation: conformsTo-003
date: 2008-01-14
date: 2001-05-21
range: Resource

Date Issued
range: Literal
sub property of: Date
comment: Date of formal issuance (e.g., publication) of the resource.
Has Version: issued-003
Date Modified: 2008-01-14
type: Property
issued: 2000-07-11
sub property of: date
Relation: issued-003
relation: issued-003
date: 2008-01-14
date: 2000-07-11
range: Resource

Yahoo chat ID
domain: Agent
term status: testing
range: Literal
comment: A Yahoo chat ID
type: DatatypeProperty
sub property of: nickname
type: Property
type: InverseFunctionalProperty
type: ObjectProperty
range: Resource
domain: Resource
domain: Thing

Abstract
Has Version: abstract-003
issued: 2000-07-11
Date Modified: 2008-01-14
type: Property
comment: A summary of the resource.
sub property of: description
sub property of: Description
Relation: abstract-003
relation: abstract-003
date: 2008-01-14
date: 2000-07-11

AIM chat ID
type: Property
type: DatatypeProperty
domain: Agent
comment: An AIM chat ID
type: InverseFunctionalProperty
term status: testing
range: Literal
sub property of: nickname
type: ObjectProperty
range: Resource
domain: Resource
domain: Thing

Audience
Has Version: audience-003
issued: 2001-05-21
Date Modified: 2008-01-14
type: Property
comment: A class of entity for whom the resource is intended or useful.
range: Agent Class
Relation: audience-003
relation: audience-003
date: 2008-01-14
date: 2001-05-21
range: Resource
range: Class

References
type: Property
note: This term is intended to be used with non-literal values as defined in the DCMI Abstract Model (http://dublincore.org/documents/abstract-model/). As of December 2007, the DCMI Usage Board is seeking a way to express this intention with a formal range declaration.
issued: 2000-07-11
Date Modified: 2008-01-14
sub property of: relation
Has Version: references-003
sub property of: Relation
comment: A related resource that is referenced, cited, or otherwise pointed to by the described resource.
Relation: references-003
relation: references-003
date: 2008-01-14
date: 2000-07-11

scope note
definition: A note that helps to clarify the meaning and/or the use of a concept.
type: AnnotationProperty
sub property of: note
type: Property
note: A note that helps to clarify the meaning and/or the use of a concept.

Alternative Title
sub property of: Title
sub property of: title
type: Property
Date Modified: 2010-10-11
range: Literal
issued: 2000-07-11
description: The distinction between titles and alternative titles is application-specific.
Has Version: alternative-003
comment: An alternative name for the resource.
Relation: alternative-003
relation: alternative-003
date: 2010-10-11
date: 2000-07-11
range: Resource

alternative label
definition: An alternative lexical label for a resource.
example: Acronyms, abbreviations, spelling variants, and irregular plural/singular forms may be included among the alternative labels for a concept. Mis-spelled terms are normally included as hidden labels (see skos:hiddenLabel).
type: AnnotationProperty
sub property of: label
comment: The range of skos:altLabel is the class of RDF plain literals.
comment: skos:prefLabel, skos:altLabel and skos:hiddenLabel are pairwise disjoint properties.
type: Property
note: Acronyms, abbreviations, spelling variants, and irregular plural/singular forms may be included among the alternative labels for a concept. Mis-spelled terms are normally included as hidden labels (see skos:hiddenLabel).
note: An alternative lexical label for a resource.

Identifier
sub property of: identifier
range: Literal
Has Version: identifierT-001
description: Recommended best practice is to identify the resource by means of a string conforming to a formal identification system.
issued: 2008-01-14
type: Property
comment: An unambiguous reference to the resource within a given context.
Date Modified: 2008-01-14
Relation: identifierT-001
relation: identifierT-001
date: 2008-01-14
range: Resource

altitude
type: Property
domain: SpatialThing
comment: The WGS84 altitude of a SpatialThing (decimal meters above the local reference ellipsoid).
domain: Resource

Instructional Method
description: Instructional Method will typically include ways of presenting instructional materials or conducting instructional activities, patterns of learner-to-learner and learner-to-instructor interactions, and mechanisms by which group and individual levels of learning are measured. Instructional methods include all aspects of the instruction and learning processes from planning and implementation through evaluation and feedback.
Has Version: instructionalMethod-002
issued: 2005-06-13
Date Modified: 2008-01-14
type: Property
comment: A process, used to engender knowledge, attitudes and skills, that the described resource is designed to support.
range: Method of Instruction
Relation: instructionalMethod-002
relation: instructionalMethod-002
date: 2008-01-14
date: 2005-06-13
range: Resource

geekcode
type: Property
type: DatatypeProperty
comment: A textual geekcode for this person, see http://www.geekcode.com/geek.html
domain: Person
range: Literal
term status: archaic
range: Resource
domain: Agent
domain: Resource
domain: Thing
domain: SpatialThing

family_name
type: Property
type: DatatypeProperty
comment: The family name of some person.
domain: Person
range: Literal
term status: archaic
range: Resource
domain: Agent
domain: Resource
domain: Thing
domain: SpatialThing

Date Submitted
sub property of: date
type: Property
range: Literal
comment: Date of submission of the resource.
sub property of: Date
Date Modified: 2008-01-14
issued: 2002-07-13
description: Examples of resources to which a Date Submitted may be relevant are a thesis (submitted to a university department) or an article (submitted to a journal).
Has Version: dateSubmitted-002
Relation: dateSubmitted-002
relation: dateSubmitted-002
date: 2008-01-14
date: 2002-07-13
range: Resource

Is Format Of
Has Version: isFormatOf-003
Date Modified: 2008-01-14
issued: 2000-07-11
sub property of: relation
type: Property
note: This term is intended to be used with non-literal values as defined in the DCMI Abstract Model (http://dublincore.org/documents/abstract-model/). As of December 2007, the DCMI Usage Board is seeking a way to express this intention with a formal range declaration.
sub property of: Relation
comment: A related resource that is substantially the same as the described resource, but in another format.
Relation: isFormatOf-003
relation: isFormatOf-003
date: 2008-01-14
date: 2000-07-11

latitude
type: Property
domain: SpatialThing
comment: The WGS84 latitude of a SpatialThing (decimal degrees).
domain: Resource

Mediator
type: Property
range: Agent Class
issued: 2001-05-21
Has Version: mediator-003
Date Modified: 2008-01-14
comment: An entity that mediates access to the resource and for whom the resource is intended or useful.
description: In an educational context, a mediator might be a parent, teacher, teaching assistant, or care-giver.
sub property of: Audience
Relation: mediator-003
relation: mediator-003
date: 2008-01-14
date: 2001-05-21
range: Resource
range: Class

longitude
type: Property
domain: SpatialThing
comment: The WGS84 longitude of a SpatialThing (decimal degrees).
domain: Resource

note
definition: A general note, for any purpose.
scope note: This property may be used directly, or as a super-property for more specific note types.
type: AnnotationProperty
type: Property
note: This property may be used directly, or as a super-property for more specific note types.
note: A general note, for any purpose.

Is Referenced By
Date Modified: 2008-01-14
issued: 2000-07-11
sub property of: relation
note: This term is intended to be used with non-literal values as defined in the DCMI Abstract Model (http://dublincore.org/documents/abstract-model/). As of December 2007, the DCMI Usage Board is seeking a way to express this intention with a formal range declaration.
comment: A related resource that references, cites, or otherwise points to the described resource.
type: Property
sub property of: Relation
Has Version: isReferencedBy-003
Relation: isReferencedBy-003
relation: isReferencedBy-003
date: 2008-01-14
date: 2000-07-11

MSN chat ID
sub property of: nickname
type: InverseFunctionalProperty
comment: An MSN chat ID
domain: Agent
type: DatatypeProperty
term status: testing
type: Property
range: Literal
type: ObjectProperty
range: Resource
domain: Resource
domain: Thing

RFC 1766
Has Version: RFC1766-003
issued: 2000-07-11
Date Modified: 2008-01-14
type: Datatype
comment: The set of tags, constructed according to RFC 1766, for the identification of languages.
Relation: RFC1766-003
relation: RFC1766-003
date: 2008-01-14
date: 2000-07-11
type: Class

DCMI Point
Has Version: Point-003
issued: 2000-07-11
Date Modified: 2008-01-14
type: Datatype
comment: The set of points in space defined by their geographic coordinates according to the DCMI Point Encoding Scheme.
Relation: Point-003
relation: Point-003
date: 2008-01-14
date: 2000-07-11
type: Class

Requires
Has Version: requires-003
type: Property
comment: A related resource that is required by the described resource to support its function, delivery, or coherence.
issued: 2000-07-11
sub property of: relation
note: This term is intended to be used with non-literal values as defined in the DCMI Abstract Model (http://dublincore.org/documents/abstract-model/). As of December 2007, the DCMI Usage Board is seeking a way to express this intention with a formal range declaration.
Date Modified: 2008-01-14
sub property of: Relation
Relation: requires-003
relation: requires-003
date: 2008-01-14
date: 2000-07-11

Rights
range: Rights Statement
issued: 2008-01-14
description: Typically, rights information includes a statement about various property rights associated with the resource, including intellectual property rights.
comment: Information about rights held in and over the resource.
Date Modified: 2008-01-14
type: Property
Has Version: rightsT-001
sub property of: rights
Relation: rightsT-001
relation: rightsT-001
date: 2008-01-14
range: Resource

Subject
Has Version: subjectT-002
Date Modified: 2012-06-14
description: Typically, the subject will be represented using keywords, key phrases, or classification codes. Recommended best practice is to use a controlled vocabulary.
issued: 2008-01-14
sub property of: subject
type: Property
note: This term is intended to be used with non-literal values as defined in the DCMI Abstract Model (http://dublincore.org/documents/abstract-model/). As of December 2007, the DCMI Usage Board is seeking a way to express this intention with a formal range declaration.
comment: The topic of the resource.
Relation: subjectT-002
relation: subjectT-002
date: 2012-06-14
date: 2008-01-14

sha1sum of a personal mailbox URI name
type: Property
type: InverseFunctionalProperty
type: DatatypeProperty
comment: The sha1sum of the URI of an Internet mailbox associated with exactly one owner, the first owner of the mailbox.
domain: Agent
range: Literal
term status: testing
type: ObjectProperty
range: Resource
domain: Resource
domain: Thing

Rights Holder
Has Version: rightsHolder-002
issued: 2004-06-14
Date Modified: 2008-01-14
type: Property
comment: A person or organization owning or managing rights over the resource.
range: Agent
Relation: rightsHolder-002
relation: rightsHolder-002
date: 2008-01-14
date: 2004-06-14
range: Resource
range: Thing

Spatial Coverage
type: Property
range: Location
comment: Spatial characteristics of the resource.
issued: 2000-07-11
Date Modified: 2008-01-14
Has Version: spatial-003
sub property of: Coverage
sub property of: coverage
Relation: spatial-003
relation: spatial-003
date: 2008-01-14
date: 2000-07-11
range: Location, Period, or Jurisdiction
range: Resource

Publisher
Date Modified: 2010-10-11
issued: 2008-01-14
range: Agent
comment: An entity responsible for making the resource available.
Has Version: publisherT-001
type: Property
description: Examples of a Publisher include a person, an organization, or a service.
sub property of: publisher
Relation: publisherT-001
relation: publisherT-001
date: 2010-10-11
date: 2008-01-14
range: Resource
range: Thing

logo
type: Property
type: ObjectProperty
type: InverseFunctionalProperty
comment: A logo representing some thing.
domain: Thing
range: Thing
term status: testing
range: Resource
domain: Resource

MeSH
Has Version: MESH-003
issued: 2000-07-11
Date Modified: 2008-01-14
type: VocabularyEncodingScheme
comment: The set of labeled concepts specified by the Medical Subject Headings.
Relation: MESH-003
relation: MESH-003
date: 2008-01-14
date: 2000-07-11

account name
type: Property
type: DatatypeProperty
comment: Indicates the name (identifier) associated with this online account.
domain: Online Account
range: Literal
term status: testing
range: Resource
domain: Resource
domain: Thing

jabber ID
type: Property
type: DatatypeProperty
type: InverseFunctionalProperty
comment: A jabber ID for something.
domain: Agent
range: Literal
term status: testing
type: ObjectProperty
range: Resource
domain: Resource
domain: Thing

Format
Has Version: formatT-001
type: Property
description: Examples of dimensions include size and duration. Recommended best practice is to use a controlled vocabulary such as the list of Internet Media Types [MIME].
Date Modified: 2008-01-14
comment: The file format, physical medium, or dimensions of the resource.
issued: 2008-01-14
sub property of: format
range: Media Type or Extent
Relation: formatT-001
relation: formatT-001
date: 2008-01-14
range: Resource

LCSH
Has Version: LCSH-003
issued: 2000-07-11
Date Modified: 2008-01-14
type: VocabularyEncodingScheme
comment: The set of labeled concepts specified by the Library of Congress Subject Headings.
Relation: LCSH-003
relation: LCSH-003
date: 2008-01-14
date: 2000-07-11

age
type: Property
type: FunctionalProperty
type: DatatypeProperty
comment: The age in years of some agent.
domain: Agent
range: Literal
term status: unstable
range: Resource
domain: Resource
domain: Thing

NeoGeo Spatial Ontology
type: Ontology
comment: A vocabulary for describing topological relations between features. $Id: spatial# 81 2012-02-05 11:06:49Z non88sense@gmail.com $
imports: spatial

License
comment: A legal document giving official permission to do something with the resource.
type: Property
range: License Document
sub property of: rights
issued: 2004-06-14
Date Modified: 2008-01-14
Has Version: license-002
sub property of: Rights
Relation: license-002
relation: license-002
date: 2008-01-14
date: 2004-06-14
range: Rights Statement
range: Resource

firstName
type: Property
type: DatatypeProperty
comment: The first name of a person.
domain: Person
range: Literal
term status: testing
range: Resource
domain: Agent
domain: Resource
domain: Thing
domain: SpatialThing

Type
Has Version: typeT-001
sub property of: type
description: Recommended best practice is to use a controlled vocabulary such as the DCMI Type Vocabulary [DCMITYPE]. To describe the file format, physical medium, or dimensions of the resource, use the Format element.
Date Modified: 2008-01-14
range: Class
type: Property
comment: The nature or genre of the resource.
issued: 2008-01-14
Relation: typeT-001
relation: typeT-001
date: 2008-01-14
range: Resource

ISO 3166
Has Version: ISO3166-004
issued: 2000-07-11
Date Modified: 2008-01-14
type: Datatype
comment: The set of codes listed in ISO 3166-1 for the representation of names of countries.
Relation: ISO3166-004
relation: ISO3166-004
date: 2008-01-14
date: 2000-07-11
type: Class

Contributor
comment: An entity responsible for making contributions to the resource.
description: Examples of a Contributor include a person, an organization, or a service.
type: Property
Date Modified: 2010-10-11
issued: 2008-01-14
sub property of: contributor
range: Agent
Has Version: contributorT-001
Relation: contributorT-001
relation: contributorT-001
date: 2010-10-11
date: 2008-01-14
range: Resource
range: Thing

status
type: Property
type: DatatypeProperty
comment: A string expressing what the user is happy for the general public (normally) to know about their current activity.
domain: Agent
range: Literal
term status: unstable
range: Resource
domain: Resource
domain: Thing

gender
type: Property
type: FunctionalProperty
type: DatatypeProperty
comment: The gender of this Agent (typically but not necessarily 'male' or 'female').
domain: Agent
range: Literal
term status: testing
range: Resource
domain: Resource
domain: Thing

example
definition: An example of the use of a concept.
type: AnnotationProperty
sub property of: note
type: Property
note: An example of the use of a concept.

myersBriggs
type: Property
type: DatatypeProperty
comment: A Myers Briggs (MBTI) personality classification.
domain: Person
range: Literal
term status: testing
range: Resource
domain: Agent
domain: Resource
domain: Thing
domain: SpatialThing

DCMI Period
Has Version: Period-003
issued: 2000-07-11
Date Modified: 2008-01-14
type: Datatype
comment: The set of time intervals defined by their limits according to the DCMI Period Encoding Scheme.
Relation: Period-003
relation: Period-003
date: 2008-01-14
date: 2000-07-11
type: Class

Date Modified
Date Modified: 2008-01-14
sub property of: Date
type: Property
range: Literal
issued: 2000-07-11
sub property of: date
comment: Date on which the resource was changed.
Has Version: modified-003
Relation: modified-003
relation: modified-003
date: 2008-01-14
date: 2000-07-11
range: Resource

Date Accepted
Date Modified: 2008-01-14
range: Literal
sub property of: date
comment: Date of acceptance of the resource.
type: Property
description: Examples of resources to which a Date Accepted may be relevant are a thesis (accepted by a university department) or an article (accepted by a journal).
Has Version: dateAccepted-002
sub property of: Date
issued: 2002-07-13
Relation: dateAccepted-002
relation: dateAccepted-002
date: 2008-01-14
date: 2002-07-13
range: Resource

Audience Education Level
Has Version: educationLevel-002
issued: 2002-07-13
Date Modified: 2008-01-14
type: Property
comment: A class of entity, defined in terms of progression through an educational or training context, for which the described resource is intended.
range: Agent Class
sub property of: Audience
Relation: educationLevel-002
relation: educationLevel-002
date: 2008-01-14
date: 2002-07-13
range: Resource
range: Class

Has Version
Has Version: hasVersion-003
sub property of: relation
comment: A related resource that is a version, edition, or adaptation of the described resource.
Date Modified: 2008-01-14
note: This term is intended to be used with non-literal values as defined in the DCMI Abstract Model (http://dublincore.org/documents/abstract-model/). As of December 2007, the DCMI Usage Board is seeking a way to express this intention with a formal range declaration.
issued: 2000-07-11
type: Property
sub property of: Relation
Relation: hasVersion-003
relation: hasVersion-003
date: 2008-01-14
date: 2000-07-11