Acquaintance
type: Class
subclass of: Relation Type

Agent
type: Class
subclass of: Relation Type

BBS
type: Class
comment: This class is deprecated
subclass of: Phone
deprecated: true

Car
type: Class
comment: This class is deprecated
subclass of: Phone
deprecated: true

Cell
type: Class
comment: Also called mobile telephone
subclass of: Phone

Child
type: Class
subclass of: Relation Type

Colleague
type: Class
subclass of: Relation Type

Contact
type: Class
subclass of: Relation Type

Coresident
type: Class
subclass of: Relation Type

Coworker
type: Class
subclass of: Relation Type

Crush
type: Class
subclass of: Relation Type

Date
type: Class
subclass of: Relation Type

Dom
type: Class
comment: This class is deprecated
subclass of: Type
deprecated: true

Emergency
type: Class
subclass of: Relation Type

Fax
type: Class
subclass of: Phone

Female
type: Class
subclass of: Gender

Friend
type: Class
subclass of: Relation Type

Home
type: Class
comment: This implies that the property is related to an individual's personal life
subclass of: Type

ISDN
type: Class
comment: This class is deprecated
subclass of: Type
deprecated: true

Internet
type: Class
comment: This class is deprecated
subclass of: Type
deprecated: true

Intl
type: Class
comment: This class is deprecated
subclass of: Type
deprecated: true

Kin
type: Class
subclass of: Relation Type

Label
type: Class
comment: This class is deprecated
subclass of: Type
deprecated: true

Male
type: Class
subclass of: Gender

Me
type: Class
subclass of: Relation Type

Met
type: Class
subclass of: Relation Type

Modem
type: Class
comment: This class is deprecated
subclass of: Phone
deprecated: true

Msg
type: Class
comment: This class is deprecated
subclass of: Phone
deprecated: true

Muse
type: Class
subclass of: Relation Type

Neighbor
type: Class
subclass of: Relation Type

None
type: Class
subclass of: Gender

Other
type: Class
subclass of: Gender

PCS
type: Class
comment: This class is deprecated
subclass of: Phone
deprecated: true

Pager
type: Class
subclass of: Phone

Parcel
type: Class
comment: This class is deprecated
subclass of: Type
deprecated: true

Parent
type: Class
subclass of: Relation Type

Postal
type: Class
comment: This class is deprecated
subclass of: Type
deprecated: true

Pref
type: Class
comment: This class is deprecated
subclass of: Type
deprecated: true

Sibling
type: Class
subclass of: Relation Type

Spouse
type: Class
subclass of: Relation Type

Sweetheart
type: Class
subclass of: Relation Type

Tel
type: Class
comment: This class is deprecated. Use the hasTelephone object property.
deprecated: true

Text
type: Class
comment: Also called sms telephone
subclass of: Phone

Text phone
type: Class
subclass of: Phone

Unknown
type: Class
subclass of: Gender

Video
type: Class
subclass of: Phone

Voice
type: Class
subclass of: Phone

Work
type: Class
comment: This implies that the property is related to an individual's work place
subclass of: Type

X400
type: Class
comment: This class is deprecated
subclass of: Type
deprecated: true

address
type: ObjectProperty
comment: This object property has been mapped
equivalent property: has address

agent
type: ObjectProperty
comment: This object property has been deprecated
deprecated: true

anniversary
type: DatatypeProperty
comment: The date of marriage, or equivalent, of the object
range: http://lodlaundromat.org/.well-known/genid/samples/pellet///predicate//cc98ae2fdc077a702dfaa1db77c8ffdf/c4d8df83849b9a17565dd1ee18d3aa39#1

birth date
type: DatatypeProperty
comment: To specify the birth date of the object
range: http://lodlaundromat.org/.well-known/genid/samples/pellet///predicate//cc98ae2fdc077a702dfaa1db77c8ffdf/c4d8df83849b9a17565dd1ee18d3aa39#4

category
type: DatatypeProperty
comment: The category information about the object, also known as tags
range: string

class
type: DatatypeProperty
comment: This data property has been deprecated
deprecated: true

email
type: ObjectProperty
comment: This object property has been mapped
equivalent property: has email

extended address
type: DatatypeProperty
comment: This data property has been deprecated
deprecated: true

geo
type: ObjectProperty
comment: This object property has been mapped
equivalent property: has geo

has additional name
type: ObjectProperty
comment: Used to support property parameters for the additional name data property

has calendar busy
type: ObjectProperty
comment: To specify the busy time associated with the object. (Was called FBURL in RFC6350)

has calendar link
type: ObjectProperty
comment: To specify the calendar associated with the object. (Was called CALURI in RFC6350)

has calendar request
type: ObjectProperty
comment: To specify the calendar user address to which a scheduling request be sent for the object. (Was called CALADRURI in RFC6350)

has category
type: ObjectProperty
comment: Used to support property parameters for the category data property

has country name
type: ObjectProperty
comment: Used to support property parameters for the country name data property

has formatted name
type: ObjectProperty
comment: Used to support property parameters for the formatted name data property

has family name
type: ObjectProperty
comment: Used to support property parameters for the family name data property

has gender
type: ObjectProperty
comment: To specify the sex or gender identity of the object. URIs are recommended to enable interoperable sex and gender codes to be used.

has given name
type: ObjectProperty
comment: Used to support property parameters for the given name data property

has honorific prefix
type: ObjectProperty
comment: Used to support property parameters for the honorific prefix data property

has honorific suffix
type: ObjectProperty
comment: Used to support property parameters for the honorific suffix data property

has messaging
type: ObjectProperty
comment: To specify the instant messaging and presence protocol communications with the object. (Was called IMPP in RFC6350)

has language
type: ObjectProperty
comment: Used to support property parameters for the language data property

has locality
type: ObjectProperty
comment: Used to support property parameters for the locality data property

has nickname
type: ObjectProperty
comment: Used to support property parameters for the nickname data property

has note
type: ObjectProperty
comment: Used to support property parameters for the note data property

has organization name
type: ObjectProperty
comment: Used to support property parameters for the organization name data property

has organization unit name
type: ObjectProperty
comment: Used to support property parameters for the organization unit name data property

has postal code
type: ObjectProperty
comment: Used to support property parameters for the postal code data property

has region
type: ObjectProperty
comment: Used to support property parameters for the region data property

has related
type: ObjectProperty
comment: To specify a relationship between another entity and the entity represented by this object

has role
type: ObjectProperty
comment: Used to support property parameters for the role data property

has source
type: ObjectProperty
comment: To identify the source of directory information of the object

has street address
type: ObjectProperty
comment: Used to support property parameters for the street address data property

has title
type: ObjectProperty
comment: Used to support property parameters for the title data property

has uid
type: ObjectProperty
comment: To specify a value that represents a globally unique identifier corresponding to the object

has value
type: ObjectProperty
comment: Used to indicate the resource value of an object property that requires property parameters

label
type: DatatypeProperty
comment: This data property has been deprecated
deprecated: true

language
type: DatatypeProperty
comment: To specify the language that may be used for contacting the object. May also be used as a property parameter.

latitude
type: DatatypeProperty
comment: This data property has been deprecated. See hasGeo
deprecated: true

longitude
type: DatatypeProperty
comment: This data property has been deprecated. See hasGeo
deprecated: true

mailer
type: DatatypeProperty
comment: This data property has been deprecated
deprecated: true

note
type: DatatypeProperty
comment: A note associated with the object
range: string

organization
type: ObjectProperty
comment: This object property has been mapped. Use the organization-name data property.
equivalent property: organization name

organizational unit name
type: DatatypeProperty
comment: To specify the organizational unit name associated with the object
range: string
sub property of: organization name

post office box
type: DatatypeProperty
comment: This data property has been deprecated
deprecated: true

product id
type: DatatypeProperty
comment: To specify the identifier for the product that created the object
range: string

revision
type: DatatypeProperty
comment: To specify revision information about the object
range: dateTime

role
type: DatatypeProperty
comment: To specify the function or part played in a particular situation by the object
range: string

sort as
type: DatatypeProperty
comment: To specify the string to be used for national-language-specific sorting. Used as a property parameter only.
range: string

title
type: DatatypeProperty
comment: To specify the position or job of the object
range: string

time zone
type: DatatypeProperty
comment: To indicate time zone information that is specific to the object. May also be used as a property parameter.
range: string

value
type: DatatypeProperty
comment: Used to indicate the literal value of a data property that requires property parameters

Address
type: Class
comment: To specify the components of the delivery address for the object
equivalent class: http://lodlaundromat.org/.well-known/genid/samples/pellet///predicate//cc98ae2fdc077a702dfaa1db77c8ffdf/c4d8df83849b9a17565dd1ee18d3aa39#8

http://lodlaundromat.org/.well-known/genid/samples/pellet///predicate//cc98ae2fdc077a702dfaa1db77c8ffdf/c4d8df83849b9a17565dd1ee18d3aa39#13
type: Restriction
max cardinality: 1
on property: country name

http://lodlaundromat.org/.well-known/genid/samples/pellet///predicate//cc98ae2fdc077a702dfaa1db77c8ffdf/c4d8df83849b9a17565dd1ee18d3aa39#20
type: Restriction
max cardinality: 1
on property: locality

http://lodlaundromat.org/.well-known/genid/samples/pellet///predicate//cc98ae2fdc077a702dfaa1db77c8ffdf/c4d8df83849b9a17565dd1ee18d3aa39#26
type: Restriction
max cardinality: 1
on property: postal code

http://lodlaundromat.org/.well-known/genid/samples/pellet///predicate//cc98ae2fdc077a702dfaa1db77c8ffdf/c4d8df83849b9a17565dd1ee18d3aa39#32
type: Restriction
max cardinality: 1
on property: region

http://lodlaundromat.org/.well-known/genid/samples/pellet///predicate//cc98ae2fdc077a702dfaa1db77c8ffdf/c4d8df83849b9a17565dd1ee18d3aa39#38
type: Restriction
max cardinality: 1
on property: street address

Email
type: Class
comment: To specify the electronic mail address for communication with the object the vCard represents. Use the hasEmail object property.
deprecated: true

Group
type: Class
comment: Object representing a group of persons or entities. A group object will usually contain hasMember properties to specify the members of the group.
subclass of: Kind
disjoint with: Individual
disjoint with: Location
disjoint with: Organization
equivalent class: http://lodlaundromat.org/.well-known/genid/samples/pellet///predicate//cc98ae2fdc077a702dfaa1db77c8ffdf/c4d8df83849b9a17565dd1ee18d3aa39#39

http://lodlaundromat.org/.well-known/genid/samples/pellet///predicate//cc98ae2fdc077a702dfaa1db77c8ffdf/c4d8df83849b9a17565dd1ee18d3aa39#43
type: Restriction
min qualified cardinality: 1
on class: Kind
on property: has member

Individual
type: Class
comment: An object representing a single person or entity
subclass of: Kind
disjoint with: Location
disjoint with: Organization

Name
type: Class
comment: To specify the components of the name of the object
equivalent class: http://lodlaundromat.org/.well-known/genid/samples/pellet///predicate//cc98ae2fdc077a702dfaa1db77c8ffdf/c4d8df83849b9a17565dd1ee18d3aa39#44

http://lodlaundromat.org/.well-known/genid/samples/pellet///predicate//cc98ae2fdc077a702dfaa1db77c8ffdf/c4d8df83849b9a17565dd1ee18d3aa39#49
type: Restriction
min cardinality: 0
on property: additional name

http://lodlaundromat.org/.well-known/genid/samples/pellet///predicate//cc98ae2fdc077a702dfaa1db77c8ffdf/c4d8df83849b9a17565dd1ee18d3aa39#56
type: Restriction
max cardinality: 1
on property: family name

http://lodlaundromat.org/.well-known/genid/samples/pellet///predicate//cc98ae2fdc077a702dfaa1db77c8ffdf/c4d8df83849b9a17565dd1ee18d3aa39#62
type: Restriction
max cardinality: 1
on property: given name

http://lodlaundromat.org/.well-known/genid/samples/pellet///predicate//cc98ae2fdc077a702dfaa1db77c8ffdf/c4d8df83849b9a17565dd1ee18d3aa39#68
type: Restriction
min cardinality: 0
on property: honorific prefix

http://lodlaundromat.org/.well-known/genid/samples/pellet///predicate//cc98ae2fdc077a702dfaa1db77c8ffdf/c4d8df83849b9a17565dd1ee18d3aa39#74
type: Restriction
min cardinality: 0
on property: honorific suffix

VCard
type: Class
comment: The vCard class is equivalent to the new Kind class, which is the parent for the four explicit types of vCards (Individual, Organization, Location, Group)
equivalent class: Kind

formatted name
type: DatatypeProperty
comment: The formatted text corresponding to the name of the object
range: string

has address
type: ObjectProperty
comment: To specify the components of the delivery address for the object
range: Address

has email
type: ObjectProperty
comment: To specify the electronic mail address for communication with the object
range: Email

has geo
type: ObjectProperty
comment: To specify information related to the global positioning of the object. May also be used as a property parameter.

has key
type: ObjectProperty
comment: To specify a public key or authentication certificate associated with the object
equivalent property: key

has logo
type: ObjectProperty
comment: To specify a graphic image of a logo associated with the object
equivalent property: logo

has name
type: ObjectProperty
comment: To specify the components of the name of the object
range: Name
equivalent property: name

has photo
type: ObjectProperty
comment: To specify an image or photograph information that annotates some aspect of the object
equivalent property: photo

has sound
type: ObjectProperty
comment: To specify a digital sound content information that annotates some aspect of the object
equivalent property: sound

has telephone
type: ObjectProperty
comment: To specify the telephone number for telephony communication with the object
equivalent property: telephone

has url
type: ObjectProperty
comment: To specify a uniform resource locator associated with the object
equivalent property: url

key
type: ObjectProperty
comment: This object property has been mapped
equivalent property: has key

logo
type: ObjectProperty
comment: This object property has been mapped
equivalent property: has logo

name
type: ObjectProperty
comment: This object property has been mapped
equivalent property: has name

nickname
type: DatatypeProperty
comment: The nick name associated with the object
range: string

photo
type: ObjectProperty
comment: This object property has been mapped
equivalent property: has photo

sound
type: ObjectProperty
comment: This object property has been mapped
equivalent property: has sound

telephone
type: ObjectProperty
comment: This object property has been mapped
equivalent property: has telephone

url
type: ObjectProperty
comment: This object property has been mapped
equivalent property: has url

Location
type: Class
comment: An object representing a named geographical place
subclass of: Kind
disjoint with: Organization

additional name
type: DatatypeProperty
comment: The additional name associated with the object
range: string

country name
type: DatatypeProperty
comment: The country name associated with the address of the object
range: string

family name
type: DatatypeProperty
comment: The family name associated with the object
range: string

given name
type: DatatypeProperty
comment: The given name associated with the object
range: string

has member
type: ObjectProperty
comment: To include a member in the group this object represents. (This property can only be used by Group individuals)
domain: Group
range: Kind

honorific prefix
type: DatatypeProperty
comment: The honorific prefix of the name associated with the object
range: string

honorific suffix
type: DatatypeProperty
comment: The honorific suffix of the name associated with the object
range: string

locality
type: DatatypeProperty
comment: The locality (e.g. city or town) associated with the address of the object
range: string

organization name
type: DatatypeProperty
comment: To specify the organizational name associated with the object
range: string

postal code
type: DatatypeProperty
comment: The postal code associated with the address of the object
range: string

region
type: DatatypeProperty
comment: The region (e.g. state or province) associated with the address of the object
range: string

street address
type: DatatypeProperty
comment: The street address associated with the address of the object
range: string

Organization
type: Class
comment: An object representing an organization. An organization is a single entity, and might represent a business or government, a department or division within a business or government, a club, an association, or the like.
subclass of: Kind

Gender
type: Class
comment: Used for gender codes. The URI of the gender code must be used as the value for Gender.

Kind
type: Class
comment: The parent class for all objects
equivalent class: http://lodlaundromat.org/.well-known/genid/samples/pellet///predicate//cc98ae2fdc077a702dfaa1db77c8ffdf/c4d8df83849b9a17565dd1ee18d3aa39#75
equivalent class: VCard

http://lodlaundromat.org/.well-known/genid/samples/pellet///predicate//cc98ae2fdc077a702dfaa1db77c8ffdf/c4d8df83849b9a17565dd1ee18d3aa39#75
type: Restriction
min qualified cardinality: 1
on data range: string
on property: formatted name

Type
type: Class
comment: Used for type codes. The URI of the type code must be used as the value for Type.

Phone
type: Class
comment: Used for telephone type codes. The URI of the telephone type code must be used as the value for the Telephone Type.

Relation Type
type: Class
comment: Used for relation type codes. The URI of the relation type code must be used as the value for the Relation Type.

Ontology for vCard
type: Ontology
comment: Ontology for vCard based on RFC6350
version info: Final