v2.1
creator: pierre-yves-vandenbussche
embodiment: voaf v2.1.rdf
date: 2012-10-15
type: Expression
type: Thing
version info: 2.1
comment: Added desrciption of queries used to infer a particular VOAF relation between two vocabularies
comment: Ajout des requêtes pour générer des relations VOAF entre deux vocabulaires @fr

Time Ordinal Era or Interval
type: Class
subclass of: http://lodlaundromat.org/.well-known/genid/samples/pellet///class//cc6bcd54f984ce1335a720fa5f509321/d8234c3b1439a879aea940e9009663be#1
disjoint with: Collection
disjoint with: Hierarchical Time Ordinal Reference System
subclass of: Concept
subclass of: Thing
disjoint with: Nothing
type: Thing
disjoint with: Ordered Collection
subclass of: Edge
subclass of: OrdinalEra
disjoint with: Concept Scheme
subclass of: http://lodlaundromat.org/.well-known/genid/cc6bcd54f984ce1335a720fa5f509321#1
subclass of: http://lodlaundromat.org/.well-known/genid/cc6bcd54f984ce1335a720fa5f509321#2

has close match
sub property of: is in mapping relation with
type: SymmetricProperty
property disjoint with: is in scheme
sub property of: topObjectProperty
property disjoint with: system
property disjoint with: is top concept in scheme
sub property of: is in semantic relation with
property disjoint with: has member
property disjoint with: temporal reference system component
type: ObjectProperty
property disjoint with: reference point in timescale
property disjoint with: bottomObjectProperty
property disjoint with: has member list
property disjoint with: has top concept
definition: skos:closeMatch is used to link two concepts that are sufficiently similar that they can be used interchangeably in some information retrieval applications. In order to avoid the possibility of "compound errors" when combining mappings across more than two concept schemes, skos:closeMatch is not declared to be a transitive property.
type: Property

SKOS Vocabulary
contributor: Participants in W3C's Semantic Web Deployment Working Group.
contributor: Nikki Rogers
contributor: Dave Beckett
description: An RDF vocabulary for describing the basic structure and content of concept schemes such as thesauri, classification schemes, subject heading lists, taxonomies, 'folksonomies', other types of controlled vocabulary, and also concept schemes embedded in glossaries and terminologies.
type: Thing
type: Ontology
creator: Alistair Miles
creator: Sean Bechhofer

number of properties
term status: stable
type: DatatypeProperty
description: PREFIX rdf:<http://www.w3.org/1999/02/22-rdf-syntax-ns#> PREFIX rdfs:<http://www.w3.org/2000/01/rdf-schema#> PREFIX owl:<http://www.w3.org/2002/07/owl#> PREFIX voaf:<http://purl.org/vocommons/voaf#> CONSTRUCT{ ?vocab voaf:propertyNumber ?nbProp } WHERE{ SELECT (COUNT(distinct ?prop) AS ?nbProp) ?vocab WHERE{ {?prop a rdf:Property.} UNION{?prop a owl:ObjectProperty.} UNION{?prop a owl:DatatypeProperty.} UNION{?prop a owl:AnnotationProperty.} UNION{?prop a owl:FunctionalProperty.} UNION{?prop a owl:OntologyProperty.} UNION{?prop a owl:AsymmetricProperty.} UNION{?prop a owl:InverseFunctionalProperty.} UNION{?prop a owl:IrreflexiveProperty.} UNION{?prop a owl:ReflexiveProperty.} UNION{?prop a owl:SymmetricProperty.} UNION{?prop a owl:TransitiveProperty.} ?prop a ?type. FILTER(?type!=owl:DeprecatedProperty) ?prop rdfs:isDefinedBy ?vocab. ?vocab a voaf:Vocabulary. }GROUP BY ?vocab }
property disjoint with: bottomDataProperty
sub property of: topDataProperty
type: Thing
property disjoint with: uncertainty in temporal position
comment: The number of properties defined in the vocabulary namespace. Properties imported from other namespaces are not taken into account.
domain: Vocabulary
comment: Le nombre de propriétés définies dans l'espace de noms du Vocabulaire. Les propriétés importées d'autres vocabulaires ne sont pas comptabilisées. @fr
range: integer
label: nombre de propriétés @fr

has related
property disjoint with: reference point in timescale
property disjoint with: has member list
property disjoint with: has top concept
sub property of: topObjectProperty
sub property of: is in semantic relation with
property disjoint with: bottomObjectProperty
property disjoint with: temporal reference system component
property disjoint with: is in scheme
type: ObjectProperty
property disjoint with: has member
type: SymmetricProperty
property disjoint with: is top concept in scheme
property disjoint with: system
definition: Relates a concept to a concept with which there is an associative semantic relationship.
comment: skos:related is disjoint with skos:broaderTransitive
type: Property

has top concept
property disjoint with: has member
property disjoint with: is in mapping relation with
property disjoint with: has member list
type: ObjectProperty
property disjoint with: has close match
property disjoint with: era beginning
property disjoint with: has broader
property disjoint with: has narrower match
property disjoint with: has narrower transitive
property disjoint with: has related
property disjoint with: has exact match
property disjoint with: previous era
property disjoint with: is top concept in scheme
property disjoint with: era member / sub-era
property disjoint with: era end
property disjoint with: has narrower
inverse of: is top concept in scheme
property disjoint with: next era
property disjoint with: has related match
property disjoint with: bottomObjectProperty
property disjoint with: is in scheme
sub property of: topObjectProperty
property disjoint with: is in semantic relation with
property disjoint with: system
property disjoint with: has broader transitive
property disjoint with: has broader match
definition: Relates, by convention, a concept scheme to a concept which is topmost in the broader/narrower concept hierarchies for that scheme, providing an entry point to these hierarchies.
domain: Concept Scheme
range: Concept
type: Property

Ordered Collection
subclass of: Collection
disjoint with: Concept Scheme
disjoint with: Time Ordinal Era or Interval
disjoint with: Hierarchical Time Ordinal Reference System
disjoint with: Concept
type: Class
subclass of: http://lodlaundromat.org/.well-known/genid/samples/pellet///class//cc6bcd54f984ce1335a720fa5f509321/d8234c3b1439a879aea940e9009663be#1
disjoint with: Nothing
disjoint with: Time Ordinal Era Boundary
subclass of: Thing
definition: An ordered collection of concepts, where both the grouping and the ordering are meaningful.
scope note: Ordered collections can be used where you would like a set of concepts to be displayed in a specific order, and optionally under a 'node label'.

generalizes
term status: stable
sub property of: vocabulary
property disjoint with: bottomObjectProperty
type: Thing
sub property of: topObjectProperty
sub property of: references
type: ObjectProperty
sub property of: relies on
description: PREFIX rdf:<http://www.w3.org/1999/02/22-rdf-syntax-ns#> PREFIX rdfs:<http://www.w3.org/2000/01/rdf-schema#> PREFIX owl:<http://www.w3.org/2002/07/owl#> PREFIX voaf:<http://purl.org/vocommons/voaf#> PREFIX skos:<http://www.w3.org/2004/02/skos/core#> CONSTRUCT{ ?vocab1 voaf:generalizes ?vocab2 } WHERE{ {?elem1 skos:narrowMatch ?elem2. FILTER(!isBlank(?elem2))} UNION{?elem2 rdfs:subPropertyOf ?elem1.} UNION{?elem1 a owl:Class. ?elem1 owl:unionOf ?union. ?union rdf:first ?elem2.} UNION{?elem1 a owl:Class. ?elem1 owl:unionOf ?union. ?union rdf:rest ?union2. ?union2 rdf:first ?elem2.} UNION{?elem1 a owl:Class. ?elem1 owl:unionOf ?union. ?union rdf:rest ?union2. ?union2 rdf:rest ?union3. ?union3 rdf:first ?elem2.} UNION{?elem1 a owl:Class. ?elem1 owl:unionOf ?union. ?union rdf:rest ?union2. ?union2 rdf:rest ?union3. ?union3 rdf:rest ?union4. ?union4 rdf:first ?elem2.} UNION{?elem1 a owl:Class. ?elem1 owl:unionOf ?union. ?union rdf:rest ?union2. ?union2 rdf:rest ?union3. ?union3 rdf:rest ?union4. ?union4 rdf:rest ?union5. ?union5 rdf:first ?elem2.} FILTER(!isBlank(?elem2)) ?elem1 rdfs:isDefinedBy ?vocab1. ?vocab1 a voaf:Vocabulary. ?elem2 rdfs:isDefinedBy ?vocab2. ?vocab2 a voaf:Vocabulary. FILTER(?vocab1!=?vocab2) }
comment: Indicates that the subject vocabulary generalizes by some superclasses or superproperties the object vocabulary.
label: généralise @fr
range: Vocabulary
comment: Indique que le vocabulaire sujet définit des super-classes ou super-propriétés du vocabulaire objet @fr
domain: Vocabulary

has exact match
sub property of: is in mapping relation with
sub property of: has close match
property disjoint with: bottomObjectProperty
sub property of: topObjectProperty
property disjoint with: is in scheme
property disjoint with: reference point in timescale
property disjoint with: is top concept in scheme
property disjoint with: system
property disjoint with: has member list
property disjoint with: has member
property disjoint with: temporal reference system component
type: SymmetricProperty
sub property of: is in semantic relation with
property disjoint with: has top concept
type: ObjectProperty
type: TransitiveProperty
definition: skos:exactMatch is used to link two concepts, indicating a high degree of confidence that the concepts can be used interchangeably across a wide range of information retrieval applications. skos:exactMatch is a transitive property, and is a sub-property of skos:closeMatch.
comment: skos:exactMatch is disjoint with each of the properties skos:broadMatch and skos:relatedMatch.
type: Property

reused by datasets
term status: testing
type: Thing
sub property of: topDataProperty
property disjoint with: uncertainty in temporal position
property disjoint with: bottomDataProperty
type: DatatypeProperty
label: réutilisé par des jeux de données @fr
comment: Distinct number of datasets reusing a resource.
comment: Nombre distinct de jeux de données reutilisant une resource. @fr
range: integer

has broader transitive
property disjoint with: system
property disjoint with: temporal reference system component
sub property of: is in semantic relation with
type: ObjectProperty
property disjoint with: is in scheme
property disjoint with: has top concept
property disjoint with: is top concept in scheme
sub property of: topObjectProperty
type: TransitiveProperty
inverse of: has narrower transitive
property disjoint with: has member
property disjoint with: bottomObjectProperty
property disjoint with: has member list
property disjoint with: reference point in timescale
definition: skos:broaderTransitive is a transitive superproperty of skos:broader.
scope note: By convention, skos:broaderTransitive is not used to make assertions. Rather, the properties can be used to draw inferences about the transitive closure of the hierarchical relation, which is useful e.g. when implementing a simple query expansion algorithm in a search application.
type: Property

has narrower
sub property of: has narrower transitive
sub property of: is in semantic relation with
property disjoint with: is in scheme
property disjoint with: temporal reference system component
property disjoint with: system
property disjoint with: has member
property disjoint with: bottomObjectProperty
type: ObjectProperty
sub property of: topObjectProperty
property disjoint with: reference point in timescale
inverse of: has broader
property disjoint with: is top concept in scheme
property disjoint with: has member list
property disjoint with: has top concept
definition: Relates a concept to a concept that is more specific in meaning.
scope note: By convention, skos:broader is only used to assert an immediate (i.e. direct) hierarchical link between two conceptual resources.
comment: Narrower concepts are typically rendered as children in a concept hierarchy (tree).
type: Property

Hierarchical Time Ordinal Reference System
disjoint with: Collection
disjoint with: Time Ordinal Era Boundary
subclass of: OrdinalReferenceSystem
type: Thing
disjoint with: Time Ordinal Era or Interval
disjoint with: Concept
disjoint with: Nothing
subclass of: Thing
subclass of: TopologicalComplex
disjoint with: Ordered Collection
subclass of: Concept Scheme
disjoint with: http://lodlaundromat.org/.well-known/genid/samples/pellet///class//cc6bcd54f984ce1335a720fa5f509321/d8234c3b1439a879aea940e9009663be#1
type: Class
comment: A temporal ordinal reference system is a constrained temporal topological complex, in which the edges are called 'eras'. Each era may be subdivided into one set of eras of the next finer rank. This constraint is required to establish a mono-hierarchy, so that a set of temporal positions defined relative to the reference system may be uniquely ordered.
subclass of: http://lodlaundromat.org/.well-known/genid/cc6bcd54f984ce1335a720fa5f509321#10
subclass of: http://lodlaundromat.org/.well-known/genid/cc6bcd54f984ce1335a720fa5f509321#11

Collection
subclass of: http://lodlaundromat.org/.well-known/genid/samples/pellet///class//cc6bcd54f984ce1335a720fa5f509321/d8234c3b1439a879aea940e9009663be#1
disjoint with: Concept
subclass of: Thing
disjoint with: Nothing
disjoint with: Time Ordinal Era Boundary
type: Class
disjoint with: Time Ordinal Era or Interval
disjoint with: Concept Scheme
disjoint with: Hierarchical Time Ordinal Reference System
definition: A meaningful collection of concepts.
scope note: Labelled collections can be used where you would like a set of concepts to be displayed under a 'node label' in the hierarchy.

has equivalences with
description: PREFIX rdfs:<http://www.w3.org/2000/01/rdf-schema#> PREFIX owl:<http://www.w3.org/2002/07/owl#> PREFIX voaf:<http://purl.org/vocommons/voaf#> PREFIX skos:<http://www.w3.org/2004/02/skos/core#> CONSTRUCT{ ?vocab1 voaf:hasEquivalencesWith ?vocab2 } WHERE{ {?elem1 owl:equivalentProperty ?elem2.} UNION{?elem1 owl:sameAs ?elem2.} UNION{?elem1 owl:equivalentClass ?elem2.} UNION{?elem2 owl:equivalentProperty ?elem1.} UNION{?elem2 owl:equivalentClass ?elem1.} UNION{?elem1 skos:exactMatch ?elem2.} UNION{?elem2 skos:exactMatch ?elem1.} FILTER(!isBlank(?elem2)) ?elem1 rdfs:isDefinedBy ?vocab1. ?vocab1 a voaf:Vocabulary. ?elem2 rdfs:isDefinedBy ?vocab2. ?vocab2 a voaf:Vocabulary. FILTER(?vocab1!=?vocab2) }
sub property of: topObjectProperty
property disjoint with: bottomObjectProperty
type: ObjectProperty
sub property of: relies on
sub property of: vocabulary
term status: testing
sub property of: references
type: Thing
comment: Indique que le vocabulaire sujet déclare des équivalences de classes ou de propriétés avec le vocabulaire objet @fr
range: Vocabulary
domain: Vocabulary
label: a des équivalences avec @fr
comment: Indicates that the subject vocabulary declares some equivalent classes or properties with the object vocabulary.

Concept Scheme
disjoint with: Collection
subclass of: Thing
disjoint with: Time Ordinal Era or Interval
disjoint with: Concept
type: Class
disjoint with: Nothing
disjoint with: Time Ordinal Era Boundary
disjoint with: http://lodlaundromat.org/.well-known/genid/samples/pellet///class//cc6bcd54f984ce1335a720fa5f509321/d8234c3b1439a879aea940e9009663be#1
disjoint with: Ordered Collection
definition: A set of concepts, optionally including statements about semantic relationships between those concepts.
scope note: A concept scheme may be defined to include concepts from different sources.
example: Thesauri, classification schemes, subject heading lists, taxonomies, 'folksonomies', and other types of controlled vocabulary are all examples of concept schemes. Concept schemes are also embedded in glossaries and terminologies.

temporal reference system component
property disjoint with: has exact match
property disjoint with: system
sub property of: has top concept
property disjoint with: has broader transitive
property disjoint with: has narrower match
property disjoint with: has related match
sub property of: primitive
property disjoint with: has member
type: ObjectProperty
property disjoint with: has close match
property disjoint with: era end
property disjoint with: is in mapping relation with
property disjoint with: next era
property disjoint with: has related
property disjoint with: has narrower
property disjoint with: is in semantic relation with
property disjoint with: is in scheme
sub property of: topObjectProperty
property disjoint with: has broader
type: Thing
property disjoint with: has broader match
property disjoint with: has narrower transitive
property disjoint with: era member / sub-era
property disjoint with: has member list
property disjoint with: bottomObjectProperty
property disjoint with: is top concept in scheme
property disjoint with: previous era
property disjoint with: era beginning
sub property of: component
inverse of: system
domain: Hierarchical Time Ordinal Reference System
range: Time Ordinal Era or Interval

era member / sub-era
sub property of: has narrower transitive
property disjoint with: is in scheme
property disjoint with: system
type: ObjectProperty
sub property of: is in semantic relation with
property disjoint with: is top concept in scheme
sub property of: has narrower
type: Thing
property disjoint with: has top concept
property disjoint with: reference point in timescale
property disjoint with: has member
property disjoint with: bottomObjectProperty
sub property of: member
property disjoint with: has member list
property disjoint with: temporal reference system component
sub property of: topObjectProperty
domain: Time Ordinal Era or Interval
range: Time Ordinal Era or Interval

uncertainty in temporal position
property disjoint with: reused by vocabularies
property disjoint with: reused by datasets
property disjoint with: number of classes
property disjoint with: number of properties
property disjoint with: occurrences in datasets
sub property of: measure
property disjoint with: occurrences in vocabularies
type: Thing
property disjoint with: bottomDataProperty
type: DatatypeProperty
sub property of: topDataProperty
domain: TemporalPosition
range: Time

has broader match
property disjoint with: has member list
property disjoint with: is in scheme
property disjoint with: system
sub property of: is in semantic relation with
type: ObjectProperty
property disjoint with: bottomObjectProperty
sub property of: topObjectProperty
sub property of: has broader transitive
property disjoint with: has top concept
property disjoint with: temporal reference system component
property disjoint with: is top concept in scheme
sub property of: is in mapping relation with
inverse of: has narrower match
property disjoint with: has member
property disjoint with: reference point in timescale
sub property of: has broader
definition: skos:broadMatch is used to state a hierarchical mapping link between two conceptual resources in different concept schemes.
type: Property

has member
property disjoint with: has narrower transitive
property disjoint with: previous era
property disjoint with: has related match
property disjoint with: era member / sub-era
property disjoint with: has exact match
property disjoint with: is in mapping relation with
property disjoint with: next era
property disjoint with: is in semantic relation with
property disjoint with: era end
sub property of: topObjectProperty
property disjoint with: is top concept in scheme
property disjoint with: has related
property disjoint with: temporal reference system component
property disjoint with: system
property disjoint with: has broader match
property disjoint with: era beginning
type: ObjectProperty
property disjoint with: bottomObjectProperty
property disjoint with: has narrower match
property disjoint with: has broader transitive
property disjoint with: has broader
property disjoint with: has narrower
property disjoint with: has top concept
property disjoint with: is in scheme
property disjoint with: has close match
property disjoint with: reference point in timescale
definition: Relates a collection to one of its members.
domain: Collection
range: http://lodlaundromat.org/.well-known/genid/samples/pellet///class//cc6bcd54f984ce1335a720fa5f509321/d8234c3b1439a879aea940e9009663be#1
type: Property

Dataset occurrences
term status: testing
type: Thing
disjoint with: Nothing
subclass of: Thing
type: Class
label: Occurrences dans un jeu de données @fr
comment: Class used to store the number of occurences of a vocabulary in a particular dataset
comment: Classe utilisée pour stocker l'information d'occurences d'un vocabulaire dans un jeu de données @fr

similar
type: ObjectProperty
type: SymmetricProperty
property disjoint with: bottomObjectProperty
type: Thing
term status: testing
sub property of: topObjectProperty
label: similaire @fr
range: Vocabulary
domain: Vocabulary
comment: Used to assert that two vocabularies are similar in scope and objectives, independently of the fact that they otherwise refer to each other.
comment: Indique que deux vocabulaires sont similaires dans leur domaine et/ou leurs objectifs, sans être nécessairement reliés par des références. @fr

has narrower match
property disjoint with: has member
sub property of: has narrower
property disjoint with: bottomObjectProperty
property disjoint with: system
inverse of: has broader match
sub property of: has narrower transitive
sub property of: is in semantic relation with
sub property of: is in mapping relation with
type: ObjectProperty
property disjoint with: temporal reference system component
property disjoint with: is in scheme
property disjoint with: reference point in timescale
property disjoint with: is top concept in scheme
property disjoint with: has member list
property disjoint with: has top concept
sub property of: topObjectProperty
definition: skos:narrowMatch is used to state a hierarchical mapping link between two conceptual resources in different concept schemes.
type: Property

reused by vocabularies
term status: testing
type: Thing
sub property of: topDataProperty
property disjoint with: uncertainty in temporal position
property disjoint with: bottomDataProperty
type: DatatypeProperty
label: réutilisé par des vocabulaires @fr
comment: Distinct number of vocabularies reusing a resource.
comment: Nombre distinct de vocabulaires reutilisant une resource. @fr
range: integer

has narrower transitive
property disjoint with: temporal reference system component
sub property of: topObjectProperty
property disjoint with: has member
property disjoint with: has member list
type: TransitiveProperty
property disjoint with: is top concept in scheme
inverse of: has broader transitive
property disjoint with: system
property disjoint with: reference point in timescale
property disjoint with: has top concept
property disjoint with: is in scheme
property disjoint with: bottomObjectProperty
type: ObjectProperty
sub property of: is in semantic relation with
definition: skos:narrowerTransitive is a transitive superproperty of skos:narrower.
scope note: By convention, skos:narrowerTransitive is not used to make assertions. Rather, the properties can be used to draw inferences about the transitive closure of the hierarchical relation, which is useful e.g. when implementing a simple query expansion algorithm in a search application.
type: Property

Time Ordinal Era Boundary
disjoint with: Nothing
subclass of: Thing
subclass of: Node
disjoint with: Ordered Collection
type: Class
subclass of: http://lodlaundromat.org/.well-known/genid/cc6bcd54f984ce1335a720fa5f509321#3
disjoint with: Concept Scheme
disjoint with: Collection
type: Thing
subclass of: Concept
disjoint with: Hierarchical Time Ordinal Reference System
subclass of: http://lodlaundromat.org/.well-known/genid/samples/pellet///class//cc6bcd54f984ce1335a720fa5f509321/d8234c3b1439a879aea940e9009663be#1
subclass of: http://lodlaundromat.org/.well-known/genid/cc6bcd54f984ce1335a720fa5f509321#8
subclass of: http://lodlaundromat.org/.well-known/genid/cc6bcd54f984ce1335a720fa5f509321#9

Concept
disjoint with: Concept Scheme
disjoint with: Collection
subclass of: Thing
disjoint with: Nothing
disjoint with: Ordered Collection
disjoint with: Hierarchical Time Ordinal Reference System
type: Class
subclass of: http://lodlaundromat.org/.well-known/genid/samples/pellet///class//cc6bcd54f984ce1335a720fa5f509321/d8234c3b1439a879aea940e9009663be#1
definition: An idea or notion; a unit of thought.

number of classes
description: PREFIX rdfs:<http://www.w3.org/2000/01/rdf-schema#> PREFIX owl:<http://www.w3.org/2002/07/owl#> PREFIX voaf:<http://purl.org/vocommons/voaf#> CONSTRUCT{ ?vocab voaf:classNumber ?nbClass } WHERE{ SELECT (COUNT(distinct ?class) AS ?nbClass) ?vocab WHERE{ {?class a rdfs:Class.} UNION{?class a owl:Class.} ?class a ?type. FILTER(?type!=owl:DeprecatedClass) ?class rdfs:isDefinedBy ?vocab. ?vocab a voaf:Vocabulary. }GROUP BY ?vocab }
sub property of: topDataProperty
type: Thing
type: DatatypeProperty
property disjoint with: uncertainty in temporal position
property disjoint with: bottomDataProperty
term status: stable
comment: The number of classes defined in the vocabulary namespace. Classes imported from other namespaces are not taken into account.
label: nombre de classes @fr
comment: Le nombre de classes définies dans l'espace de noms du Vocabulaire. Les classes importées d'autres vocabulaires ne sont pas comptabilisées. @fr
domain: Vocabulary
range: integer

v2.2
creator: pierre-yves-vandenbussche
embodiment: voaf v2.2.rdf
date: 2013-04-24
type: Expression
type: Thing
version info: 2.2
comment: Added properties to represent metrics of vocabulary elements usage in LOV and LOD
comment: Ajout de propriétés pour représenter les métriques d'usage d'éléments de vocabulaire dans le LOV et le LOD @fr

system
property disjoint with: bottomObjectProperty
property disjoint with: is in mapping relation with
property disjoint with: has top concept
property disjoint with: has exact match
property disjoint with: has narrower transitive
inverse of: temporal reference system component
sub property of: topObjectProperty
property disjoint with: has broader match
property disjoint with: has related
property disjoint with: has member list
property disjoint with: has narrower
property disjoint with: era end
property disjoint with: temporal reference system component
property disjoint with: has broader transitive
type: ObjectProperty
property disjoint with: previous era
property disjoint with: has member
sub property of: complex
property disjoint with: era member / sub-era
property disjoint with: next era
property disjoint with: reference point in timescale
property disjoint with: has close match
property disjoint with: is in semantic relation with
property disjoint with: has related match
property disjoint with: has broader
type: Thing
sub property of: system
property disjoint with: era beginning
property disjoint with: has narrower match
sub property of: is top concept in scheme
sub property of: is in scheme
range: Hierarchical Time Ordinal Reference System
domain: Time Ordinal Era or Interval
comment: reference system that this era belongs to

in dataset
term status: testing
type: Thing
sub property of: topObjectProperty
property disjoint with: bottomObjectProperty
type: ObjectProperty
domain: Dataset occurrences
label: dans le jeu de données @fr
comment: dataset in which a vocabulary occurred
comment: jeu de données dans lequel un vocabulaire apparait @fr
range: Dataset

previous era
type: Thing
property disjoint with: is top concept in scheme
sub property of: previousEdge
type: ObjectProperty
property disjoint with: has top concept
property disjoint with: bottomObjectProperty
property disjoint with: is in scheme
property disjoint with: temporal reference system component
sub property of: is in semantic relation with
property disjoint with: has member
property disjoint with: has member list
property disjoint with: reference point in timescale
sub property of: topObjectProperty
property disjoint with: system
inverse of: era end
domain: Time Ordinal Era Boundary
range: Time Ordinal Era or Interval

has disjunctions with
sub property of: relies on
sub property of: vocabulary
type: ObjectProperty
sub property of: references
sub property of: topObjectProperty
property disjoint with: bottomObjectProperty
description: PREFIX rdfs:<http://www.w3.org/2000/01/rdf-schema#> PREFIX owl:<http://www.w3.org/2002/07/owl#> PREFIX voaf:<http://purl.org/vocommons/voaf#> CONSTRUCT{ ?vocab1 voaf:hasDisjunctionsWith ?vocab2 } WHERE{ ?elem1 owl:disjointWith ?elem2. FILTER(!isBlank(?elem2)) ?elem1 rdfs:isDefinedBy ?vocab1. ?vocab1 a voaf:Vocabulary. ?elem2 rdfs:isDefinedBy ?vocab2. ?vocab2 a voaf:Vocabulary. FILTER(?vocab1!=?vocab2) }
term status: testing
type: Thing
comment: Indicates that the subject vocabulary contains some declaration of disjoint classes with the object vocabulary.
label: a des disjonctions avec @fr
domain: Vocabulary
range: Vocabulary
comment: Indique que le vocabulaire sujet contient des déclarations de classes disjointes avec le vocabulaire objet @fr

extends
sub property of: vocabulary
type: Thing
term status: stable
property disjoint with: bottomObjectProperty
type: ObjectProperty
sub property of: references
description: PREFIX rdfs:<http://www.w3.org/2000/01/rdf-schema#> PREFIX owl:<http://www.w3.org/2002/07/owl#> PREFIX voaf:<http://purl.org/vocommons/voaf#> CONSTRUCT{ ?vocab1 voaf:extends ?vocab2 } WHERE{ {?elem1 owl:inverseOf ?elem2. FILTER(!isBlank(?elem2))} UNION{?elem1 rdfs:domain ?elem2. FILTER(!isBlank(?elem2))} UNION{?elem1 rdfs:range ?elem2. FILTER(!isBlank(?elem2))} UNION{?elem2 rdfs:domain ?elem1. FILTER(!isBlank(?elem1))} UNION{?elem2 rdfs:range ?elem1. FILTER(!isBlank(?elem1))} ?elem1 rdfs:isDefinedBy ?vocab1. ?vocab1 a voaf:Vocabulary. ?elem2 rdfs:isDefinedBy ?vocab2. ?vocab2 a voaf:Vocabulary. FILTER(?vocab1!=?vocab2) }
sub property of: topObjectProperty
sub property of: relies on
domain: Vocabulary
label: étend @fr
range: Vocabulary
comment: Indique que le vocabulaire sujet étend l'expressivité du vocabulaire objet en déclarant des relations de subsomption avec ce dernier, ou en utilisant ses classes comme domaine ou co-domaine d'un propriété du vocabulaire sujet, ou en définissant des contraintes locales etc. @fr
comment: Indicates that the subject vocabulary extends the expressivity of the object vocabulary by declaring subsumption relationships, using object vocabulary class as domain or range of a subject vocabulary property, defining local restrictions etc..

Vocabulary of a Friend
modified: 2013-05-24
realization: v1.0
type: Work
preferred namespace prefix: voaf
license: http://creativecommons.org/licenses/by/3.0/
example dataset: lov.rdf
realization: v2.0
preferred namespace uri: http://purl.org/vocommons/voaf#
realization: v2.2
type: Vocabulary
type: Thing
description: A vocabulary to describe linked data vocabularies and their relations.
creator: bernard-vatant
issued: 2011-03-11
publisher: Open Knowledge Foundation
description: Un vocabulaire de description des vocabulaires RDF et de leurs relations mutuelles @fr
title: Vocabulaire d'un ami @fr
realization: v2.1
realization: v1.1
type: Dataset
realization: v2.3
type: Ontology
contributor: lise-rozat
contributor: pierre-yves-vandenbussche

metadata vocabulary
type: Thing
description: PREFIX rdfs:<http://www.w3.org/2000/01/rdf-schema#> PREFIX owl:<http://www.w3.org/2002/07/owl#> PREFIX voaf:<http://purl.org/vocommons/voaf#> CONSTRUCT{ ?vocab1 voaf:metadataVoc ?vocab2 } WHERE{ ?elem1 ?elem2 ?o. ?elem1 rdfs:isDefinedBy ?vocab1. ?vocab1 a voaf:Vocabulary. ?elem2 rdfs:isDefinedBy ?vocab2. ?vocab2 a voaf:Vocabulary. FILTER(?vocab1!=?vocab2) }
sub property of: relies on
term status: stable
property disjoint with: bottomObjectProperty
type: ObjectProperty
sub property of: references
sub property of: topObjectProperty
sub property of: vocabulary
range: Vocabulary
domain: Vocabulary
label: vocabulaire de métadonnées @fr
comment: Indique que le vocabulaire sujet utilise le vocabulaire objet pour décrire ses métadonnées, au niveau global du vocabulaire ou au niveau des éléments @fr
comment: Indicates that the subject vocabulary uses the object vocabulary in metadata at global vocabulary level or at element level

used by
sub property of: dataset
term status: stable
property disjoint with: bottomObjectProperty
type: ObjectProperty
sub property of: topObjectProperty
type: Thing
inverse of: relies on
range: Vocabulary
label: utilisé par @fr
domain: Vocabulary
comment: Indicates that the subject vocabulary is used by the object vocabulary
comment: Indique que le vocabulaire sujet est utilisé par le vocabulaire objet @fr

example dataset
term status: deprecated
is replaced by: dataset
type: Thing
sub property of: topObjectProperty
property disjoint with: bottomObjectProperty
type: ObjectProperty
label: exemple de jeu de données @fr
comment: Deprecated since v1.1
comment: Déprécié depuis la v1.1 @fr

usage in dataset
term status: testing
type: Thing
sub property of: topObjectProperty
property disjoint with: bottomObjectProperty
type: ObjectProperty
domain: Vocabulary
label: utilisation dans un jeu de données @fr
comment: usage statistics in a dataset
comment: statistiques d'utilisation dans un jeu de données @fr
range: Dataset occurrences

to-do list
term status: stable
type: Thing
sub property of: topObjectProperty
property disjoint with: bottomObjectProperty
type: ObjectProperty
label: liste des choses à faire @fr
comment: Describes future tasks planned by a resource curator. This property is primarily intended to be used for vocabularies or datasets, but the domain is left open, it can be used for any resource. Use iCalendar Vtodo class and its properties to further describe the task calendar, priorities etc.
comment: Liste des tâches prévues par le gestionnaire d'une ressource. Cette propriété est destinée à l'usage des gestionnaires de vocabulaires ou de jeu de données mais son doamine est ouvert, elle peut être utilisée pour n'importe quelle ressource. Utiliser la classe ical:Vtodo pour une description fine des tâches : calendrier, priorités etc @fr
range: Vtodo

occurrences in vocabularies
term status: testing
type: Thing
sub property of: topDataProperty
property disjoint with: uncertainty in temporal position
property disjoint with: bottomDataProperty
type: DatatypeProperty
label: occurences dans des vocabulaires @fr
comment: Number of vocabularies using a resource
comment: Nombre de vocabulaires utilisant une ressource. @fr
range: integer

is in scheme
property disjoint with: has close match
property disjoint with: is in semantic relation with
property disjoint with: has member
property disjoint with: has top concept
property disjoint with: era beginning
property disjoint with: has exact match
property disjoint with: reference point in timescale
property disjoint with: bottomObjectProperty
type: ObjectProperty
property disjoint with: has narrower
property disjoint with: era member / sub-era
property disjoint with: has narrower match
property disjoint with: has broader
property disjoint with: has narrower transitive
property disjoint with: has broader match
property disjoint with: has related
property disjoint with: has related match
property disjoint with: temporal reference system component
property disjoint with: era end
property disjoint with: is in mapping relation with
property disjoint with: previous era
property disjoint with: has broader transitive
sub property of: topObjectProperty
property disjoint with: next era
definition: Relates a resource (for example a concept) to a concept scheme in which it is included.
scope note: A concept may be a member of more than one concept scheme.
range: Concept Scheme
type: Property

era end
property disjoint with: has member list
property disjoint with: temporal reference system component
sub property of: end
sub property of: is in semantic relation with
type: ObjectProperty
property disjoint with: has top concept
property disjoint with: has member
sub property of: topObjectProperty
property disjoint with: is top concept in scheme
property disjoint with: bottomObjectProperty
type: Thing
property disjoint with: is in scheme
inverse of: previous era
property disjoint with: system
property disjoint with: reference point in timescale
domain: Time Ordinal Era or Interval
range: Time Ordinal Era Boundary

v1.0
embodiment: voaf v1.0.rdf
date: 2011-03-11
type: Expression
type: Thing
version info: 1.0
comment: First published version
comment: Première publication @fr

relies on
type: ObjectProperty
sub property of: topObjectProperty
sub property of: vocabulary
property disjoint with: bottomObjectProperty
inverse of: used by
type: Thing
term status: stable
sub property of: references
label: réutilise @fr
domain: Vocabulary
range: Vocabulary
comment: Indique que le vocabulaire sujet utilise ou étend au moins une classe ou propriété du vocabulaire objet @fr
comment: Indicates that the subject vocabulary uses or extends some class or property of the object vocabulary

v2.0
creator: bernard-vatant
embodiment: voaf v2.0.rdf
date: 2012-07-03
type: Expression
type: Thing
version info: 2.0
comment: Namespace moved to purl. Introduction of versions using FRBR. voaf:Vocabulary rdfs:subClassOf frbr:Work. Added labels and comments in French
comment: Namespace migré sous purl. Introduction des versions avec FRBR. voaf:Vocabulary rdfs:subClassOf frbr:Work. Ajout des traductions françaises @fr

specializes
sub property of: references
description: PREFIX rdfs:<http://www.w3.org/2000/01/rdf-schema#> PREFIX voaf:<http://purl.org/vocommons/voaf#> PREFIX skos:<http://www.w3.org/2004/02/skos/core#> CONSTRUCT{ ?vocab1 voaf:specializes ?vocab2 } WHERE{ {?elem1 rdfs:subPropertyOf ?elem2. FILTER(!isBlank(?elem2))} UNION{?elem1 rdfs:subClassOf ?elem2. FILTER(!isBlank(?elem2))} UNION{?elem1 skos:broadMatch ?elem2. FILTER(!isBlank(?elem2))} ?elem1 rdfs:isDefinedBy ?vocab1. ?vocab1 a voaf:Vocabulary. ?elem2 rdfs:isDefinedBy ?vocab2. ?vocab2 a voaf:Vocabulary. FILTER(?vocab1!=?vocab2) }
sub property of: vocabulary
type: Thing
sub property of: topObjectProperty
property disjoint with: bottomObjectProperty
sub property of: relies on
type: ObjectProperty
term status: stable
comment: Indicates that the subject vocabulary defines some subclasses or subproperties of the object vocabulary, or local restrictions on those.
comment: Indique que le vocabulaire sujet définit des sous-classes ou sous-propriétés du vocabulaire objet @fr
label: spécialise @fr
range: Vocabulary
domain: Vocabulary

era beginning
inverse of: next era
type: Thing
sub property of: begin
type: ObjectProperty
property disjoint with: reference point in timescale
sub property of: topObjectProperty
property disjoint with: has member list
property disjoint with: is top concept in scheme
property disjoint with: has top concept
property disjoint with: temporal reference system component
sub property of: is in semantic relation with
property disjoint with: bottomObjectProperty
property disjoint with: is in scheme
property disjoint with: system
property disjoint with: has member
comment: era or interval beginning or start
domain: Time Ordinal Era or Interval
range: Time Ordinal Era Boundary

next era
property disjoint with: has member list
property disjoint with: reference point in timescale
property disjoint with: has top concept
property disjoint with: system
type: ObjectProperty
sub property of: topObjectProperty
property disjoint with: temporal reference system component
sub property of: is in semantic relation with
property disjoint with: is top concept in scheme
type: Thing
inverse of: era beginning
property disjoint with: has member
property disjoint with: is in scheme
property disjoint with: bottomObjectProperty
sub property of: nextEdge
domain: Time Ordinal Era Boundary
range: Time Ordinal Era or Interval

Temporal Hierarchical Ordinal Reference System model
has part: previous era
preferred namespace prefix: thors
stylesheet: extra.css
has part: uncertainty in temporal position
has part: next era
has part: era member / sub-era
has part: era end
type: Vocabulary
description: An OWL representation of the model for Temporal Ordinal Reference Systems defined in GeoSciML v3.
creator: Simon Jonathan David COX, CSIRO Australia
has part: system
has part: uom
has part: Hierarchical Time Ordinal Reference System
type: Thing
type: Dataset
has part: temporal reference system component
created: 2011-01-01
has part: Time Ordinal Era or Interval
stylesheet: Primer.css
modified: 2013-11-14
date: 2012-01-19
has part: Time Ordinal Era Boundary
license: http://creativecommons.org/licenses/by/3.0/
stylesheet: owl.css
has part: era beginning
source: Simon J.D. Cox and Stephen M. Richard, A formal model for the geologic time scale and global stratotype section and point, compatible with geospatial information transfer standards, Geosphere, 1, 119-137 (2005)
type: Work
has part: reference point in timescale
stylesheet: rec.css
rights: Copyright © 2012-2013 CSIRO, AzGS
imports: temporal
version IRI: thors.rdf
preferred namespace uri: http://resource.geosciml.org/ontology/timescale/thors#
comment: This model is related to the model for TORS in ISO 19108:2002, except that boundaries between eras are first class objects, supporting multiple properties, rather than being just time coordinates. It is also linked to the ISO 19108 Temporal Topology model.
type: Ontology
prior version: gtrs-30.rdf

notation
sub property of: topDataProperty
property disjoint with: bottomDataProperty
type: DatatypeProperty
definition: A notation, also known as classification code, is a string of characters such as "T58.5" or "303.4833" used to uniquely identify a concept within the scope of a given concept scheme.
scope note: By convention, skos:notation is used with a typed literal in the object position of the triple.
type: Property

dataset
is replaced by: Dataset occurrences
property disjoint with: bottomObjectProperty
type: ObjectProperty
sub property of: topObjectProperty
inverse of: vocabulary
type: Thing
term status: deprecated
range: Dataset
comment: Déprécié depuis la v2.4 @fr
domain: Vocabulary
label: jeu de données @fr
comment: Deprecated since v2.4

reference point in timescale
property disjoint with: has narrower
property disjoint with: has member list
sub property of: has top concept
type: ObjectProperty
property disjoint with: has related
property disjoint with: has related match
property disjoint with: is in semantic relation with
property disjoint with: is in mapping relation with
property disjoint with: next era
property disjoint with: era end
property disjoint with: has broader
property disjoint with: has member
sub property of: primitive
property disjoint with: is in scheme
property disjoint with: era member / sub-era
property disjoint with: bottomObjectProperty
property disjoint with: has close match
property disjoint with: system
type: Thing
property disjoint with: has narrower match
sub property of: topObjectProperty
property disjoint with: has narrower transitive
property disjoint with: previous era
property disjoint with: era beginning
property disjoint with: has broader transitive
property disjoint with: has broader match
property disjoint with: is top concept in scheme
property disjoint with: has exact match
domain: Hierarchical Time Ordinal Reference System
range: Time Ordinal Era Boundary

v2.3
creator: pierre-yves-vandenbussche
embodiment: voaf v2.3.rdf
date: 2013-05-24
type: Expression
type: Thing
version info: 2.3
comment: Refined the voaf:dataset to a more complex element with occurrences information and added extra properties to represent metrics of vocabulary elements usage in LOV and LOD
comment: Remplacement de voaf:dataset par un objet permettant d'attacher la notion d'occurrenceet ajout supplémentaire de propriétés pour représenter les métriques d'usage d'éléments de vocabulaire dans le LOV et le LOD @fr

is in semantic relation with
property disjoint with: bottomObjectProperty
property disjoint with: has member list
property disjoint with: has member
sub property of: topObjectProperty
property disjoint with: reference point in timescale
property disjoint with: is in scheme
property disjoint with: temporal reference system component
type: ObjectProperty
property disjoint with: has top concept
property disjoint with: is top concept in scheme
property disjoint with: system
definition: Links a concept to a concept related by meaning.
scope note: This property should not be used directly, but as a super-property for all properties denoting a relationship of meaning between concepts.
domain: Concept
range: Concept
type: Property

occurrences in datasets
term status: testing
type: Thing
sub property of: topDataProperty
property disjoint with: uncertainty in temporal position
property disjoint with: bottomDataProperty
type: DatatypeProperty
label: occurences dans des datasets @fr
comment: Number of datasets using a resource.
comment: Nombre de jeux de données utilisant une ressource. @fr
range: integer

has member list
type: ObjectProperty
property disjoint with: has broader transitive
property disjoint with: is in semantic relation with
property disjoint with: era beginning
property disjoint with: next era
property disjoint with: previous era
property disjoint with: reference point in timescale
property disjoint with: era end
property disjoint with: temporal reference system component
property disjoint with: has related match
property disjoint with: has broader
property disjoint with: has narrower match
property disjoint with: has narrower
property disjoint with: has exact match
property disjoint with: has top concept
property disjoint with: has close match
property disjoint with: is top concept in scheme
property disjoint with: era member / sub-era
property disjoint with: system
property disjoint with: is in mapping relation with
sub property of: topObjectProperty
property disjoint with: has narrower transitive
property disjoint with: has related
property disjoint with: has broader match
property disjoint with: bottomObjectProperty
type: FunctionalProperty
definition: Relates an ordered collection to the RDF list containing its members.
domain: Ordered Collection
range: List
comment: For any resource, every item in the list given as the value of the skos:memberList property is also a value of the skos:member property.
type: Property

Vocabulary
subclass of: Work
type: Thing
term status: stable
subclass of: Dataset
subclass of: Thing
type: Class
disjoint with: Nothing
label: Vocabulaire @fr
union of: http://lodlaundromat.org/.well-known/genid/samples/pellet///class//cc6bcd54f984ce1335a720fa5f509321/08f918ba28f018796137367d7b0b9764#1
comment: A vocabulary used in the linked data cloud. An instance of voaf:Vocabulary relies on or is used by at least another instance of voaf:Vocabulary
comment: Un vocabulaire utilisé ou utilisable dans le Web des données. Une instance de voaf:Vocabulary s'appuie at/ou est utilisée par au moins une autre instance of voaf:Vocabulary @fr

occurrences
term status: testing
type: Thing
sub property of: topObjectProperty
property disjoint with: bottomObjectProperty
type: ObjectProperty
domain: Dataset occurrences
comment: Number of occurrences of a vocabulary in a dataset
comment: nombre d'occurrences d'un vocabulaire dans un dataset @fr
range: integer

is top concept in scheme
type: ObjectProperty
property disjoint with: has narrower transitive
property disjoint with: era member / sub-era
property disjoint with: has broader transitive
property disjoint with: has top concept
sub property of: topObjectProperty
property disjoint with: has exact match
property disjoint with: temporal reference system component
property disjoint with: previous era
property disjoint with: has broader match
sub property of: is in scheme
property disjoint with: era beginning
property disjoint with: is in mapping relation with
property disjoint with: is in semantic relation with
property disjoint with: has member
property disjoint with: era end
property disjoint with: reference point in timescale
property disjoint with: next era
property disjoint with: has member list
property disjoint with: has narrower match
property disjoint with: has broader
inverse of: has top concept
property disjoint with: has close match
property disjoint with: has narrower
property disjoint with: has related match
property disjoint with: has related
property disjoint with: bottomObjectProperty
definition: Relates a concept to the concept scheme that it is a top level concept of.
type: Property
domain: Concept
range: Concept Scheme

has related match
type: SymmetricProperty
sub property of: is in semantic relation with
property disjoint with: system
type: ObjectProperty
property disjoint with: reference point in timescale
sub property of: topObjectProperty
property disjoint with: has member list
sub property of: is in mapping relation with
property disjoint with: has top concept
property disjoint with: is top concept in scheme
property disjoint with: has member
sub property of: has related
property disjoint with: bottomObjectProperty
property disjoint with: is in scheme
property disjoint with: temporal reference system component
definition: skos:relatedMatch is used to state an associative mapping link between two conceptual resources in different concept schemes.
type: Property

has broader
property disjoint with: is in scheme
type: ObjectProperty
sub property of: topObjectProperty
property disjoint with: is top concept in scheme
property disjoint with: temporal reference system component
property disjoint with: bottomObjectProperty
sub property of: has broader transitive
property disjoint with: has member
property disjoint with: system
sub property of: is in semantic relation with
property disjoint with: has top concept
property disjoint with: reference point in timescale
property disjoint with: has member list
inverse of: has narrower
definition: Relates a concept to a concept that is more general in meaning.
comment: Broader concepts are typically rendered as parents in a concept hierarchy (tree).
scope note: By convention, skos:broader is only used to assert an immediate (i.e. direct) hierarchical link between two conceptual resources.
type: Property

Vocabulary Space
term status: testing
type: Thing
disjoint with: Nothing
subclass of: Thing
type: Class
label: Espace de vocabulaires @fr
comment: A vocabulary space defines any relevant grouping of vocabularies e.g., designed for similar purposes or domains, or designed by the same publisher or the same project, etc. A vocabulary can belong to zero, one or more vocabulary spaces.Dublin Core properties isPartOf and hasPart are used to link a vocabulary to a vocabulary space.
comment: Un Espace de vocabulaires définit un regroupement pertinent de vocabulaires, par exemple construits pour des domaines ou objectifs similaires, ou par le même déditeur ou le même projet, etc. Un Vocabulaire peut appartenir à zéro, un ou plusieurs Espace de vocabulaires. Les propriétés Dublin Core isPartOf et hasPart sont utilisées pour relier un Vocabulaire à un Espace de vocabulaires. @fr

is in mapping relation with
property disjoint with: is in scheme
property disjoint with: reference point in timescale
type: ObjectProperty
property disjoint with: temporal reference system component
property disjoint with: has top concept
property disjoint with: bottomObjectProperty
property disjoint with: has member list
sub property of: topObjectProperty
sub property of: is in semantic relation with
property disjoint with: system
property disjoint with: has member
property disjoint with: is top concept in scheme
definition: Relates two concepts coming, by convention, from different schemes, and that have comparable meanings
comment: These concept mapping relations mirror semantic relations, and the data model defined below is similar (with the exception of skos:exactMatch) to the data model defined for semantic relations. A distinct vocabulary is provided for concept mapping relations, to provide a convenient way to differentiate links within a concept scheme from links between concept schemes. However, this pattern of usage is not a formal requirement of the SKOS data model, and relies on informal definitions of best practice.
type: Property

v1.1
embodiment: voaf v1.1.rdf
date: 2011-11-16
type: Expression
type: Thing
version info: 1.1
comment: Depreciation of voaf:exampleDataset, replaced by voaf:dataset
comment: Dépréciation de voaf:exampleDataset, remplacé par voaf:dataset @fr

http://lodlaundromat.org/.well-known/genid/samples/pellet///class//cc6bcd54f984ce1335a720fa5f509321/08f918ba28f018796137367d7b0b9764#2
type: Restriction
min cardinality: 1
on property: relies on

definition
definition: A statement or formal explanation of the meaning of a concept.
type: AnnotationProperty
sub property of: note
type: Property

change note
definition: A note about a modification to a concept.
type: AnnotationProperty
sub property of: note
type: Property

hidden label
definition: A lexical label for a resource that should be hidden when generating visual displays of the resource, but should still be accessible to free text search operations.
type: AnnotationProperty
sub property of: label
comment: The range of skos:hiddenLabel is the class of RDF plain literals.
comment: skos:prefLabel, skos:altLabel and skos:hiddenLabel are pairwise disjoint properties.
type: Property

note
definition: A general note, for any purpose.
scope note: This property may be used directly, or as a super-property for more specific note types.
type: AnnotationProperty
type: Property

http://lodlaundromat.org/.well-known/genid/cc6bcd54f984ce1335a720fa5f509321#11
type: Restriction
min cardinality: 2
on property: reference point in timescale

alternative label
definition: An alternative lexical label for a resource.
example: Acronyms, abbreviations, spelling variants, and irregular plural/singular forms may be included among the alternative labels for a concept. Mis-spelled terms are normally included as hidden labels (see skos:hiddenLabel).
type: AnnotationProperty
sub property of: label
comment: The range of skos:altLabel is the class of RDF plain literals.
comment: skos:prefLabel, skos:altLabel and skos:hiddenLabel are pairwise disjoint properties.
type: Property

history note
definition: A note about the past state/use/meaning of a concept.
type: AnnotationProperty
sub property of: note
type: Property

http://lodlaundromat.org/.well-known/genid/cc6bcd54f984ce1335a720fa5f509321#4
type: Restriction
cardinality: 1
on property: temporalPosition

http://lodlaundromat.org/.well-known/genid/cc6bcd54f984ce1335a720fa5f509321#10
type: Restriction
min cardinality: 1
on property: temporal reference system component

http://lodlaundromat.org/.well-known/genid/cc6bcd54f984ce1335a720fa5f509321#9
type: Restriction
min cardinality: 1
on property: previous era

preferred label
definition: The preferred lexical label for a resource, in a given language.
type: AnnotationProperty
sub property of: label
comment: A resource has no more than one value of skos:prefLabel per language tag, and no more than one value of skos:prefLabel without language tag.
comment: The range of skos:prefLabel is the class of RDF plain literals.
comment: skos:prefLabel, skos:altLabel and skos:hiddenLabel are pairwise disjoint properties.
type: Property

example
definition: An example of the use of a concept.
type: AnnotationProperty
sub property of: note
type: Property

http://lodlaundromat.org/.well-known/genid/samples/pellet///class//cc6bcd54f984ce1335a720fa5f509321/08f918ba28f018796137367d7b0b9764#4
type: Restriction
min cardinality: 1
on property: used by

http://lodlaundromat.org/.well-known/genid/cc6bcd54f984ce1335a720fa5f509321#8
type: Restriction
min cardinality: 1
on property: next era

http://lodlaundromat.org/.well-known/genid/cc6bcd54f984ce1335a720fa5f509321#2
type: Restriction
cardinality: 1
on property: era end

editorial note
definition: A note for an editor, translator or maintainer of the vocabulary.
type: AnnotationProperty
sub property of: note
type: Property

http://lodlaundromat.org/.well-known/genid/cc6bcd54f984ce1335a720fa5f509321#7
type: Restriction
cardinality: 1
on property: geometry

http://lodlaundromat.org/.well-known/genid/cc6bcd54f984ce1335a720fa5f509321#1
type: Restriction
cardinality: 1
on property: era beginning

scope note
definition: A note that helps to clarify the meaning and/or the use of a concept.
type: AnnotationProperty
sub property of: note
type: Property