Time Ordinal Era or Interval
type: Class
subclass of: Thing
subclass of: Resource
subclass of: Edge
subclass of: OrdinalEra
subclass of: http://lodlaundromat.org/.well-known/genid/cc6bcd54f984ce1335a720fa5f509321#1
subclass of: http://lodlaundromat.org/.well-known/genid/cc6bcd54f984ce1335a720fa5f509321#2
subclass of: Concept
subclass of: http://lodlaundromat.org/.well-known/genid/samples/jena///class//cc6bcd54f984ce1335a720fa5f509321/d8234c3b1439a879aea940e9009663be#1

has close match
sub property of: is in semantic relation with
range: Thing
domain: Thing
definition: skos:closeMatch is used to link two concepts that are sufficiently similar that they can be used interchangeably in some information retrieval applications. In order to avoid the possibility of "compound errors" when combining mappings across more than two concept schemes, skos:closeMatch is not declared to be a transitive property.
type: ObjectProperty
sub property of: is in mapping relation with
type: SymmetricProperty
type: Property
note: skos:closeMatch is used to link two concepts that are sufficiently similar that they can be used interchangeably in some information retrieval applications. In order to avoid the possibility of "compound errors" when combining mappings across more than two concept schemes, skos:closeMatch is not declared to be a transitive property.
domain: Concept
domain: Resource
domain: http://lodlaundromat.org/.well-known/genid/samples/jena///class//cc6bcd54f984ce1335a720fa5f509321/d8234c3b1439a879aea940e9009663be#1
range: Concept
range: Resource
range: http://lodlaundromat.org/.well-known/genid/samples/jena///class//cc6bcd54f984ce1335a720fa5f509321/d8234c3b1439a879aea940e9009663be#1

has related
range: Thing
domain: Thing
definition: Relates a concept to a concept with which there is an associative semantic relationship.
type: ObjectProperty
sub property of: is in semantic relation with
type: SymmetricProperty
comment: skos:related is disjoint with skos:broaderTransitive
type: Property
note: Relates a concept to a concept with which there is an associative semantic relationship.
domain: Concept
domain: Resource
domain: http://lodlaundromat.org/.well-known/genid/samples/jena///class//cc6bcd54f984ce1335a720fa5f509321/d8234c3b1439a879aea940e9009663be#1
range: Concept
range: Resource
range: http://lodlaundromat.org/.well-known/genid/samples/jena///class//cc6bcd54f984ce1335a720fa5f509321/d8234c3b1439a879aea940e9009663be#1

http://lodlaundromat.org/.well-known/genid/samples/jena///class//cc6bcd54f984ce1335a720fa5f509321/08f918ba28f018796137367d7b0b9764#4
subclass of: Vocabulary
subclass of: Resource
subclass of: Thing
type: Class
type: Restriction
min cardinality: 1
on property: used by
subclass of: Work
subclass of: Dataset

has top concept
range: Thing
domain: Thing
definition: Relates, by convention, a concept scheme to a concept which is topmost in the broader/narrower concept hierarchies for that scheme, providing an entry point to these hierarchies.
type: ObjectProperty
domain: Concept Scheme
range: Concept
inverse of: is top concept in scheme
type: Property
note: Relates, by convention, a concept scheme to a concept which is topmost in the broader/narrower concept hierarchies for that scheme, providing an entry point to these hierarchies.
range: http://lodlaundromat.org/.well-known/genid/samples/jena///class//cc6bcd54f984ce1335a720fa5f509321/d8234c3b1439a879aea940e9009663be#1
range: Resource
domain: Resource

Ordered Collection
subclass of: Thing
subclass of: Resource
type: Class
definition: An ordered collection of concepts, where both the grouping and the ordering are meaningful.
scope note: Ordered collections can be used where you would like a set of concepts to be displayed in a specific order, and optionally under a 'node label'.
subclass of: Collection
note: Ordered collections can be used where you would like a set of concepts to be displayed in a specific order, and optionally under a 'node label'.
note: An ordered collection of concepts, where both the grouping and the ordering are meaningful.
subclass of: http://lodlaundromat.org/.well-known/genid/samples/jena///class//cc6bcd54f984ce1335a720fa5f509321/d8234c3b1439a879aea940e9009663be#1

generalizes
range: Thing
domain: Thing
sub property of: vocabulary
sub property of: references
term status: stable
comment: Indicates that the subject vocabulary generalizes by some superclasses or superproperties the object vocabulary.
label: généralise @fr
range: Vocabulary
type: ObjectProperty
sub property of: relies on
description: PREFIX rdf:<http://www.w3.org/1999/02/22-rdf-syntax-ns#> PREFIX rdfs:<http://www.w3.org/2000/01/rdf-schema#> PREFIX owl:<http://www.w3.org/2002/07/owl#> PREFIX voaf:<http://purl.org/vocommons/voaf#> PREFIX skos:<http://www.w3.org/2004/02/skos/core#> CONSTRUCT{ ?vocab1 voaf:generalizes ?vocab2 } WHERE{ {?elem1 skos:narrowMatch ?elem2. FILTER(!isBlank(?elem2))} UNION{?elem2 rdfs:subPropertyOf ?elem1.} UNION{?elem1 a owl:Class. ?elem1 owl:unionOf ?union. ?union rdf:first ?elem2.} UNION{?elem1 a owl:Class. ?elem1 owl:unionOf ?union. ?union rdf:rest ?union2. ?union2 rdf:first ?elem2.} UNION{?elem1 a owl:Class. ?elem1 owl:unionOf ?union. ?union rdf:rest ?union2. ?union2 rdf:rest ?union3. ?union3 rdf:first ?elem2.} UNION{?elem1 a owl:Class. ?elem1 owl:unionOf ?union. ?union rdf:rest ?union2. ?union2 rdf:rest ?union3. ?union3 rdf:rest ?union4. ?union4 rdf:first ?elem2.} UNION{?elem1 a owl:Class. ?elem1 owl:unionOf ?union. ?union rdf:rest ?union2. ?union2 rdf:rest ?union3. ?union3 rdf:rest ?union4. ?union4 rdf:rest ?union5. ?union5 rdf:first ?elem2.} FILTER(!isBlank(?elem2)) ?elem1 rdfs:isDefinedBy ?vocab1. ?vocab1 a voaf:Vocabulary. ?elem2 rdfs:isDefinedBy ?vocab2. ?vocab2 a voaf:Vocabulary. FILTER(?vocab1!=?vocab2) }
comment: Indique que le vocabulaire sujet définit des super-classes ou super-propriétés du vocabulaire objet @fr
domain: Vocabulary
type: Property
domain: Dataset
domain: Resource
domain: Work
range: Resource
range: Work
range: Dataset

has exact match
sub property of: is in semantic relation with
range: Thing
domain: Thing
sub property of: is in mapping relation with
definition: skos:exactMatch is used to link two concepts, indicating a high degree of confidence that the concepts can be used interchangeably across a wide range of information retrieval applications. skos:exactMatch is a transitive property, and is a sub-property of skos:closeMatch.
type: ObjectProperty
sub property of: has close match
type: SymmetricProperty
type: TransitiveProperty
comment: skos:exactMatch is disjoint with each of the properties skos:broadMatch and skos:relatedMatch.
type: Property
note: skos:exactMatch is used to link two concepts, indicating a high degree of confidence that the concepts can be used interchangeably across a wide range of information retrieval applications. skos:exactMatch is a transitive property, and is a sub-property of skos:closeMatch.
domain: Resource
domain: Concept
domain: http://lodlaundromat.org/.well-known/genid/samples/jena///class//cc6bcd54f984ce1335a720fa5f509321/d8234c3b1439a879aea940e9009663be#1
range: Resource
range: Concept
range: http://lodlaundromat.org/.well-known/genid/samples/jena///class//cc6bcd54f984ce1335a720fa5f509321/d8234c3b1439a879aea940e9009663be#1

http://lodlaundromat.org/.well-known/genid/cc6bcd54f984ce1335a720fa5f509321#7
subclass of: Thing
subclass of: http://lodlaundromat.org/.well-known/genid/cc6bcd54f984ce1335a720fa5f509321#3
subclass of: Resource
type: Class
type: Restriction
cardinality: 1
on property: geometry

has broader transitive
range: Thing
domain: Thing
definition: skos:broaderTransitive is a transitive superproperty of skos:broader.
scope note: By convention, skos:broaderTransitive is not used to make assertions. Rather, the properties can be used to draw inferences about the transitive closure of the hierarchical relation, which is useful e.g. when implementing a simple query expansion algorithm in a search application.
type: ObjectProperty
sub property of: is in semantic relation with
type: TransitiveProperty
inverse of: has narrower transitive
type: Property
note: By convention, skos:broaderTransitive is not used to make assertions. Rather, the properties can be used to draw inferences about the transitive closure of the hierarchical relation, which is useful e.g. when implementing a simple query expansion algorithm in a search application.
note: skos:broaderTransitive is a transitive superproperty of skos:broader.
domain: Concept
domain: Resource
domain: http://lodlaundromat.org/.well-known/genid/samples/jena///class//cc6bcd54f984ce1335a720fa5f509321/d8234c3b1439a879aea940e9009663be#1
range: Concept
range: Resource
range: http://lodlaundromat.org/.well-known/genid/samples/jena///class//cc6bcd54f984ce1335a720fa5f509321/d8234c3b1439a879aea940e9009663be#1

has narrower
sub property of: is in semantic relation with
range: Thing
domain: Thing
definition: Relates a concept to a concept that is more specific in meaning.
scope note: By convention, skos:broader is only used to assert an immediate (i.e. direct) hierarchical link between two conceptual resources.
comment: Narrower concepts are typically rendered as children in a concept hierarchy (tree).
type: ObjectProperty
sub property of: has narrower transitive
inverse of: has broader
type: Property
note: By convention, skos:broader is only used to assert an immediate (i.e. direct) hierarchical link between two conceptual resources.
note: Relates a concept to a concept that is more specific in meaning.
domain: Concept
domain: Resource
domain: http://lodlaundromat.org/.well-known/genid/samples/jena///class//cc6bcd54f984ce1335a720fa5f509321/d8234c3b1439a879aea940e9009663be#1
range: Concept
range: Resource
range: http://lodlaundromat.org/.well-known/genid/samples/jena///class//cc6bcd54f984ce1335a720fa5f509321/d8234c3b1439a879aea940e9009663be#1

Hierarchical Time Ordinal Reference System
subclass of: Thing
subclass of: Resource
type: Class
comment: A temporal ordinal reference system is a constrained temporal topological complex, in which the edges are called 'eras'. Each era may be subdivided into one set of eras of the next finer rank. This constraint is required to establish a mono-hierarchy, so that a set of temporal positions defined relative to the reference system may be uniquely ordered.
subclass of: OrdinalReferenceSystem
subclass of: TopologicalComplex
subclass of: http://lodlaundromat.org/.well-known/genid/cc6bcd54f984ce1335a720fa5f509321#10
subclass of: http://lodlaundromat.org/.well-known/genid/cc6bcd54f984ce1335a720fa5f509321#11
subclass of: Concept Scheme

Collection
subclass of: Thing
subclass of: http://lodlaundromat.org/.well-known/genid/samples/jena///class//cc6bcd54f984ce1335a720fa5f509321/d8234c3b1439a879aea940e9009663be#1
subclass of: Resource
type: Class
definition: A meaningful collection of concepts.
scope note: Labelled collections can be used where you would like a set of concepts to be displayed under a 'node label' in the hierarchy.
disjoint with: Concept
disjoint with: Concept Scheme
note: Labelled collections can be used where you would like a set of concepts to be displayed under a 'node label' in the hierarchy.
note: A meaningful collection of concepts.

has equivalences with
range: Thing
domain: Thing
sub property of: vocabulary
sub property of: references
description: PREFIX rdfs:<http://www.w3.org/2000/01/rdf-schema#> PREFIX owl:<http://www.w3.org/2002/07/owl#> PREFIX voaf:<http://purl.org/vocommons/voaf#> PREFIX skos:<http://www.w3.org/2004/02/skos/core#> CONSTRUCT{ ?vocab1 voaf:hasEquivalencesWith ?vocab2 } WHERE{ {?elem1 owl:equivalentProperty ?elem2.} UNION{?elem1 owl:sameAs ?elem2.} UNION{?elem1 owl:equivalentClass ?elem2.} UNION{?elem2 owl:equivalentProperty ?elem1.} UNION{?elem2 owl:equivalentClass ?elem1.} UNION{?elem1 skos:exactMatch ?elem2.} UNION{?elem2 skos:exactMatch ?elem1.} FILTER(!isBlank(?elem2)) ?elem1 rdfs:isDefinedBy ?vocab1. ?vocab1 a voaf:Vocabulary. ?elem2 rdfs:isDefinedBy ?vocab2. ?vocab2 a voaf:Vocabulary. FILTER(?vocab1!=?vocab2) }
comment: Indique que le vocabulaire sujet déclare des équivalences de classes ou de propriétés avec le vocabulaire objet @fr
range: Vocabulary
domain: Vocabulary
type: ObjectProperty
sub property of: relies on
term status: testing
label: a des équivalences avec @fr
comment: Indicates that the subject vocabulary declares some equivalent classes or properties with the object vocabulary.
type: Property
domain: Dataset
domain: Resource
domain: Work
range: Resource
range: Work
range: Dataset

Concept Scheme
subclass of: Thing
subclass of: Resource
type: Class
definition: A set of concepts, optionally including statements about semantic relationships between those concepts.
scope note: A concept scheme may be defined to include concepts from different sources.
example: Thesauri, classification schemes, subject heading lists, taxonomies, 'folksonomies', and other types of controlled vocabulary are all examples of concept schemes. Concept schemes are also embedded in glossaries and terminologies.
disjoint with: Concept
note: A concept scheme may be defined to include concepts from different sources.
note: Thesauri, classification schemes, subject heading lists, taxonomies, 'folksonomies', and other types of controlled vocabulary are all examples of concept schemes. Concept schemes are also embedded in glossaries and terminologies.
note: A set of concepts, optionally including statements about semantic relationships between those concepts.
disjoint with: Collection

temporal reference system component
range: Thing
domain: Thing
type: ObjectProperty
domain: Hierarchical Time Ordinal Reference System
range: Time Ordinal Era or Interval
sub property of: component
sub property of: primitive
sub property of: has top concept
inverse of: system
type: Property
domain: Concept Scheme
domain: Resource
range: Concept
range: Resource
range: http://lodlaundromat.org/.well-known/genid/samples/jena///class//cc6bcd54f984ce1335a720fa5f509321/d8234c3b1439a879aea940e9009663be#1
range: OrdinalEra
range: http://lodlaundromat.org/.well-known/genid/cc6bcd54f984ce1335a720fa5f509321#1
range: Edge
range: http://lodlaundromat.org/.well-known/genid/cc6bcd54f984ce1335a720fa5f509321#2
domain: http://lodlaundromat.org/.well-known/genid/cc6bcd54f984ce1335a720fa5f509321#10
domain: http://lodlaundromat.org/.well-known/genid/cc6bcd54f984ce1335a720fa5f509321#11
domain: OrdinalReferenceSystem
domain: TopologicalComplex

http://lodlaundromat.org/.well-known/genid/cc6bcd54f984ce1335a720fa5f509321#2
type: Class
subclass of: Resource
subclass of: Thing
type: Restriction
cardinality: 1
on property: era end

era member / sub-era
range: Thing
domain: Thing
sub property of: is in semantic relation with
sub property of: has narrower transitive
type: ObjectProperty
domain: Time Ordinal Era or Interval
range: Time Ordinal Era or Interval
sub property of: member
sub property of: has narrower
type: Property
domain: Resource
domain: Concept
domain: http://lodlaundromat.org/.well-known/genid/samples/jena///class//cc6bcd54f984ce1335a720fa5f509321/d8234c3b1439a879aea940e9009663be#1
range: Resource
range: Concept
range: http://lodlaundromat.org/.well-known/genid/samples/jena///class//cc6bcd54f984ce1335a720fa5f509321/d8234c3b1439a879aea940e9009663be#1
range: OrdinalEra
range: http://lodlaundromat.org/.well-known/genid/cc6bcd54f984ce1335a720fa5f509321#1
range: Edge
range: http://lodlaundromat.org/.well-known/genid/cc6bcd54f984ce1335a720fa5f509321#2
domain: http://lodlaundromat.org/.well-known/genid/cc6bcd54f984ce1335a720fa5f509321#2
domain: http://lodlaundromat.org/.well-known/genid/cc6bcd54f984ce1335a720fa5f509321#1
domain: Edge
domain: OrdinalEra

http://lodlaundromat.org/.well-known/genid/cc6bcd54f984ce1335a720fa5f509321#10
type: Class
subclass of: Thing
subclass of: Resource
type: Restriction
min cardinality: 1
on property: temporal reference system component

has broader match
sub property of: has broader transitive
sub property of: is in semantic relation with
range: Thing
domain: Thing
definition: skos:broadMatch is used to state a hierarchical mapping link between two conceptual resources in different concept schemes.
type: ObjectProperty
sub property of: is in mapping relation with
sub property of: has broader
inverse of: has narrower match
type: Property
note: skos:broadMatch is used to state a hierarchical mapping link between two conceptual resources in different concept schemes.
domain: Concept
domain: Resource
domain: http://lodlaundromat.org/.well-known/genid/samples/jena///class//cc6bcd54f984ce1335a720fa5f509321/d8234c3b1439a879aea940e9009663be#1
range: Concept
range: Resource
range: http://lodlaundromat.org/.well-known/genid/samples/jena///class//cc6bcd54f984ce1335a720fa5f509321/d8234c3b1439a879aea940e9009663be#1

has member
range: Thing
domain: Thing
definition: Relates a collection to one of its members.
type: ObjectProperty
domain: Collection
range: http://lodlaundromat.org/.well-known/genid/samples/jena///class//cc6bcd54f984ce1335a720fa5f509321/d8234c3b1439a879aea940e9009663be#1
type: Property
note: Relates a collection to one of its members.
range: Resource
domain: http://lodlaundromat.org/.well-known/genid/samples/jena///class//cc6bcd54f984ce1335a720fa5f509321/d8234c3b1439a879aea940e9009663be#1
domain: Resource

Dataset occurrences
subclass of: Thing
subclass of: Resource
type: Class
label: Occurrences dans un jeu de données @fr
comment: Class used to store the number of occurences of a vocabulary in a particular dataset
comment: Classe utilisée pour stocker l'information d'occurences d'un vocabulaire dans un jeu de données @fr
term status: testing

similar
range: Thing
domain: Thing
label: similaire @fr
type: ObjectProperty
type: SymmetricProperty
term status: testing
range: Vocabulary
domain: Vocabulary
comment: Used to assert that two vocabularies are similar in scope and objectives, independently of the fact that they otherwise refer to each other.
comment: Indique que deux vocabulaires sont similaires dans leur domaine et/ou leurs objectifs, sans être nécessairement reliés par des références. @fr
type: Property
range: Dataset
range: Resource
range: Work
domain: Resource
domain: Dataset
domain: Work

http://lodlaundromat.org/.well-known/genid/samples/jena///class//cc6bcd54f984ce1335a720fa5f509321/08f918ba28f018796137367d7b0b9764#2
subclass of: Resource
subclass of: Thing
type: Class
subclass of: Vocabulary
type: Restriction
min cardinality: 1
on property: relies on
subclass of: Dataset
subclass of: Work

has narrower match
sub property of: has narrower transitive
range: Thing
domain: Thing
sub property of: is in semantic relation with
definition: skos:narrowMatch is used to state a hierarchical mapping link between two conceptual resources in different concept schemes.
type: ObjectProperty
sub property of: is in mapping relation with
sub property of: has narrower
inverse of: has broader match
type: Property
note: skos:narrowMatch is used to state a hierarchical mapping link between two conceptual resources in different concept schemes.
domain: Resource
domain: Concept
domain: http://lodlaundromat.org/.well-known/genid/samples/jena///class//cc6bcd54f984ce1335a720fa5f509321/d8234c3b1439a879aea940e9009663be#1
range: Resource
range: Concept
range: http://lodlaundromat.org/.well-known/genid/samples/jena///class//cc6bcd54f984ce1335a720fa5f509321/d8234c3b1439a879aea940e9009663be#1

has narrower transitive
range: Thing
domain: Thing
definition: skos:narrowerTransitive is a transitive superproperty of skos:narrower.
scope note: By convention, skos:narrowerTransitive is not used to make assertions. Rather, the properties can be used to draw inferences about the transitive closure of the hierarchical relation, which is useful e.g. when implementing a simple query expansion algorithm in a search application.
type: ObjectProperty
sub property of: is in semantic relation with
type: TransitiveProperty
inverse of: has broader transitive
type: Property
note: By convention, skos:narrowerTransitive is not used to make assertions. Rather, the properties can be used to draw inferences about the transitive closure of the hierarchical relation, which is useful e.g. when implementing a simple query expansion algorithm in a search application.
note: skos:narrowerTransitive is a transitive superproperty of skos:narrower.
domain: Concept
domain: Resource
domain: http://lodlaundromat.org/.well-known/genid/samples/jena///class//cc6bcd54f984ce1335a720fa5f509321/d8234c3b1439a879aea940e9009663be#1
range: Concept
range: Resource
range: http://lodlaundromat.org/.well-known/genid/samples/jena///class//cc6bcd54f984ce1335a720fa5f509321/d8234c3b1439a879aea940e9009663be#1

Time Ordinal Era Boundary
subclass of: Thing
type: Class
subclass of: Resource
subclass of: Node
subclass of: http://lodlaundromat.org/.well-known/genid/cc6bcd54f984ce1335a720fa5f509321#3
subclass of: http://lodlaundromat.org/.well-known/genid/cc6bcd54f984ce1335a720fa5f509321#8
subclass of: http://lodlaundromat.org/.well-known/genid/cc6bcd54f984ce1335a720fa5f509321#9
subclass of: Concept
subclass of: http://lodlaundromat.org/.well-known/genid/samples/jena///class//cc6bcd54f984ce1335a720fa5f509321/d8234c3b1439a879aea940e9009663be#1

Concept
subclass of: Thing
subclass of: Resource
type: Class
subclass of: http://lodlaundromat.org/.well-known/genid/samples/jena///class//cc6bcd54f984ce1335a720fa5f509321/d8234c3b1439a879aea940e9009663be#1
definition: An idea or notion; a unit of thought.
note: An idea or notion; a unit of thought.
disjoint with: Collection
disjoint with: Concept Scheme

system
sub property of: is in scheme
range: Thing
domain: Thing
inverse of: temporal reference system component
range: Hierarchical Time Ordinal Reference System
type: ObjectProperty
domain: Time Ordinal Era or Interval
sub property of: complex
sub property of: system
comment: reference system that this era belongs to
sub property of: is top concept in scheme
type: Property
domain: Resource
domain: Concept
domain: http://lodlaundromat.org/.well-known/genid/samples/jena///class//cc6bcd54f984ce1335a720fa5f509321/d8234c3b1439a879aea940e9009663be#1
range: Concept Scheme
range: Resource
range: http://lodlaundromat.org/.well-known/genid/cc6bcd54f984ce1335a720fa5f509321#10
range: TopologicalComplex
range: http://lodlaundromat.org/.well-known/genid/cc6bcd54f984ce1335a720fa5f509321#11
range: OrdinalReferenceSystem
domain: http://lodlaundromat.org/.well-known/genid/cc6bcd54f984ce1335a720fa5f509321#2
domain: http://lodlaundromat.org/.well-known/genid/cc6bcd54f984ce1335a720fa5f509321#1
domain: Edge
domain: OrdinalEra

in dataset
range: Thing
domain: Thing
type: ObjectProperty
domain: Dataset occurrences
label: dans le jeu de données @fr
comment: dataset in which a vocabulary occurred
comment: jeu de données dans lequel un vocabulaire apparait @fr
range: Dataset
term status: testing
type: Property
range: Resource
domain: Resource

previous era
range: Thing
domain: Thing
type: ObjectProperty
domain: Time Ordinal Era Boundary
range: Time Ordinal Era or Interval
sub property of: previousEdge
sub property of: is in semantic relation with
inverse of: era end
type: Property
domain: Concept
domain: Resource
domain: http://lodlaundromat.org/.well-known/genid/samples/jena///class//cc6bcd54f984ce1335a720fa5f509321/d8234c3b1439a879aea940e9009663be#1
range: Concept
range: Resource
range: http://lodlaundromat.org/.well-known/genid/samples/jena///class//cc6bcd54f984ce1335a720fa5f509321/d8234c3b1439a879aea940e9009663be#1
range: OrdinalEra
range: http://lodlaundromat.org/.well-known/genid/cc6bcd54f984ce1335a720fa5f509321#1
range: Edge
range: http://lodlaundromat.org/.well-known/genid/cc6bcd54f984ce1335a720fa5f509321#2
domain: http://lodlaundromat.org/.well-known/genid/cc6bcd54f984ce1335a720fa5f509321#3
domain: http://lodlaundromat.org/.well-known/genid/cc6bcd54f984ce1335a720fa5f509321#8
domain: http://lodlaundromat.org/.well-known/genid/cc6bcd54f984ce1335a720fa5f509321#9
domain: Node

has disjunctions with
sub property of: vocabulary
sub property of: references
range: Thing
domain: Thing
sub property of: relies on
comment: Indicates that the subject vocabulary contains some declaration of disjoint classes with the object vocabulary.
label: a des disjonctions avec @fr
type: ObjectProperty
description: PREFIX rdfs:<http://www.w3.org/2000/01/rdf-schema#> PREFIX owl:<http://www.w3.org/2002/07/owl#> PREFIX voaf:<http://purl.org/vocommons/voaf#> CONSTRUCT{ ?vocab1 voaf:hasDisjunctionsWith ?vocab2 } WHERE{ ?elem1 owl:disjointWith ?elem2. FILTER(!isBlank(?elem2)) ?elem1 rdfs:isDefinedBy ?vocab1. ?vocab1 a voaf:Vocabulary. ?elem2 rdfs:isDefinedBy ?vocab2. ?vocab2 a voaf:Vocabulary. FILTER(?vocab1!=?vocab2) }
term status: testing
domain: Vocabulary
range: Vocabulary
comment: Indique que le vocabulaire sujet contient des déclarations de classes disjointes avec le vocabulaire objet @fr
type: Property
domain: Dataset
domain: Resource
domain: Work
range: Resource
range: Work
range: Dataset

extends
sub property of: vocabulary
sub property of: references
range: Thing
domain: Thing
domain: Vocabulary
term status: stable
type: ObjectProperty
label: étend @fr
range: Vocabulary
description: PREFIX rdfs:<http://www.w3.org/2000/01/rdf-schema#> PREFIX owl:<http://www.w3.org/2002/07/owl#> PREFIX voaf:<http://purl.org/vocommons/voaf#> CONSTRUCT{ ?vocab1 voaf:extends ?vocab2 } WHERE{ {?elem1 owl:inverseOf ?elem2. FILTER(!isBlank(?elem2))} UNION{?elem1 rdfs:domain ?elem2. FILTER(!isBlank(?elem2))} UNION{?elem1 rdfs:range ?elem2. FILTER(!isBlank(?elem2))} UNION{?elem2 rdfs:domain ?elem1. FILTER(!isBlank(?elem1))} UNION{?elem2 rdfs:range ?elem1. FILTER(!isBlank(?elem1))} ?elem1 rdfs:isDefinedBy ?vocab1. ?vocab1 a voaf:Vocabulary. ?elem2 rdfs:isDefinedBy ?vocab2. ?vocab2 a voaf:Vocabulary. FILTER(?vocab1!=?vocab2) }
comment: Indique que le vocabulaire sujet étend l'expressivité du vocabulaire objet en déclarant des relations de subsomption avec ce dernier, ou en utilisant ses classes comme domaine ou co-domaine d'un propriété du vocabulaire sujet, ou en définissant des contraintes locales etc. @fr
sub property of: relies on
comment: Indicates that the subject vocabulary extends the expressivity of the object vocabulary by declaring subsumption relationships, using object vocabulary class as domain or range of a subject vocabulary property, defining local restrictions etc..
type: Property
domain: Dataset
domain: Resource
domain: Work
range: Resource
range: Work
range: Dataset

http://lodlaundromat.org/.well-known/genid/cc6bcd54f984ce1335a720fa5f509321#8
subclass of: Resource
type: Class
subclass of: Thing
type: Restriction
min cardinality: 1
on property: next era

metadata vocabulary
sub property of: vocabulary
sub property of: references
range: Thing
domain: Thing
range: Vocabulary
description: PREFIX rdfs:<http://www.w3.org/2000/01/rdf-schema#> PREFIX owl:<http://www.w3.org/2002/07/owl#> PREFIX voaf:<http://purl.org/vocommons/voaf#> CONSTRUCT{ ?vocab1 voaf:metadataVoc ?vocab2 } WHERE{ ?elem1 ?elem2 ?o. ?elem1 rdfs:isDefinedBy ?vocab1. ?vocab1 a voaf:Vocabulary. ?elem2 rdfs:isDefinedBy ?vocab2. ?vocab2 a voaf:Vocabulary. FILTER(?vocab1!=?vocab2) }
sub property of: relies on
domain: Vocabulary
label: vocabulaire de métadonnées @fr
comment: Indique que le vocabulaire sujet utilise le vocabulaire objet pour décrire ses métadonnées, au niveau global du vocabulaire ou au niveau des éléments @fr
term status: stable
comment: Indicates that the subject vocabulary uses the object vocabulary in metadata at global vocabulary level or at element level
type: ObjectProperty
type: Property
domain: Dataset
domain: Resource
domain: Work
range: Resource
range: Work
range: Dataset

used by
range: Thing
domain: Thing
range: Vocabulary
term status: stable
label: utilisé par @fr
domain: Vocabulary
type: ObjectProperty
inverse of: relies on
comment: Indicates that the subject vocabulary is used by the object vocabulary
comment: Indique que le vocabulaire sujet est utilisé par le vocabulaire objet @fr
type: Property
range: Dataset
range: Resource
range: Work
domain: Resource
domain: Dataset
domain: Work

example dataset
type: Property
range: Thing
domain: Thing
type: ObjectProperty
label: exemple de jeu de données @fr
comment: Deprecated since v1.1
comment: Déprécié depuis la v1.1 @fr
term status: deprecated
is replaced by: dataset
range: Resource
domain: Resource

usage in dataset
range: Thing
domain: Thing
type: ObjectProperty
domain: Vocabulary
label: utilisation dans un jeu de données @fr
comment: usage statistics in a dataset
comment: statistiques d'utilisation dans un jeu de données @fr
range: Dataset occurrences
term status: testing
type: Property
range: Resource
domain: Resource
domain: Dataset
domain: Work

to-do list
range: Thing
domain: Thing
type: ObjectProperty
label: liste des choses à faire @fr
comment: Describes future tasks planned by a resource curator. This property is primarily intended to be used for vocabularies or datasets, but the domain is left open, it can be used for any resource. Use iCalendar Vtodo class and its properties to further describe the task calendar, priorities etc.
comment: Liste des tâches prévues par le gestionnaire d'une ressource. Cette propriété est destinée à l'usage des gestionnaires de vocabulaires ou de jeu de données mais son doamine est ouvert, elle peut être utilisée pour n'importe quelle ressource. Utiliser la classe ical:Vtodo pour une description fine des tâches : calendrier, priorités etc @fr
range: Vtodo
term status: stable
type: Property
range: Resource
domain: Resource

is in scheme
range: Thing
domain: Thing
definition: Relates a resource (for example a concept) to a concept scheme in which it is included.
scope note: A concept may be a member of more than one concept scheme.
type: ObjectProperty
range: Concept Scheme
type: Property
note: A concept may be a member of more than one concept scheme.
note: Relates a resource (for example a concept) to a concept scheme in which it is included.
range: Resource
domain: Resource

era end
range: Thing
domain: Thing
type: ObjectProperty
domain: Time Ordinal Era or Interval
range: Time Ordinal Era Boundary
sub property of: end
sub property of: is in semantic relation with
inverse of: previous era
type: Property
domain: Concept
domain: Resource
domain: http://lodlaundromat.org/.well-known/genid/samples/jena///class//cc6bcd54f984ce1335a720fa5f509321/d8234c3b1439a879aea940e9009663be#1
range: Concept
range: Resource
range: http://lodlaundromat.org/.well-known/genid/samples/jena///class//cc6bcd54f984ce1335a720fa5f509321/d8234c3b1439a879aea940e9009663be#1
range: http://lodlaundromat.org/.well-known/genid/cc6bcd54f984ce1335a720fa5f509321#3
range: Node
range: http://lodlaundromat.org/.well-known/genid/cc6bcd54f984ce1335a720fa5f509321#8
range: http://lodlaundromat.org/.well-known/genid/cc6bcd54f984ce1335a720fa5f509321#9
domain: http://lodlaundromat.org/.well-known/genid/cc6bcd54f984ce1335a720fa5f509321#2
domain: http://lodlaundromat.org/.well-known/genid/cc6bcd54f984ce1335a720fa5f509321#1
domain: Edge
domain: OrdinalEra

relies on
inverse of: used by
range: Thing
domain: Thing
type: ObjectProperty
label: réutilise @fr
domain: Vocabulary
sub property of: vocabulary
range: Vocabulary
comment: Indique que le vocabulaire sujet utilise ou étend au moins une classe ou propriété du vocabulaire objet @fr
sub property of: references
term status: stable
comment: Indicates that the subject vocabulary uses or extends some class or property of the object vocabulary
type: Property
domain: Dataset
domain: Resource
range: Resource
range: Work
range: Dataset
domain: Work

http://lodlaundromat.org/.well-known/genid/cc6bcd54f984ce1335a720fa5f509321#11
subclass of: Resource
subclass of: Thing
type: Class
type: Restriction
min cardinality: 2
on property: reference point in timescale

specializes
sub property of: vocabulary
sub property of: references
range: Thing
domain: Thing
description: PREFIX rdfs:<http://www.w3.org/2000/01/rdf-schema#> PREFIX voaf:<http://purl.org/vocommons/voaf#> PREFIX skos:<http://www.w3.org/2004/02/skos/core#> CONSTRUCT{ ?vocab1 voaf:specializes ?vocab2 } WHERE{ {?elem1 rdfs:subPropertyOf ?elem2. FILTER(!isBlank(?elem2))} UNION{?elem1 rdfs:subClassOf ?elem2. FILTER(!isBlank(?elem2))} UNION{?elem1 skos:broadMatch ?elem2. FILTER(!isBlank(?elem2))} ?elem1 rdfs:isDefinedBy ?vocab1. ?vocab1 a voaf:Vocabulary. ?elem2 rdfs:isDefinedBy ?vocab2. ?vocab2 a voaf:Vocabulary. FILTER(?vocab1!=?vocab2) }
comment: Indicates that the subject vocabulary defines some subclasses or subproperties of the object vocabulary, or local restrictions on those.
comment: Indique que le vocabulaire sujet définit des sous-classes ou sous-propriétés du vocabulaire objet @fr
label: spécialise @fr
range: Vocabulary
sub property of: relies on
domain: Vocabulary
type: ObjectProperty
term status: stable
type: Property
domain: Dataset
domain: Resource
domain: Work
range: Resource
range: Work
range: Dataset

era beginning
range: Thing
domain: Thing
type: ObjectProperty
comment: era or interval beginning or start
domain: Time Ordinal Era or Interval
range: Time Ordinal Era Boundary
sub property of: begin
sub property of: is in semantic relation with
inverse of: next era
type: Property
domain: Concept
domain: Resource
domain: http://lodlaundromat.org/.well-known/genid/samples/jena///class//cc6bcd54f984ce1335a720fa5f509321/d8234c3b1439a879aea940e9009663be#1
range: Concept
range: Resource
range: http://lodlaundromat.org/.well-known/genid/samples/jena///class//cc6bcd54f984ce1335a720fa5f509321/d8234c3b1439a879aea940e9009663be#1
range: http://lodlaundromat.org/.well-known/genid/cc6bcd54f984ce1335a720fa5f509321#3
range: Node
range: http://lodlaundromat.org/.well-known/genid/cc6bcd54f984ce1335a720fa5f509321#8
range: http://lodlaundromat.org/.well-known/genid/cc6bcd54f984ce1335a720fa5f509321#9
domain: http://lodlaundromat.org/.well-known/genid/cc6bcd54f984ce1335a720fa5f509321#2
domain: http://lodlaundromat.org/.well-known/genid/cc6bcd54f984ce1335a720fa5f509321#1
domain: Edge
domain: OrdinalEra

next era
range: Thing
domain: Thing
type: ObjectProperty
domain: Time Ordinal Era Boundary
range: Time Ordinal Era or Interval
sub property of: nextEdge
sub property of: is in semantic relation with
inverse of: era beginning
type: Property
domain: Concept
domain: Resource
domain: http://lodlaundromat.org/.well-known/genid/samples/jena///class//cc6bcd54f984ce1335a720fa5f509321/d8234c3b1439a879aea940e9009663be#1
range: Concept
range: Resource
range: http://lodlaundromat.org/.well-known/genid/samples/jena///class//cc6bcd54f984ce1335a720fa5f509321/d8234c3b1439a879aea940e9009663be#1
range: OrdinalEra
range: http://lodlaundromat.org/.well-known/genid/cc6bcd54f984ce1335a720fa5f509321#1
range: Edge
range: http://lodlaundromat.org/.well-known/genid/cc6bcd54f984ce1335a720fa5f509321#2
domain: http://lodlaundromat.org/.well-known/genid/cc6bcd54f984ce1335a720fa5f509321#3
domain: http://lodlaundromat.org/.well-known/genid/cc6bcd54f984ce1335a720fa5f509321#8
domain: http://lodlaundromat.org/.well-known/genid/cc6bcd54f984ce1335a720fa5f509321#9
domain: Node

dataset
range: Thing
domain: Thing
range: Dataset
is replaced by: Dataset occurrences
comment: Déprécié depuis la v2.4 @fr
domain: Vocabulary
type: ObjectProperty
label: jeu de données @fr
inverse of: vocabulary
term status: deprecated
comment: Deprecated since v2.4
type: Property
range: Resource
domain: Resource
domain: Dataset
domain: Work

reference point in timescale
range: Thing
domain: Thing
type: ObjectProperty
domain: Hierarchical Time Ordinal Reference System
range: Time Ordinal Era Boundary
sub property of: primitive
sub property of: has top concept
type: Property
domain: Concept Scheme
domain: Resource
range: Concept
range: Resource
range: http://lodlaundromat.org/.well-known/genid/samples/jena///class//cc6bcd54f984ce1335a720fa5f509321/d8234c3b1439a879aea940e9009663be#1
range: http://lodlaundromat.org/.well-known/genid/cc6bcd54f984ce1335a720fa5f509321#3
range: Node
range: http://lodlaundromat.org/.well-known/genid/cc6bcd54f984ce1335a720fa5f509321#8
range: http://lodlaundromat.org/.well-known/genid/cc6bcd54f984ce1335a720fa5f509321#9
domain: http://lodlaundromat.org/.well-known/genid/cc6bcd54f984ce1335a720fa5f509321#10
domain: http://lodlaundromat.org/.well-known/genid/cc6bcd54f984ce1335a720fa5f509321#11
domain: OrdinalReferenceSystem
domain: TopologicalComplex

is in semantic relation with
range: Thing
domain: Thing
definition: Links a concept to a concept related by meaning.
scope note: This property should not be used directly, but as a super-property for all properties denoting a relationship of meaning between concepts.
type: ObjectProperty
domain: Concept
range: Concept
type: Property
note: This property should not be used directly, but as a super-property for all properties denoting a relationship of meaning between concepts.
note: Links a concept to a concept related by meaning.
range: http://lodlaundromat.org/.well-known/genid/samples/jena///class//cc6bcd54f984ce1335a720fa5f509321/d8234c3b1439a879aea940e9009663be#1
range: Resource
domain: http://lodlaundromat.org/.well-known/genid/samples/jena///class//cc6bcd54f984ce1335a720fa5f509321/d8234c3b1439a879aea940e9009663be#1
domain: Resource

has member list
range: Thing
domain: Thing
definition: Relates an ordered collection to the RDF list containing its members.
type: ObjectProperty
domain: Ordered Collection
type: FunctionalProperty
range: List
comment: For any resource, every item in the list given as the value of the skos:memberList property is also a value of the skos:member property.
type: Property
note: Relates an ordered collection to the RDF list containing its members.
range: Resource
domain: http://lodlaundromat.org/.well-known/genid/samples/jena///class//cc6bcd54f984ce1335a720fa5f509321/d8234c3b1439a879aea940e9009663be#1
domain: Resource
domain: Collection

Vocabulary
subclass of: Thing
subclass of: Resource
type: Class
subclass of: Work
label: Vocabulaire @fr
term status: stable
union of: http://lodlaundromat.org/.well-known/genid/samples/jena///class//cc6bcd54f984ce1335a720fa5f509321/08f918ba28f018796137367d7b0b9764#1
subclass of: Dataset
comment: A vocabulary used in the linked data cloud. An instance of voaf:Vocabulary relies on or is used by at least another instance of voaf:Vocabulary
comment: Un vocabulaire utilisé ou utilisable dans le Web des données. Une instance de voaf:Vocabulary s'appuie at/ou est utilisée par au moins une autre instance of voaf:Vocabulary @fr

occurrences
range: Thing
domain: Thing
type: ObjectProperty
domain: Dataset occurrences
comment: Number of occurrences of a vocabulary in a dataset
comment: nombre d'occurrences d'un vocabulaire dans un dataset @fr
range: integer
term status: testing
type: Property
range: Resource
range: decimal
domain: Resource

http://lodlaundromat.org/.well-known/genid/cc6bcd54f984ce1335a720fa5f509321#1
subclass of: Resource
type: Class
subclass of: Thing
type: Restriction
cardinality: 1
on property: era beginning

is top concept in scheme
range: Thing
domain: Thing
definition: Relates a concept to the concept scheme that it is a top level concept of.
type: ObjectProperty
sub property of: is in scheme
inverse of: has top concept
type: Property
domain: Concept
range: Concept Scheme
note: Relates a concept to the concept scheme that it is a top level concept of.
domain: Resource
range: Resource
domain: http://lodlaundromat.org/.well-known/genid/samples/jena///class//cc6bcd54f984ce1335a720fa5f509321/d8234c3b1439a879aea940e9009663be#1

has related match
range: Thing
domain: Thing
sub property of: is in semantic relation with
definition: skos:relatedMatch is used to state an associative mapping link between two conceptual resources in different concept schemes.
type: ObjectProperty
sub property of: is in mapping relation with
sub property of: has related
type: SymmetricProperty
type: Property
note: skos:relatedMatch is used to state an associative mapping link between two conceptual resources in different concept schemes.
domain: Concept
domain: Resource
domain: http://lodlaundromat.org/.well-known/genid/samples/jena///class//cc6bcd54f984ce1335a720fa5f509321/d8234c3b1439a879aea940e9009663be#1
range: Concept
range: Resource
range: http://lodlaundromat.org/.well-known/genid/samples/jena///class//cc6bcd54f984ce1335a720fa5f509321/d8234c3b1439a879aea940e9009663be#1

http://lodlaundromat.org/.well-known/genid/cc6bcd54f984ce1335a720fa5f509321#9
subclass of: Resource
type: Class
subclass of: Thing
type: Restriction
min cardinality: 1
on property: previous era

has broader
range: Thing
domain: Thing
sub property of: is in semantic relation with
definition: Relates a concept to a concept that is more general in meaning.
comment: Broader concepts are typically rendered as parents in a concept hierarchy (tree).
scope note: By convention, skos:broader is only used to assert an immediate (i.e. direct) hierarchical link between two conceptual resources.
type: ObjectProperty
sub property of: has broader transitive
inverse of: has narrower
type: Property
note: By convention, skos:broader is only used to assert an immediate (i.e. direct) hierarchical link between two conceptual resources.
note: Relates a concept to a concept that is more general in meaning.
domain: Concept
domain: Resource
domain: http://lodlaundromat.org/.well-known/genid/samples/jena///class//cc6bcd54f984ce1335a720fa5f509321/d8234c3b1439a879aea940e9009663be#1
range: Concept
range: Resource
range: http://lodlaundromat.org/.well-known/genid/samples/jena///class//cc6bcd54f984ce1335a720fa5f509321/d8234c3b1439a879aea940e9009663be#1

Vocabulary Space
subclass of: Resource
subclass of: Thing
type: Class
label: Espace de vocabulaires @fr
comment: A vocabulary space defines any relevant grouping of vocabularies e.g., designed for similar purposes or domains, or designed by the same publisher or the same project, etc. A vocabulary can belong to zero, one or more vocabulary spaces.Dublin Core properties isPartOf and hasPart are used to link a vocabulary to a vocabulary space.
comment: Un Espace de vocabulaires définit un regroupement pertinent de vocabulaires, par exemple construits pour des domaines ou objectifs similaires, ou par le même déditeur ou le même projet, etc. Un Vocabulaire peut appartenir à zéro, un ou plusieurs Espace de vocabulaires. Les propriétés Dublin Core isPartOf et hasPart sont utilisées pour relier un Vocabulaire à un Espace de vocabulaires. @fr
term status: testing

is in mapping relation with
range: Thing
domain: Thing
definition: Relates two concepts coming, by convention, from different schemes, and that have comparable meanings
comment: These concept mapping relations mirror semantic relations, and the data model defined below is similar (with the exception of skos:exactMatch) to the data model defined for semantic relations. A distinct vocabulary is provided for concept mapping relations, to provide a convenient way to differentiate links within a concept scheme from links between concept schemes. However, this pattern of usage is not a formal requirement of the SKOS data model, and relies on informal definitions of best practice.
type: ObjectProperty
sub property of: is in semantic relation with
type: Property
note: Relates two concepts coming, by convention, from different schemes, and that have comparable meanings
domain: Concept
domain: Resource
domain: http://lodlaundromat.org/.well-known/genid/samples/jena///class//cc6bcd54f984ce1335a720fa5f509321/d8234c3b1439a879aea940e9009663be#1
range: Concept
range: Resource
range: http://lodlaundromat.org/.well-known/genid/samples/jena///class//cc6bcd54f984ce1335a720fa5f509321/d8234c3b1439a879aea940e9009663be#1

http://lodlaundromat.org/.well-known/genid/cc6bcd54f984ce1335a720fa5f509321#4
type: Class
subclass of: Resource
subclass of: Thing
subclass of: http://lodlaundromat.org/.well-known/genid/cc6bcd54f984ce1335a720fa5f509321#3
type: Restriction
cardinality: 1
on property: temporalPosition

definition
definition: A statement or formal explanation of the meaning of a concept.
type: AnnotationProperty
sub property of: note
type: Property
note: A statement or formal explanation of the meaning of a concept.

uncertainty in temporal position
type: DatatypeProperty
domain: TemporalPosition
range: Time
sub property of: measure
type: Property
range: Resource
domain: Resource

v2.2
type: Expression
version info: 2.2
date: 2013-04-24
comment: Added properties to represent metrics of vocabulary elements usage in LOV and LOD
comment: Ajout de propriétés pour représenter les métriques d'usage d'éléments de vocabulaire dans le LOV et le LOD @fr
creator: pierre-yves-vandenbussche
embodiment: voaf v2.2.rdf

change note
definition: A note about a modification to a concept.
type: AnnotationProperty
sub property of: note
type: Property
note: A note about a modification to a concept.

hidden label
definition: A lexical label for a resource that should be hidden when generating visual displays of the resource, but should still be accessible to free text search operations.
type: AnnotationProperty
sub property of: label
comment: The range of skos:hiddenLabel is the class of RDF plain literals.
comment: skos:prefLabel, skos:altLabel and skos:hiddenLabel are pairwise disjoint properties.
type: Property
note: A lexical label for a resource that should be hidden when generating visual displays of the resource, but should still be accessible to free text search operations.

note
definition: A general note, for any purpose.
scope note: This property may be used directly, or as a super-property for more specific note types.
type: AnnotationProperty
type: Property
note: This property may be used directly, or as a super-property for more specific note types.
note: A general note, for any purpose.

occurrences in datasets
type: DatatypeProperty
label: occurences dans des datasets @fr
comment: Number of datasets using a resource.
comment: Nombre de jeux de données utilisant une ressource. @fr
range: integer
term status: testing
type: Property
range: Resource
range: decimal

number of classes
comment: The number of classes defined in the vocabulary namespace. Classes imported from other namespaces are not taken into account.
label: nombre de classes @fr
description: PREFIX rdfs:<http://www.w3.org/2000/01/rdf-schema#> PREFIX owl:<http://www.w3.org/2002/07/owl#> PREFIX voaf:<http://purl.org/vocommons/voaf#> CONSTRUCT{ ?vocab voaf:classNumber ?nbClass } WHERE{ SELECT (COUNT(distinct ?class) AS ?nbClass) ?vocab WHERE{ {?class a rdfs:Class.} UNION{?class a owl:Class.} ?class a ?type. FILTER(?type!=owl:DeprecatedClass) ?class rdfs:isDefinedBy ?vocab. ?vocab a voaf:Vocabulary. }GROUP BY ?vocab }
comment: Le nombre de classes définies dans l'espace de noms du Vocabulaire. Les classes importées d'autres vocabulaires ne sont pas comptabilisées. @fr
type: DatatypeProperty
term status: stable
domain: Vocabulary
range: integer
type: Property
range: Resource
range: decimal
domain: Thing
domain: Resource
domain: Dataset
domain: Work

v2.1
type: Expression
version info: 2.1
date: 2012-10-15
comment: Added desrciption of queries used to infer a particular VOAF relation between two vocabularies
comment: Ajout des requêtes pour générer des relations VOAF entre deux vocabulaires @fr
creator: pierre-yves-vandenbussche
embodiment: voaf v2.1.rdf

reused by datasets
type: DatatypeProperty
label: réutilisé par des jeux de données @fr
comment: Distinct number of datasets reusing a resource.
comment: Nombre distinct de jeux de données reutilisant une resource. @fr
range: integer
term status: testing
type: Property
range: Resource
range: decimal

v1.1
type: Expression
version info: 1.1
date: 2011-11-16
comment: Depreciation of voaf:exampleDataset, replaced by voaf:dataset
comment: Dépréciation de voaf:exampleDataset, remplacé par voaf:dataset @fr
embodiment: voaf v1.1.rdf

alternative label
definition: An alternative lexical label for a resource.
example: Acronyms, abbreviations, spelling variants, and irregular plural/singular forms may be included among the alternative labels for a concept. Mis-spelled terms are normally included as hidden labels (see skos:hiddenLabel).
type: AnnotationProperty
sub property of: label
comment: The range of skos:altLabel is the class of RDF plain literals.
comment: skos:prefLabel, skos:altLabel and skos:hiddenLabel are pairwise disjoint properties.
type: Property
note: Acronyms, abbreviations, spelling variants, and irregular plural/singular forms may be included among the alternative labels for a concept. Mis-spelled terms are normally included as hidden labels (see skos:hiddenLabel).
note: An alternative lexical label for a resource.

v2.0
type: Expression
version info: 2.0
date: 2012-07-03
comment: Namespace moved to purl. Introduction of versions using FRBR. voaf:Vocabulary rdfs:subClassOf frbr:Work. Added labels and comments in French
comment: Namespace migré sous purl. Introduction des versions avec FRBR. voaf:Vocabulary rdfs:subClassOf frbr:Work. Ajout des traductions françaises @fr
creator: bernard-vatant
embodiment: voaf v2.0.rdf

number of properties
comment: The number of properties defined in the vocabulary namespace. Properties imported from other namespaces are not taken into account.
domain: Vocabulary
term status: stable
type: DatatypeProperty
description: PREFIX rdf:<http://www.w3.org/1999/02/22-rdf-syntax-ns#> PREFIX rdfs:<http://www.w3.org/2000/01/rdf-schema#> PREFIX owl:<http://www.w3.org/2002/07/owl#> PREFIX voaf:<http://purl.org/vocommons/voaf#> CONSTRUCT{ ?vocab voaf:propertyNumber ?nbProp } WHERE{ SELECT (COUNT(distinct ?prop) AS ?nbProp) ?vocab WHERE{ {?prop a rdf:Property.} UNION{?prop a owl:ObjectProperty.} UNION{?prop a owl:DatatypeProperty.} UNION{?prop a owl:AnnotationProperty.} UNION{?prop a owl:FunctionalProperty.} UNION{?prop a owl:OntologyProperty.} UNION{?prop a owl:AsymmetricProperty.} UNION{?prop a owl:InverseFunctionalProperty.} UNION{?prop a owl:IrreflexiveProperty.} UNION{?prop a owl:ReflexiveProperty.} UNION{?prop a owl:SymmetricProperty.} UNION{?prop a owl:TransitiveProperty.} ?prop a ?type. FILTER(?type!=owl:DeprecatedProperty) ?prop rdfs:isDefinedBy ?vocab. ?vocab a voaf:Vocabulary. }GROUP BY ?vocab }
comment: Le nombre de propriétés définies dans l'espace de noms du Vocabulaire. Les propriétés importées d'autres vocabulaires ne sont pas comptabilisées. @fr
range: integer
label: nombre de propriétés @fr
type: Property
range: Resource
range: decimal
domain: Thing
domain: Resource
domain: Dataset
domain: Work

history note
definition: A note about the past state/use/meaning of a concept.
type: AnnotationProperty
sub property of: note
type: Property
note: A note about the past state/use/meaning of a concept.

v1.0
type: Expression
version info: 1.0
date: 2011-03-11
comment: First published version
comment: Première publication @fr
embodiment: voaf v1.0.rdf

SKOS Vocabulary
type: Ontology
contributor: Dave Beckett
contributor: Nikki Rogers
contributor: Participants in W3C's Semantic Web Deployment Working Group.
description: An RDF vocabulary for describing the basic structure and content of concept schemes such as thesauri, classification schemes, subject heading lists, taxonomies, 'folksonomies', other types of controlled vocabulary, and also concept schemes embedded in glossaries and terminologies.
creator: Alistair Miles
creator: Sean Bechhofer

Vocabulary of a Friend
modified: 2013-05-24
realization: v1.0
type: Ontology
preferred namespace prefix: voaf
license: http://creativecommons.org/licenses/by/3.0/
example dataset: lov.rdf
contributor: lise-rozat
realization: v2.0
preferred namespace uri: http://purl.org/vocommons/voaf#
type: Vocabulary
realization: v2.2
description: A vocabulary to describe linked data vocabularies and their relations.
contributor: pierre-yves-vandenbussche
creator: bernard-vatant
issued: 2011-03-11
publisher: Open Knowledge Foundation
description: Un vocabulaire de description des vocabulaires RDF et de leurs relations mutuelles @fr
title: Vocabulaire d'un ami @fr
realization: v2.1
realization: v1.1
realization: v2.3
type: Thing
type: Work
type: Dataset

preferred label
definition: The preferred lexical label for a resource, in a given language.
type: AnnotationProperty
sub property of: label
comment: A resource has no more than one value of skos:prefLabel per language tag, and no more than one value of skos:prefLabel without language tag.
comment: The range of skos:prefLabel is the class of RDF plain literals.
comment: skos:prefLabel, skos:altLabel and skos:hiddenLabel are pairwise disjoint properties.
type: Property
note: The preferred lexical label for a resource, in a given language.

Temporal Hierarchical Ordinal Reference System model
has part: previous era
imports: temporal
preferred namespace prefix: thors
stylesheet: extra.css
has part: uncertainty in temporal position
has part: next era
version IRI: thors.rdf
preferred namespace uri: http://resource.geosciml.org/ontology/timescale/thors#
has part: era member / sub-era
has part: era end
comment: This model is related to the model for TORS in ISO 19108:2002, except that boundaries between eras are first class objects, supporting multiple properties, rather than being just time coordinates. It is also linked to the ISO 19108 Temporal Topology model.
creator: Simon Jonathan David COX, CSIRO Australia
type: Vocabulary
description: An OWL representation of the model for Temporal Ordinal Reference Systems defined in GeoSciML v3.
type: Ontology
has part: uom
has part: system
has part: Hierarchical Time Ordinal Reference System
has part: temporal reference system component
stylesheet: Primer.css
created: 2011-01-01
has part: Time Ordinal Era or Interval
prior version: gtrs-30.rdf
modified: 2013-11-14
date: 2012-01-19
has part: Time Ordinal Era Boundary
license: http://creativecommons.org/licenses/by/3.0/
stylesheet: owl.css
has part: era beginning
source: Simon J.D. Cox and Stephen M. Richard, A formal model for the geologic time scale and global stratotype section and point, compatible with geospatial information transfer standards, Geosphere, 1, 119-137 (2005)
has part: reference point in timescale
stylesheet: rec.css
rights: Copyright © 2012-2013 CSIRO, AzGS
type: Work
type: Thing
type: Dataset

notation
definition: A notation, also known as classification code, is a string of characters such as "T58.5" or "303.4833" used to uniquely identify a concept within the scope of a given concept scheme.
scope note: By convention, skos:notation is used with a typed literal in the object position of the triple.
type: DatatypeProperty
type: Property
note: By convention, skos:notation is used with a typed literal in the object position of the triple.
note: A notation, also known as classification code, is a string of characters such as "T58.5" or "303.4833" used to uniquely identify a concept within the scope of a given concept scheme.

example
definition: An example of the use of a concept.
type: AnnotationProperty
sub property of: note
type: Property
note: An example of the use of a concept.

occurrences in vocabularies
type: DatatypeProperty
label: occurences dans des vocabulaires @fr
comment: Number of vocabularies using a resource
comment: Nombre de vocabulaires utilisant une ressource. @fr
range: integer
term status: testing
type: Property
range: Resource
range: decimal

editorial note
definition: A note for an editor, translator or maintainer of the vocabulary.
type: AnnotationProperty
sub property of: note
type: Property
note: A note for an editor, translator or maintainer of the vocabulary.

v2.3
type: Expression
version info: 2.3
date: 2013-05-24
comment: Refined the voaf:dataset to a more complex element with occurrences information and added extra properties to represent metrics of vocabulary elements usage in LOV and LOD
comment: Remplacement de voaf:dataset par un objet permettant d'attacher la notion d'occurrenceet ajout supplémentaire de propriétés pour représenter les métriques d'usage d'éléments de vocabulaire dans le LOV et le LOD @fr
creator: pierre-yves-vandenbussche
embodiment: voaf v2.3.rdf

reused by vocabularies
type: DatatypeProperty
label: réutilisé par des vocabulaires @fr
comment: Distinct number of vocabularies reusing a resource.
comment: Nombre distinct de vocabulaires reutilisant une resource. @fr
range: integer
term status: testing
type: Property
range: Resource
range: decimal

scope note
definition: A note that helps to clarify the meaning and/or the use of a concept.
type: AnnotationProperty
sub property of: note
type: Property
note: A note that helps to clarify the meaning and/or the use of a concept.