Betreuer
range: Thing
domain: Thing
type: FunctionalProperty
type: ObjectProperty
comment: com.hp.hpl.jena.datatypes.BaseDatatype$TypedValue@28d8d5f
domain: Qualifikationsschrift
label: tutor @en
range: Person
inverse of: ist Betreuer
type: Property
domain: Resource
domain: Lebensabschnitt
domain: Beziehung zu einer Institution
range: Resource

Qualifikationsschrift
subclass of: Resource
type: Class
comment: com.hp.hpl.jena.datatypes.BaseDatatype$TypedValue@28a7fd2d
label: qualification paper @en
subclass of: Beziehung zu einer Institution

Veröffentlichung
subclass of: Resource
type: Class
comment: com.hp.hpl.jena.datatypes.BaseDatatype$TypedValue@28a7fd2d
label: publication @en

Institut
subclass of: Resource
type: Class
comment: com.hp.hpl.jena.datatypes.BaseDatatype$TypedValue@28a7fd2d
label: institute @en
subclass of: Institution

Professor
subclass of: Resource
type: Class
comment: com.hp.hpl.jena.datatypes.BaseDatatype$TypedValue@70b82f07
label: professor @en
subclass of: Person

Person
subclass of: Resource
type: Class
comment: com.hp.hpl.jena.datatypes.BaseDatatype$TypedValue@28d8d5f
label: person @en

Allgemein
subclass of: Resource
type: Class
comment: com.hp.hpl.jena.datatypes.BaseDatatype$TypedValue@28a7fd2d
label: general @en
subclass of: Lebensabschnitt

Professor hat Lebensabschnitte
range: Thing
domain: Thing
order: 320
type: ObjectProperty
comment: com.hp.hpl.jena.datatypes.BaseDatatype$TypedValue@28a7fd2d
comment: com.hp.hpl.jena.datatypes.BaseDatatype$TypedValue@662ca16c
domain: Professor
label: professor has periods of life @en
range: Lebensabschnitt
inverse of: is-period-of
type: Property
domain: Resource
domain: Person
range: Resource

veröffentlicht
range: Thing
domain: Thing
type: ObjectProperty
comment: com.hp.hpl.jena.datatypes.BaseDatatype$TypedValue@28d8d5f
domain: Professor
label: published @en
range: Veröffentlichung
type: Property
domain: Resource
domain: Person
range: Resource

ist Betreuer
type: InverseFunctionalProperty
range: Thing
domain: Thing
order: 330
type: ObjectProperty
comment: com.hp.hpl.jena.datatypes.BaseDatatype$TypedValue@93a6811f
domain: Person
label: is tutor @en
range: Qualifikationsschrift
inverse of: Betreuer
type: Property
domain: Resource
range: Resource
range: Beziehung zu einer Institution
range: Lebensabschnitt

Fakultät
subclass of: Resource
type: Class
comment: com.hp.hpl.jena.datatypes.BaseDatatype$TypedValue@28a7fd2d
label: faculty @en
subclass of: Institution

gesellschaftliche Funktion
subclass of: Resource
type: Class
comment: com.hp.hpl.jena.datatypes.BaseDatatype$TypedValue@28a7fd2d
label: social role @en
subclass of: Lebensabschnitt

Professor hat Einkommen
range: Thing
domain: Thing
type: ObjectProperty
comment: com.hp.hpl.jena.datatypes.BaseDatatype$TypedValue@28a7fd2d
domain: Professor
label: a professor has income @en
range: Einkommen
type: Property
domain: Resource
domain: Person
range: Resource

Beziehung zu einer Institution
subclass of: Resource
type: Class
comment: com.hp.hpl.jena.datatypes.BaseDatatype$TypedValue@28a7fd2d
label: relation to an institution @en
subclass of: Lebensabschnitt

Abteilung
subclass of: Resource
type: Class
comment: com.hp.hpl.jena.datatypes.BaseDatatype$TypedValue@28a7fd2d
label: department @en
subclass of: Institution

Amt
subclass of: Resource
type: Class
comment: com.hp.hpl.jena.datatypes.BaseDatatype$TypedValue@28a7fd2d
label: office @en
subclass of: Beziehung zu einer Institution

Karriere
subclass of: Resource
type: Class
comment: com.hp.hpl.jena.datatypes.BaseDatatype$TypedValue@28a7fd2d
label: career @en
subclass of: Beziehung zu einer Institution

eine Institution gehört zu
range: Thing
domain: Thing
type: ObjectProperty
comment: com.hp.hpl.jena.datatypes.BaseDatatype$TypedValue@28a7fd2d
domain: Institution
label: an institution is part of @en
range: Institution
inverse of: eine Institution besteht aus
type: Property
domain: Resource
range: Resource

Lebensabschnitt
subclass of: Resource
type: Class
comment: com.hp.hpl.jena.datatypes.BaseDatatype$TypedValue@28a7fd2d
label: period of life @en

Verwandter
subclass of: Resource
type: Class
comment: com.hp.hpl.jena.datatypes.BaseDatatype$TypedValue@545ec270
label: relative @en
subclass of: Person

eine Person hat Vornamen
range: Thing
domain: Thing
order: 40
type: ObjectProperty
comment: com.hp.hpl.jena.datatypes.BaseDatatype$TypedValue@1b64e664
domain: Person
label: a person has forenames @en
range: Vorname
type: Property
domain: Resource
range: Resource

eine Institution besteht aus
range: Thing
domain: Thing
type: ObjectProperty
comment: com.hp.hpl.jena.datatypes.BaseDatatype$TypedValue@28a7fd2d
domain: Institution
label: institution consists of @en
range: Institution
inverse of: eine Institution gehört zu
type: Property
domain: Resource
range: Resource

Wohnung
subclass of: Resource
type: Class
comment: com.hp.hpl.jena.datatypes.BaseDatatype$TypedValue@28a7fd2d
label: home, flat, appartement @en
subclass of: Lebensabschnitt

Studium
subclass of: Resource
type: Class
comment: com.hp.hpl.jena.datatypes.BaseDatatype$TypedValue@28a7fd2d
label: study @en
subclass of: Beziehung zu einer Institution

Vorname
subclass of: Resource
order: 200
type: Class
comment: com.hp.hpl.jena.datatypes.BaseDatatype$TypedValue@28a7fd2d
label: forename @en

Einkommen
subclass of: Resource
type: Class
comment: com.hp.hpl.jena.datatypes.BaseDatatype$TypedValue@28a7fd2d
label: income @en

Hochschule
subclass of: Resource
type: Class
comment: com.hp.hpl.jena.datatypes.BaseDatatype$TypedValue@28a7fd2d
label: academy @en
subclass of: Institution

Archiv
subclass of: Resource
type: Class
comment: com.hp.hpl.jena.datatypes.BaseDatatype$TypedValue@61f96acc
label: archive @en
subclass of: Institution

Institution
subclass of: Resource
type: Class
comment: com.hp.hpl.jena.datatypes.BaseDatatype$TypedValue@28a7fd2d
label: institution @en

ist Rufname?
type: DatatypeProperty
type: FunctionalProperty
comment: com.hp.hpl.jena.datatypes.BaseDatatype$TypedValue@28a7fd2d
domain: Vorname
label: is first name? @en
range: boolean
type: Property
domain: Resource
range: Resource

Namenszusatz
type: FunctionalProperty
type: DatatypeProperty
comment: com.hp.hpl.jena.datatypes.BaseDatatype$TypedValue@1b64e664
comment: Namenszusätze sind zum Beispiel von, zu, etc.
comment: additions to the surname can be of, etc. @en
domain: Person
label: additions to surname @en
range: string
type: Property
domain: Resource
range: Resource

Todeststaat
order: 130
type: FunctionalProperty
type: DatatypeProperty
comment: com.hp.hpl.jena.datatypes.BaseDatatype$TypedValue@1b64e664
comment: Bsp: Deutschland, England, ...
domain: Person
label: Todesstaat @en
range: string
type: Property
domain: Resource
range: Resource

Quellennachweis
order: 380
type: FunctionalProperty
type: DatatypeProperty
comment: com.hp.hpl.jena.datatypes.BaseDatatype$TypedValue@1b64e664
domain: Person
label: reference @en
range: string
type: Property
domain: Resource
range: Resource

Bildnachweis
order: 180
type: FunctionalProperty
type: DatatypeProperty
comment: com.hp.hpl.jena.datatypes.BaseDatatype$TypedValue@28a7fd2d
domain: Person
label: picture credits @en
range: string
type: Property
domain: Resource
range: Resource

Bsp: Sachsen, Bayern
type: DatatypeProperty
type: FunctionalProperty
comment: com.hp.hpl.jena.datatypes.BaseDatatype$TypedValue@28a7fd2d
domain: Hochschule
label: Hochschule Land
label: academy land @en
range: string
type: Property
domain: Resource
domain: Institution
range: Resource

Einkommen - Quelle
type: DatatypeProperty
type: FunctionalProperty
comment: com.hp.hpl.jena.datatypes.BaseDatatype$TypedValue@28a7fd2d
domain: Einkommen
label: income - reference @en
range: string
type: Property
domain: Resource
range: Resource

Hinweise auf weitere Bilder
type: FunctionalProperty
type: DatatypeProperty
comment: com.hp.hpl.jena.datatypes.BaseDatatype$TypedValue@6d22ffcd
domain: Person
label: other picture @en
range: string
type: Property
domain: Resource
range: Resource

Personalnummer
type: DatatypeProperty
type: FunctionalProperty
comment: com.hp.hpl.jena.datatypes.BaseDatatype$TypedValue@28a7fd2d
domain: Professor
label: personal number @en
range: int
type: Property
domain: Resource
domain: Person
range: Resource

Breite
type: FunctionalProperty
type: DatatypeProperty
comment: com.hp.hpl.jena.datatypes.BaseDatatype$TypedValue@90c97736
domain: Institution
label: Latitude @en
range: float
type: Property
domain: Resource
range: Resource

Hinweis zu einem Lebensabschnitt
type: DatatypeProperty
type: FunctionalProperty
comment: com.hp.hpl.jena.datatypes.BaseDatatype$TypedValue@28a7fd2d
domain: Lebensabschnitt
label: note for a period of life @en
range: string
type: Property
domain: Resource
range: Resource

com.hp.hpl.jena.datatypes.BaseDatatype$TypedValue@ce982cd9
order: 300
type: DatatypeProperty
type: FunctionalProperty
comment: com.hp.hpl.jena.datatypes.BaseDatatype$TypedValue@28a7fd2d
domain: Professor
label: Abitur Land
label: graduation land @en
range: string
type: Property
domain: Resource
domain: Person
range: Resource

Strasse
type: DatatypeProperty
type: FunctionalProperty
comment: com.hp.hpl.jena.datatypes.BaseDatatype$TypedValue@28a7fd2d
domain: Wohnung
label: street @en
range: string
type: Property
domain: Resource
domain: Lebensabschnitt
range: Resource

Abitur Stadt
order: 260
type: FunctionalProperty
type: DatatypeProperty
comment: com.hp.hpl.jena.datatypes.BaseDatatype$TypedValue@28a7fd2d
domain: Professor
label: Stadt in der der Professor das Abitur gemacht hat.
label: graduation city @en
range: string
type: Property
domain: Resource
domain: Person
range: Resource

Stadtviertel, Viertel
type: DatatypeProperty
type: FunctionalProperty
comment: com.hp.hpl.jena.datatypes.BaseDatatype$TypedValue@28a7fd2d
domain: Wohnung
label: quarter, district @en
range: string
type: Property
domain: Resource
domain: Lebensabschnitt
range: Resource

latitude
type: FunctionalProperty
type: DatatypeProperty
domain: Institution
type: Property
domain: Resource

von
range: date
label: from @en
range: gYear
comment: com.hp.hpl.jena.datatypes.BaseDatatype$TypedValue@28a7fd2d
range: gMonth
range: gMonthDay
range: gDay
domain: Lebensabschnitt
range: gYearMonth
type: DatatypeProperty
type: FunctionalProperty
type: Property
domain: Resource
range: Resource

biographische, autobiograhpische Literatur
order: 260
type: DatatypeProperty
type: FunctionalProperty
comment: com.hp.hpl.jena.datatypes.BaseDatatype$TypedValue@973c5fd9
domain: Professor
label: biographical, autobiographical literature @en
range: string
type: Property
domain: Resource
domain: Person
range: Resource

Abitur Jahr
range: gYear
label: graduation year @en
range: gMonth
range: gMonthDay
range: date
range: gYearMonth
comment: com.hp.hpl.jena.datatypes.BaseDatatype$TypedValue@28a7fd2d
range: gDay
label: The year the professor graduatet to university. @en
label: Jahr in dem der Professor das Abitur gemacht hat.
type: FunctionalProperty
type: DatatypeProperty
order: 270
domain: Professor
type: Property
domain: Resource
domain: Person
range: Resource

PND
order: 370
type: DatatypeProperty
type: FunctionalProperty
comment: com.hp.hpl.jena.datatypes.BaseDatatype$TypedValue@6d22ffcd
comment: com.hp.hpl.jena.datatypes.BaseDatatype$TypedValue@f8967994
domain: Person
range: string
type: Property
domain: Resource
range: Resource

Einkommen - Höhe, Betrag
type: FunctionalProperty
type: DatatypeProperty
comment: com.hp.hpl.jena.datatypes.BaseDatatype$TypedValue@28a7fd2d
domain: Einkommen
label: income - amount @en
range: int
type: Property
domain: Resource
range: Resource

Professor ist verwandt mit
order: 250
type: SymmetricProperty
type: ObjectProperty
comment: com.hp.hpl.jena.datatypes.BaseDatatype$TypedValue@605be6b3
domain: Person
label: professor is related to @en
range: Person
type: Property
domain: Resource
range: Resource

Links (e.g.Wikipedia)
label: links to (e.g.Wikipedia) ( @en
domain: Person
comment: com.hp.hpl.jena.datatypes.BaseDatatype$TypedValue@a2ca0a1b
domain: Institution
type: FunctionalProperty
type: DatatypeProperty
domain: Veröffentlichung
order: 185
range: string
type: Property
domain: Resource
range: Resource

Modell des Professorenkatalogs
type: Ontology
label: model of the professors catalogue @en

Publikationen
order: 350
type: DatatypeProperty
type: FunctionalProperty
comment: com.hp.hpl.jena.datatypes.BaseDatatype$TypedValue@6d22ffcd
domain: Person
label: publications @en
range: string
type: Property
domain: Resource
range: Resource

Konfession
order: 140
type: DatatypeProperty
type: FunctionalProperty
comment: com.hp.hpl.jena.datatypes.BaseDatatype$TypedValue@1b64e664
domain: Person
label: religious denomination @en
range: string
type: Property
domain: Resource
range: Resource

Vater-Vorname
type: FunctionalProperty
type: DatatypeProperty
comment: com.hp.hpl.jena.datatypes.BaseDatatype$TypedValue@6d22ffcd
domain: Vorname
label: father forename @en
range: string
type: Property
domain: Resource
range: Resource

Abitur Schulart
order: 290
type: DatatypeProperty
type: FunctionalProperty
comment: com.hp.hpl.jena.datatypes.BaseDatatype$TypedValue@28a7fd2d
comment: com.hp.hpl.jena.datatypes.BaseDatatype$TypedValue@1a545787
domain: Professor
label: graduation type @en
range: string
type: Property
domain: Resource
domain: Person
range: Resource

Bildherkunft
order: 160
type: FunctionalProperty
type: ObjectProperty
comment: com.hp.hpl.jena.datatypes.BaseDatatype$TypedValue@6d22ffcd
comment: com.hp.hpl.jena.datatypes.BaseDatatype$TypedValue@f9e7588c
domain: Person
label: picture archive @en
range: Archiv
type: Property
domain: Resource
range: Resource
range: Institution

Qualifikationsschrift - Venia Legendi
type: FunctionalProperty
type: DatatypeProperty
comment: com.hp.hpl.jena.datatypes.BaseDatatype$TypedValue@28a7fd2d
domain: Qualifikationsschrift
label: qualificationpaper - venia legendi @en
range: string
type: Property
domain: Resource
domain: Lebensabschnitt
domain: Beziehung zu einer Institution
range: Resource

Bild
order: 150
type: DatatypeProperty
type: FunctionalProperty
comment: com.hp.hpl.jena.datatypes.BaseDatatype$TypedValue@28a7fd2d
domain: Person
label: picture @en
range: string
type: Property
domain: Resource
range: Resource

Hochschule Stadt
type: DatatypeProperty
type: FunctionalProperty
comment: com.hp.hpl.jena.datatypes.BaseDatatype$TypedValue@28a7fd2d
domain: Hochschule
label: academy city @en
range: string
type: Property
domain: Resource
domain: Institution
range: Resource

Funktion in der Organisation
type: DatatypeProperty
comment: com.hp.hpl.jena.datatypes.BaseDatatype$TypedValue@28a7fd2d
comment: com.hp.hpl.jena.datatypes.BaseDatatype$TypedValue@96a8607f
domain: gesellschaftliche Funktion
label: function in organisation @en
range: string
type: Property
domain: Resource
domain: Lebensabschnitt
range: Resource

voller akademischer Titel
order: 30
type: FunctionalProperty
type: DatatypeProperty
comment: com.hp.hpl.jena.datatypes.BaseDatatype$TypedValue@28a7fd2d
domain: Professor
label: full academical title @en
range: string
type: Property
domain: Resource
domain: Person
range: Resource

Fach
type: FunctionalProperty
type: DatatypeProperty
comment: com.hp.hpl.jena.datatypes.BaseDatatype$TypedValue@28a7fd2d
domain: Studium
label: subject, the professor studied @en
range: string
type: Property
domain: Resource
domain: Lebensabschnitt
domain: Beziehung zu einer Institution
range: Resource

Geburtsstaat
comment: com.hp.hpl.jena.datatypes.BaseDatatype$TypedValue@1b64e664
type: DatatypeProperty
label: birthstate @en
comment: for example: Germany, England, ... @en
order: 90
domain: Person
type: FunctionalProperty
range: string
comment: Bsp: Deutschland, England, ...
type: Property
domain: Resource
range: Resource

Beziehung des Verwandten zum Professor
type: DatatypeProperty
comment: com.hp.hpl.jena.datatypes.BaseDatatype$TypedValue@28a7fd2d
comment: com.hp.hpl.jena.datatypes.BaseDatatype$TypedValue@96a8607f
domain: Verwandter
label: relationship of relative to the professor @en
range: string
type: Property
domain: Person
domain: Resource
range: Resource

Studienbeginn
comment: com.hp.hpl.jena.datatypes.BaseDatatype$TypedValue@28a7fd2d
label: study start @en
range: gDay
range: gYear
range: gMonth
type: FunctionalProperty
range: gYearMonth
type: DatatypeProperty
range: gMonthDay
range: date
domain: Professor
type: Property
domain: Resource
domain: Person
range: Resource

Stockwerk, Etage
type: DatatypeProperty
type: FunctionalProperty
comment: com.hp.hpl.jena.datatypes.BaseDatatype$TypedValue@28a7fd2d
domain: Wohnung
label: floor @en
range: string
type: Property
domain: Resource
domain: Lebensabschnitt
range: Resource

longitude
type: DatatypeProperty
type: FunctionalProperty
domain: Institution
type: Property
domain: Resource

Name der Institution
type: DatatypeProperty
type: FunctionalProperty
comment: com.hp.hpl.jena.datatypes.BaseDatatype$TypedValue@28a7fd2d
domain: Institution
label: name of the institution @en
range: string
type: Property
domain: Resource
range: Resource

Kürzel
type: DatatypeProperty
type: FunctionalProperty
comment: com.hp.hpl.jena.datatypes.BaseDatatype$TypedValue@61f96acc
domain: Archiv
label: archive Code @en
range: string
type: Property
domain: Resource
domain: Institution
range: Resource

Beruf des Verwandten
type: FunctionalProperty
type: DatatypeProperty
comment: com.hp.hpl.jena.datatypes.BaseDatatype$TypedValue@28a7fd2d
domain: Verwandter
label: the relatives job @en
range: string
type: Property
domain: Person
domain: Resource
range: Resource

Hochschule Staat
type: DatatypeProperty
type: FunctionalProperty
comment: com.hp.hpl.jena.datatypes.BaseDatatype$TypedValue@28a7fd2d
comment: Bsp: Deutschland, England, ...
domain: Hochschule
label: academy state @en
range: string
type: Property
domain: Resource
domain: Institution
range: Resource

Hochschultyp
type: DatatypeProperty
comment: com.hp.hpl.jena.datatypes.BaseDatatype$TypedValue@28a7fd2d
comment: com.hp.hpl.jena.datatypes.BaseDatatype$TypedValue@96a8607f
domain: Hochschule
label: academy type @en
range: string
type: Property
domain: Resource
domain: Institution
range: Resource

Länge
type: DatatypeProperty
type: FunctionalProperty
comment: com.hp.hpl.jena.datatypes.BaseDatatype$TypedValue@90c97736
domain: Institution
label: Longitude @en
range: float
type: Property
domain: Resource
range: Resource

Person ID
order: 50
type: FunctionalProperty
type: DatatypeProperty
comment: com.hp.hpl.jena.datatypes.BaseDatatype$TypedValue@28d8d5f
comment: kuenstliche ID als Primaerschluessel fuer Person. Sollte automatisch erstellt werden.
domain: Person
label: person id @en
range: int
type: Property
domain: Resource
range: Resource

Mutter-Vorname
order: 230
type: FunctionalProperty
type: DatatypeProperty
comment: com.hp.hpl.jena.datatypes.BaseDatatype$TypedValue@6d22ffcd
domain: Vorname
label: mother forename @en
range: string
type: Property
domain: Resource
range: Resource

Position des Vornamens
type: DatatypeProperty
type: FunctionalProperty
comment: com.hp.hpl.jena.datatypes.BaseDatatype$TypedValue@28a7fd2d
domain: Vorname
label: forename - position @en
range: int
type: Property
domain: Resource
range: Resource

Qualifikationsschrift - Fach
type: DatatypeProperty
type: FunctionalProperty
comment: com.hp.hpl.jena.datatypes.BaseDatatype$TypedValue@28a7fd2d
domain: Qualifikationsschrift
label: qualificationpaper - subject @en
range: string
type: Property
domain: Resource
domain: Lebensabschnitt
domain: Beziehung zu einer Institution
range: Resource

Name der Organisation
type: FunctionalProperty
type: DatatypeProperty
comment: com.hp.hpl.jena.datatypes.BaseDatatype$TypedValue@28a7fd2d
domain: gesellschaftliche Funktion
label: name of the organisation @en
range: string
type: Property
domain: Resource
domain: Lebensabschnitt
range: Resource

Grund des Austritts
type: DatatypeProperty
comment: com.hp.hpl.jena.datatypes.BaseDatatype$TypedValue@28a7fd2d
comment: com.hp.hpl.jena.datatypes.BaseDatatype$TypedValue@96a8607f
domain: Karriere
label: reason for resigning @en
range: string
type: Property
domain: Resource
domain: Lebensabschnitt
domain: Beziehung zu einer Institution
range: Resource

Geburtstag
range: gMonth
range: gYearMonth
range: gMonthDay
domain: Person
range: date
range: gDay
comment: com.hp.hpl.jena.datatypes.BaseDatatype$TypedValue@1b64e664
type: DatatypeProperty
order: 60
range: gYear
label: birthday, birth date @en
type: FunctionalProperty
type: Property
domain: Resource
range: Resource

Veröffentlichung Quellenangabe
type: DatatypeProperty
type: FunctionalProperty
comment: com.hp.hpl.jena.datatypes.BaseDatatype$TypedValue@28a7fd2d
domain: Veröffentlichung
label: publication reference @en
range: string
type: Property
domain: Resource
range: Resource

bis
range: date
type: FunctionalProperty
type: DatatypeProperty
range: gMonth
domain: Lebensabschnitt
range: gYearMonth
range: gYear
range: gMonthDay
comment: com.hp.hpl.jena.datatypes.BaseDatatype$TypedValue@28a7fd2d
label: to @en
range: gDay
type: Property
domain: Resource
range: Resource

Professor hat mit einer Institution zu tun
type: FunctionalProperty
type: ObjectProperty
comment: com.hp.hpl.jena.datatypes.BaseDatatype$TypedValue@28a7fd2d
domain: Beziehung zu einer Institution
label: professor has to do with institution @en
range: Institution
type: Property
domain: Resource
domain: Lebensabschnitt
range: Resource

Fächer
type: DatatypeProperty
comment: com.hp.hpl.jena.datatypes.BaseDatatype$TypedValue@28a7fd2d
domain: Karriere
label: subjects the professor taught @en
range: string
type: Property
domain: Resource
domain: Lebensabschnitt
domain: Beziehung zu einer Institution
range: Resource

Qualifikationsschrift - akademischer Titel
type: DatatypeProperty
type: FunctionalProperty
comment: com.hp.hpl.jena.datatypes.BaseDatatype$TypedValue@28a7fd2d
domain: Qualifikationsschrift
label: qualificationpaper academical title @en
range: string
type: Property
domain: Resource
domain: Lebensabschnitt
domain: Beziehung zu einer Institution
range: Resource

Art der Qualifikationsschrift
type: DatatypeProperty
comment: com.hp.hpl.jena.datatypes.BaseDatatype$TypedValue@28a7fd2d
comment: com.hp.hpl.jena.datatypes.BaseDatatype$TypedValue@96a8607f
domain: Qualifikationsschrift
label: qualificationpaper type @en
range: string
type: Property
domain: Resource
domain: Lebensabschnitt
domain: Beziehung zu einer Institution
range: Resource

Todestag
range: gYearMonth
label: death date @en
type: DatatypeProperty
comment: com.hp.hpl.jena.datatypes.BaseDatatype$TypedValue@1b64e664
domain: Person
range: gMonthDay
range: gYear
range: gDay
range: gMonth
type: FunctionalProperty
order: 100
range: date
type: Property
domain: Resource
range: Resource

Organisationstyp
type: DatatypeProperty
comment: com.hp.hpl.jena.datatypes.BaseDatatype$TypedValue@28a7fd2d
comment: com.hp.hpl.jena.datatypes.BaseDatatype$TypedValue@96a8607f
domain: gesellschaftliche Funktion
label: type of organisation @en
range: string
type: Property
domain: Resource
domain: Lebensabschnitt
range: Resource

Bildnummer
order: 170
type: FunctionalProperty
type: DatatypeProperty
comment: com.hp.hpl.jena.datatypes.BaseDatatype$TypedValue@6d22ffcd
domain: Person
label: picture key @en
range: string
type: Property
domain: Resource
range: Resource

Abitur Schule
label: the school where the professor graduatet for university @en
label: graduation school @en
range: string
type: FunctionalProperty
order: 280
label: Schule an der das Abitur abgelegt wurde
domain: Professor
type: DatatypeProperty
comment: com.hp.hpl.jena.datatypes.BaseDatatype$TypedValue@28a7fd2d
type: Property
domain: Resource
domain: Person
range: Resource

Vorlesungen
order: 186
type: FunctionalProperty
type: DatatypeProperty
comment: com.hp.hpl.jena.datatypes.BaseDatatype$TypedValue@3bd5fc4d
domain: Professor
label: Lectures( @en
range: string
type: Property
domain: Resource
domain: Person
range: Resource

Einkommen - Währung
type: FunctionalProperty
type: DatatypeProperty
comment: com.hp.hpl.jena.datatypes.BaseDatatype$TypedValue@28a7fd2d
domain: Einkommen
label: income - currency @en
range: string
type: Property
domain: Resource
range: Resource

Bezeichnung
label: Label @en

Vorname - Name
type: DatatypeProperty
type: FunctionalProperty
comment: com.hp.hpl.jena.datatypes.BaseDatatype$TypedValue@28a7fd2d
domain: Vorname
label: forename - name @en
range: string
type: Property
domain: Resource
range: Resource

Titel der Qualifikationsschrift
type: DatatypeProperty
type: FunctionalProperty
comment: com.hp.hpl.jena.datatypes.BaseDatatype$TypedValue@28a7fd2d
domain: Qualifikationsschrift
label: title of qualificationpaper @en
range: string
type: Property
domain: Resource
domain: Lebensabschnitt
domain: Beziehung zu einer Institution
range: Resource

Position
type: FunctionalProperty
type: DatatypeProperty
comment: com.hp.hpl.jena.datatypes.BaseDatatype$TypedValue@28a7fd2d
domain: Karriere
label: position @en
range: string
type: Property
domain: Resource
domain: Lebensabschnitt
domain: Beziehung zu einer Institution
range: Resource

weiter Informationen
order: 340
type: DatatypeProperty
type: FunctionalProperty
comment: com.hp.hpl.jena.datatypes.BaseDatatype$TypedValue@973c5fd9
domain: Professor
label: further information @en
range: string
type: Property
domain: Resource
domain: Person
range: Resource

Beruf des Vaters
order: 210
type: DatatypeProperty
type: FunctionalProperty
comment: com.hp.hpl.jena.datatypes.BaseDatatype$TypedValue@6d22ffcd
domain: Person
label: fathers profession @en
range: string
type: Property
domain: Resource
range: Resource

Mutter-Nachname
order: 220
type: FunctionalProperty
type: DatatypeProperty
comment: com.hp.hpl.jena.datatypes.BaseDatatype$TypedValue@6d22ffcd
domain: Person
label: mother surname @en
range: string
type: Property
domain: Resource
range: Resource

Geburtsland
type: FunctionalProperty
order: 80
comment: for example: Bavaria, ... @en
comment: Bsp: Sachsen, Bayern, ...
type: DatatypeProperty
label: birthland @en
domain: Person
comment: com.hp.hpl.jena.datatypes.BaseDatatype$TypedValue@1b64e664
range: string
type: Property
domain: Resource
range: Resource

Vermerk, Hinweis
comment: zusätzliche Informationen die nirgends sonst eingetragen werden können
range: string
type: FunctionalProperty
comment: com.hp.hpl.jena.datatypes.BaseDatatype$TypedValue@1b64e664
comment: additional information that does not fit elsewhere @en
label: note @en
domain: Person
order: 390
type: DatatypeProperty
type: Property
domain: Resource
range: Resource

Beruf der Mutter
order: 240
type: DatatypeProperty
type: FunctionalProperty
comment: com.hp.hpl.jena.datatypes.BaseDatatype$TypedValue@a9540066
domain: Person
label: mothers profession @en
range: string
type: Property
domain: Resource
range: Resource

Name des Amtes
type: DatatypeProperty
comment: com.hp.hpl.jena.datatypes.BaseDatatype$TypedValue@28a7fd2d
comment: com.hp.hpl.jena.datatypes.BaseDatatype$TypedValue@96a8607f
domain: Amt
label: name of the office @en
range: string
type: Property
domain: Resource
domain: Lebensabschnitt
domain: Beziehung zu einer Institution
range: Resource

alternative Namensschreibweisen
label: alternative writings of the surname @en
domain: Person
comment: Bsp: Meier, Meyer, Maier
range: string
type: DatatypeProperty
type: FunctionalProperty
order: 20
comment: com.hp.hpl.jena.datatypes.BaseDatatype$TypedValue@1b64e664
comment: for example: Meier, Meyer, Maier @en
type: Property
domain: Resource
range: Resource

Geburtsstadt
order: 70
type: DatatypeProperty
type: FunctionalProperty
comment: com.hp.hpl.jena.datatypes.BaseDatatype$TypedValue@1b64e664
domain: Person
label: birthcity @en
range: string
type: Property
domain: Resource
range: Resource

Todesland
order: 120
type: DatatypeProperty
type: FunctionalProperty
comment: com.hp.hpl.jena.datatypes.BaseDatatype$TypedValue@1b64e664
comment: Bsp: Sachsen, Bayern, ...
domain: Person
label: death land @en
range: string
type: Property
domain: Resource
range: Resource

Nachname
order: 10
type: DatatypeProperty
type: FunctionalProperty
comment: com.hp.hpl.jena.datatypes.BaseDatatype$TypedValue@1b64e664
domain: Person
label: surname @en
range: string
type: Property
domain: Resource
range: Resource

Vater-Nachname
order: 190
type: FunctionalProperty
type: DatatypeProperty
comment: com.hp.hpl.jena.datatypes.BaseDatatype$TypedValue@6d22ffcd
domain: Person
label: father surname @en
range: string
type: Property
domain: Resource
range: Resource

Ort
type: FunctionalProperty
type: DatatypeProperty
comment: com.hp.hpl.jena.datatypes.BaseDatatype$TypedValue@28a7fd2d
comment: Stadt in der die Wohnung liegt, NICHT Heimatstadt!
domain: Wohnung
label: city @en
range: string
type: Property
domain: Resource
domain: Lebensabschnitt
range: Resource

Einkommen - Jahr
range: gYearMonth
type: FunctionalProperty
range: date
comment: com.hp.hpl.jena.datatypes.BaseDatatype$TypedValue@28a7fd2d
range: gMonth
range: gDay
domain: Einkommen
range: gYear
type: DatatypeProperty
label: income - year @en
range: gMonthDay
type: Property
domain: Resource
range: Resource

Todesstadt
order: 110
type: DatatypeProperty
type: FunctionalProperty
comment: com.hp.hpl.jena.datatypes.BaseDatatype$TypedValue@1b64e664
domain: Person
label: death city @en
range: string
type: Property
domain: Resource
range: Resource