Chemistry
type: Nobel Prize category
type: Thing
type: Concept

Physics
type: Nobel Prize category
type: Thing
type: Concept

Peace
type: Nobel Prize category
type: Thing
type: Concept

Economic sciences
type: Nobel Prize category
type: Thing
type: Concept

Nobel Prize
subclass of: Thing
subclass of: Resource
type: Class
comment: The Nobel Prize is a set of annual international awards bestowed in a number of categories by Scandinavian committees in recognition of cultural and scientific advances. The will of the Swedish chemist Alfred Nobel, the inventor of dynamite, established the prizes in 1895. The prizes in Physics, Chemistry, Physiology or Medicine, Literature, and Peace were first awarded in 1901. The Peace Prize is awarded in Oslo, Norway, while the other prizes are awarded in Stockholm, Sweden.
subclass of: Award

Prize File
subclass of: Thing
subclass of: Resource
type: Class
comment: Some form of media related to the Nobel Prize.
subclass of: Document

Award File
subclass of: Thing
subclass of: Resource
type: Class
comment: Some form of media related to the award given to a specific Laureate.
subclass of: Document

Laureate
subclass of: Resource
subclass of: Thing
type: Class
comment: A laureate is a person or organization who recieves one or several Nobel Prizes.
subclass of: Agent

Physiology or Medicin
type: Nobel Prize category
type: Thing
type: Concept

laureate
range: Thing
domain: Thing
type: ObjectProperty
comment: Which laureates that recieve an award.
domain: Laureate Award
range: Laureate
type: Property
range: Agent
range: Resource
domain: Resource
domain: Award

fileType
range: Thing
domain: Thing
type: ObjectProperty
comment: Points to an FileType, that is, what kind of prizeFile this is, for instance Acceptance Speach, Documentary, Press Release etc.
domain: Prize File
range: File Type
type: Property
range: Resource
range: Concept
domain: Resource
domain: Document

prizeFile
range: Thing
domain: Thing
type: ObjectProperty
comment: Points to an PrizeFile, that is some form of media related to the Nobel Prize.
domain: Nobel Prize
range: Prize File
type: Property
range: Resource
range: Document
domain: Award
domain: Resource

awardFile
range: Thing
domain: Thing
type: ObjectProperty
comment: Points to an AwardFile, that is some form of media related to the award for this laureate.
domain: Laureate Award
range: Award File
type: Property
range: Resource
range: Document
domain: Resource
domain: Award

university
range: Thing
domain: Thing
type: ObjectProperty
comment: Points to the universities the Laureate was affiliated with during the period he did his contribution that laid the ground for the award.
domain: Laureate Award
range: University
type: Property
range: Resource
domain: Resource
domain: Award

Litterature
type: Nobel Prize category
type: Thing
type: Concept

File Type
subclass of: Resource
subclass of: Thing
type: Class
comment: A file type indicates the nature of a prizeFile, for instance Acceptance Speach, Documentary, Press Release etc.
subclass of: Concept

laureateAward
range: Thing
domain: Thing
type: ObjectProperty
comment: Connects each laureate with the part of the Nobel Prize, that is the LaureateAward, he or she recieved.
domain: Laureate
range: Laureate Award
sub property of: Award
type: Property
range: Resource
range: Award
domain: Agent
domain: Resource

Nobel Prize category
subclass of: Thing
subclass of: Resource
type: Class
comment: The Nobel Prize is given in six different categories.
subclass of: Concept
one of: http://lodlaundromat.org/.well-known/genid/c9f36f310fa6c88159771bfc6778c1f6#1

category
range: Thing
domain: Thing
type: ObjectProperty
comment: The category this Nobel Prize belongs to.
domain: Nobel Prize
range: Nobel Prize category
type: Property
range: Concept
range: Resource
domain: Award
domain: Resource

nobelPrize
range: Thing
domain: Thing
type: ObjectProperty
comment: Points to the Nobel Prize recieved by a Laureate.
domain: Laureate
range: Nobel Prize
sub property of: Award
type: Property
range: Resource
range: Award
domain: Agent
domain: Resource

Laureate Award
subclass of: Thing
subclass of: Resource
type: Class
comment: The Nobel Prize is often divided to several laureates. LaureateAward captures the details of the award given to each laureate, such as share of the Nobel Prize, motivation etc.
subclass of: Award

share
type: DatatypeProperty
comment: The share of a Nobel Prize given to a Laureate, may be 1, 2 or 4 corresponding to the whole prize, half the prize and a quarter of the prize.
domain: LaureateAward
range: Integer
type: Property
range: Resource
domain: Resource

motivation
type: DatatypeProperty
comment: The motivation for why the laureate was given the Nobel Prize.
domain: Laureate Award
range: PlainLiteral
type: Property
range: Resource
domain: Resource
domain: Award
domain: Thing

field
type: DatatypeProperty
comment: The field within the category the Nobel Prize was awarded for.
domain: LaureateAward
range: PlainLiteral
type: Property
range: Resource
domain: Resource

contribution
type: DatatypeProperty
comment: The contribution for which the laureate was given the Nobel Prize.
domain: Laureate Award
range: PlainLiteral
type: Property
range: Resource
domain: Resource
domain: Award
domain: Thing

year
type: DatatypeProperty
comment: The year a given Nobel Prize was given.
domain: Award
range: Integer
type: Property
range: Resource
domain: Resource

Nobelprize.org

Linked Nobelprizes
description: Linked Nobelprizes
type: Ontology
version info: version 0.1