Geographic coverage
type: Property
id: geographicCoverage
comment: Type in here the exact geographic names/places that are covered by the data. Add Countries names only if the data displayed is really about the entire country. Example of locations/places are lakes, rivers, cities, marine areas, glaciers, bioregions like alpine region etc.
domain: Data

Contact person(s) for EEA
type: Property
id: contact
comment: Outside person to be contacted by EEA if questions regarding the data resource arise at a later date, responsible project manager at EEA.
domain: Data

Scale of the dataset
type: Property
id: scale
comment: Gives a rough value of accuracy for the GIS dataset. Example: 1:1000
domain: Data

EEA Management Plan
type: Property
id: eeaManagementPlan
comment: EEA Management plan code.
domain: Data

point
subclass of: Resource
type: Class
subclass of: SpatialThing
comment: A point, typically described using a coordinate system relative to Earth, such as WGS84.
comment: Uniquely identified by lat/long/alt. i.e. spaciallyIntersects(P1, P2) :- lat(P1, LAT), long(P1, LONG), alt(P1, ALT), lat(P2, LAT), long(P2, LONG), alt(P2, ALT). sameThing(P1, P2) :- type(P1, Point), type(P2, Point), spaciallyIntersects(P1, P2).

Themes
type: Property
id: themes
comment: Choose max 3 themes
domain: Data

Source
type: Property
id: dataSource
comment: A reference to a resource from which the present resource is derived. Details such exact body or department, date of delivery, original database, table or GIS layer, scientific literature..
domain: Data

Short ID
type: Property
id: shortId
comment: Short ID description.
domain: Data

Owner
type: Property
id: dataOwner
comment: An entity or set of entities that owns the resource. The owner is responsible for the reliability of the resource.
domain: Data

Environmental reporting obligations (ROD)
type: Property
id: reportingObligations
comment: The environmental reporting obligations used to optain the data. Reporting obligations are requirements to provide information agreed between countries and international bodies such as the EEA or international conventions.
domain: Data

Hide Workflow Steps Trail Viewlet
type: Property
id: disableProgressTrailViewlet
comment: Hide Workflow Steps Trail viewlet for this context/page
domain: Data

Last upload
type: Property
id: lastUpload
comment: Date when the data resource was last uploaded in EEA data service. If not manually provided it will coincide with publishing date. It can later be used when a dataset is re-uploaded due to corrections and when a whole new version is not necessary.
domain: Data

SpatialThing
subclass of: Resource
type: Class
comment: Anything with spatial extent, i.e. size, shape, or position. e.g. people, places, bowling balls, as well as abstract areas like cubes.

Force Disable Autolinks
type: Property
id: forcedisableautolinks
comment: Disable Autolinks for this context/page
domain: Data

Coordinate reference system
type: Property
id: referenceSystem
comment: Coordinate reference system used for the GIS dataset. Example: Lambert Azimutal
domain: Data

Additional information
type: Property
id: moreInfo
comment: Other relevant information.
domain: Data

label_short_name
type: Property
id: id
comment: help_shortname
domain: Data

Temporal coverage
type: Property
id: temporalCoverage
comment: The temporal scope of the content of the data resource. Temporal coverage will typically include a set of years or time ranges.
domain: Data

France
type: SpatialThing
latitude: 46.0
longitude: 2.0

Exclude from Table of Contents
type: Property
id: tocExclude
comment: Type id of what do you want to exclude.
domain: Data

Netherlands
type: SpatialThing
latitude: 52.5
longitude: 5.75

Bulgaria
type: SpatialThing
latitude: 43.0
longitude: 25.0

Data
type: DynamicViewTypeInformation
id: Data
comment: Data type is a named collection of data that contains individual data units organized (formatted) in a specific way. It contains one or more data files in different formats like mdb, csv/tsv, shape files, geotiff, xml etc.
type: Class

Ireland
type: SpatialThing
latitude: 53.0
longitude: -8.0

Sweden
type: SpatialThing
latitude: 62.0
longitude: 15.0

Finland
type: SpatialThing
latitude: 64.0
longitude: 26.0

PDF Maximum depth
type: Property
id: pdfMaxDepth
comment: Maximum depth to recursively include children items while generating PDF. Leave it empty to use the portal global defined value.
domain: Data

Malta
type: SpatialThing
latitude: 35.916668
longitude: 14.433333

latitude
type: Property
domain: SpatialThing
comment: The WGS84 latitude of a SpatialThing (decimal degrees).
domain: Resource

Belgium
type: SpatialThing
latitude: 50.833332
longitude: 4.0

PDF cover main image
type: Property
id: coverImage
comment: Main cover image that will show up on the pdf cover page
domain: Data

Hungary
type: SpatialThing
latitude: 47.0
longitude: 20.0

Geographic accuracy
type: Property
id: geoAccuracy
comment: It is applicable to GIS datasets. It indicates the geographic accuracy of location, ground distance as a value in meters.
domain: Data

Spain
type: SpatialThing
latitude: 40.0
longitude: -4.0

Natura 2000 data - the European network of protected sites
Geographic coverage: ee
object provides: Products.CMFPlone.interfaces.constrains.ISelectableConstrainTypes
is replaced by: natura-2
Geographic coverage: ro
creator: EEA
object provides: Products.NavigationManager.sections.interfaces.INavigationSectionPositionable
object provides: Acquisition.interfaces.IAcquirer
spatial: Estonia
object provides: Products.Archetypes.interfaces.base.IBaseObject
object provides: OFS.interfaces.ICopySource
object provides: plone.uuid.interfaces.IUUIDAware
object provides: App.interfaces.INavigation
spatial: Malta
object provides: eea.cache.subtypes.interfaces.ICacheAware
Themes: biodiversity
spatial: United Kingdom
object provides: eea.geotags.storage.interfaces.IGeoTaggable
object provides: eea.promotion.interfaces.IPromotable
Hide Workflow Steps Trail Viewlet: False
object provides: Products.CMFCore.interfaces._content.IDynamicType
spatial: Cyprus
object provides: eea.alchemy.interfaces.IAlchemyDiscoverable
Geographic coverage: gb
spatial: Portugal
is replaced by: natura-4
spatial: France
object provides: Products.Archetypes.interfaces.base.IBaseContent
Geographic coverage: mt
spatial: Latvia
object provides: Products.EEAContentTypes.interfaces.IEEAPossibleContent
object provides: OFS.interfaces.ITraversable
object provides: eea.facetednavigation.subtypes.interfaces.IPossibleFacetedNavigable
creator: staromar
object provides: zope.annotation.interfaces.IAttributeAnnotatable
object provides: plone.locking.interfaces.ITTWLockable
object provides: Products.CMFCore.interfaces._content.IWorkflowAware
is replaced by: natura-3
object provides: webdav.interfaces.IDAVResource
description: Natura 2000 is the key instrument to protect biodiversity in the European Union. It is an ecological network of protected areas, set up to ensure the survival of Europe's most valuable species and habitats. Natura 2000 is based on the 1979 Birds Directive and the 1992 Habitats Directive. The green infrastructure it provides safeguards numerous ecosystem services and ensures that Europe's natural systems remain healthy and resilient.
has part: natura-2000-public-spatial-data
object provides: OFS.interfaces.IOrderedContainer
spatial: Denmark
object provides: plone.folder.interfaces.IOrderableFolder
object provides: Products.ATContentTypes.interfaces.folder.IATBTreeFolder
Geographic coverage: bg
Geographic coverage: es
spatial: Luxembourg
Geographic coverage: pl
object provides: Products.CMFCore.interfaces._content.IMutableMinimalDublinCore
Themes: landuse
spatial: Sweden
Last upload: 2011-03-21T23:00:00Z
object provides: eea.relations.content.interfaces.IBaseObject
Geographic coverage: gr
Contact person(s) for EEA: Outside contact: Danny CHARBONNEAU, Danny.CHARBONNEAU@ec.europa.eu In-house contact: Rania Spyropoulou, Rania.Spyropoulou@eea.europa.eu Operator: Marek Staron, Marek.Staron@eea.europa.eu
object provides: plone.portlets.interfaces.ILocalPortletAssignable
object provides: collective.quickupload.interfaces.IQuickUploadCapable
spatial: Bulgaria
object provides: eea.progressbar.interfaces.IBaseObject
spatial: Poland
object provides: OFS.interfaces.IFindSupport
object provides: App.interfaces.IUndoSupport
Geographic coverage: pt
object provides: Products.CMFCore.interfaces._content.IOpaqueItemManager
spatial: Italy
has part: natura-2000-public-microsoft-access-database-10-tables
spatial: Slovakia
Geographic coverage: nl
object provides: OFS.interfaces.IPropertyManager
Source: Unit Nature & Biodiversity, DG Environment, European Commission
Short ID: 1112
object provides: plone.app.folder.folder.IATUnifiedFolder
object provides: Products.Archetypes.interfaces.metadata.IExtensibleMetadata
object provides: Products.Archetypes.interfaces.base.IBaseFolder
spatial: Czech Republic
has part: inspire-compliant-metadata-set
object provides: plone.app.imaging.interfaces.IBaseObject
Geographic coverage: fr
spatial: Lithuania

PDF Maximum items
type: Property
id: pdfMaxItems
comment: Total maximum children items to be includedwhile generating PDF. Leave it empty to use the portal global defined value.
domain: Data

location
type: Property
range: SpatialThing
sub property of: based near
comment: The relation between something and the point, or other geometrical thing in space, where it is. For example, the realtionship between a radio tower and a Point with a given lat and long. Or a relationship between a park and its outline as a closed arc of points, or a road and its location as a arc (a sequence of points). Clearly in practice there will be limit to the accuracy of any such statement, but one would expect an accuracy appropriate for the size of the object and uses such as mapping
range: Resource

Processor
type: Property
id: processor
comment: The technical producer or processor of the resource.
domain: Data

External links, non EEA websites
type: Property
id: externalRelations
comment: External links, non EEA websites. Please write http:// in front of the links.
domain: Data

Estonia
type: SpatialThing
latitude: 59.0
longitude: 26.0

Luxembourg
type: SpatialThing
latitude: 49.75
longitude: 6.1666665

PDF Maximum breadth
type: Property
id: pdfMaxBreadth
comment: Maximum breadth to include children items while generating PDF. Leave it empty to use the portal global defined value.
domain: Data

Slovenia
type: SpatialThing
latitude: 46.25
longitude: 15.166667

Geographic coverage
type: Property
id: location
comment: Type in here the exact geographic names/places that are covered by the data. Add Countries names only if the data displayed is really about the entire country. Example of locations/places are lakes, rivers, cities, marine areas, glaciers, bioregions like alpine region etc.
domain: Data

longitude
type: Property
domain: SpatialThing
comment: The WGS84 longitude of a SpatialThing (decimal degrees).
domain: Resource

Denmark
type: SpatialThing
latitude: 56.0
longitude: 10.0

Lithuania
type: SpatialThing
latitude: 56.0
longitude: 24.0

PDF Theme
type: Property
id: pdfTheme
comment: Disable PDF export or override theme used to export this content as PDF.
domain: Data

workflow state progress
progress level: 100
type: DetailedProgressStatus

altitude
type: Property
domain: SpatialThing
comment: The WGS84 altitude of a SpatialThing (decimal meters above the local reference ellipsoid).
domain: Resource

Slovakia
type: SpatialThing
latitude: 48.666668
longitude: 19.5

WGS84 Geo Positioning: an RDF vocabulary
description: A vocabulary for representing latitude, longitude and altitude information in the WGS84 geodetic reference datum. Version $Id: wgs84_pos.rdf,v 1.22 2009/04/20 15:00:30 timbl Exp $. See http://www.w3.org/2003/01/geo/ for more details.
date: $Date: 2009/04/20 15:00:30 $
label: geo
comment: Recent changes to this namespace: $Log: wgs84_pos.rdf,v $ Revision 1.22 2009/04/20 15:00:30 timbl Remove the time bits which have been deal with elsewhere eg in iCal. Revision 1.21 2009/04/20 12:52:47 timbl try again Revision 1.20 2009/04/20 12:42:11 timbl Add Event (edited ages ago and never checked in), and location (following discussion http://chatlogs.planetrdf.com/swig/2009-04-20#T12-36-09) Revision 1.19 2009/04/20 12:36:31 timbl Add Event (edited ages ago and never checked in), and location (following discussion http://chatlogs.planetrdf.com/swig/2009-04-20#T12-36-09) Revision 1.18 2006/02/01 22:01:04 danbri Clarified that lat and long are decimal degrees, and that alt is decimal metres about local reference ellipsoid Revision 1.17 2004/02/06 17:38:12 danbri Fixed a bad commit screwup Revision 1.15 2003/04/19 11:24:08 danbri Fixed the typo even more. Revision 1.14 2003/04/19 11:16:56 danbri fixed a typo Revision 1.13 2003/02/19 22:27:27 connolly relaxed domain constraints on lat/long/alt from Point to SpatialThing Revision 1.12 2003/01/12 01:41:41 danbri Trying local copy of XSLT doc. Revision 1.11 2003/01/12 01:20:18 danbri added a link to morten's xslt rdfs viewer. Revision 1.10 2003/01/11 18:56:49 danbri Removed datatype range from lat and long properties, since they would have required each occurance of the property to mention the datatype. Revision 1.9 2003/01/11 11:41:31 danbri Another typo; repaired rdfs:Property to rdf:Property x4 Revision 1.8 2003/01/11 11:05:02 danbri Added an rdfs:range for each lat/long/alt property, http://www.w3.org/2001/XMLSchema#float Revision 1.7 2003/01/10 20:25:16 danbri Longer rdfs:comment for Point, trying to be Earth-centric and neutral about coordinate system(s) at the same time. Feedback welcomed. Revision 1.6 2003/01/10 20:18:30 danbri Added CVS log comments into the RDF/XML as an rdfs:comment property of the vocabulary. Note that this is not common practice (but seems both harmless and potentially useful). revision 1.…

Greece
type: SpatialThing
latitude: 39.0
longitude: 22.0

label_description
type: Property
id: description
comment: help_description
domain: Data

Table of contents depth level
type: Property
id: tocdepth
comment: Which header tags should be taken into consideration for the table of contents.
domain: Data

Unit
type: Property
id: units
comment: Describes the unit(s) taken in account for the measurement values(s) of the data resource.
domain: Data

Portugal
type: SpatialThing
latitude: 39.5
longitude: -8.0

Czech Republic
type: SpatialThing
latitude: 49.75
longitude: 15.0

Latvia
type: SpatialThing
latitude: 57.0
longitude: 25.0

Related items
type: Property
id: relatedItems
comment: Specify relations to other content within Plone.
domain: Data

Romania
type: SpatialThing
latitude: 46.0
longitude: 25.0

Germany
type: SpatialThing
latitude: 51.5
longitude: 10.5

Title
type: Property
id: title
domain: Data

Poland
type: SpatialThing
latitude: 52.0
longitude: 20.0

Cyprus
type: SpatialThing
latitude: 35.0
longitude: 33.0

lat/long
type: Property
comment: A comma-separated representation of a latitude, longitude coordinate.

Italy
type: SpatialThing
latitude: 42.833332
longitude: 12.833333

United Kingdom
type: SpatialThing
latitude: 54.758446
longitude: -2.6953115

Disclaimer
type: Property
id: disclaimer
comment: Disclaimer description.
domain: Data

Methodology
type: Property
id: methodology
comment: Description of how the resource was compiled: used tools, applied procedures, additional information to understand the data, further references to used methodologies.
domain: Data